SMARTBox,FEM,tail,TPM,fibre port,pass/fail,FEM state,FEM current,TPM lit,fibre lit,chanX,powerX,attenX,chanY,powerY,attenY
1,1,1,8,16,PASS,FC40,322,8,16,15,11.99034051,24,14,12.15201114,24
1,2,2,8,10,PASS,FC40,354,8,10,2,13.02463658,24,3,16.2477314,24
1,3,3,7,10,PASS,FC40,387,7,10,2,12.72904304,24,3,16.27539864,24
1,4,4,8,11,PASS,FC40,306,8,11,4,15.21474343,24,5,14.18287532,24
1,5,5,8,14,PASS,FC40,322,8,14,11,12.67005915,24,10,15.45744332,24
1,6,6,8,13,PASS,FC40,354,8,13,9,13.91903562,24,8,13.20533811,24
1,7,7,8,15,PASS,FC40,387,8,15,13,14.460442,24,12,17.12672266,24
1,8,8,8,9,PASS,FC40,322,8,9,0,15.37222848,24,1,15.1417905,24
1,9,9,8,12,PASS,FC40,338,8,12,6,17.45398367,24,7,21.15649339,24
1,10,10,7,9,PASS,FC40,354,7,9,0,13.67518001,24,1,13.57703095,24
2,1,1,7,15,FAIL,FC40,354,7,15,13,2.742609453,24,12,13.5515318,24
2,2,2,7,14,PASS,FC40,354,7,14,11,17.40652049,24,10,13.96712677,24
2,3,3,7,16,PASS,FC40,354,7,16,15,12.96576396,24,14,11.77199763,24
2,4,4,7,13,PASS,FC40,387,7,13,9,15.24605826,24,8,11.90173862,24
2,5,5,6,13,PASS,FC40,371,6,13,9,22.81832919,24,8,15.29007057,24
2,6,6,6,10,PASS,FC40,371,6,10,2,16.35616883,24,3,10.6655682,24
2,7,7,6,11,PASS,FC40,354,6,11,4,13.45173307,24,5,13.1454463,24
2,8,8,6,12,PASS,FC40,354,6,12,6,11.67174119,24,7,12.63581412,24
2,9,9,6,9,PASS,FC40,387,6,9,0,14.94238896,24,1,14.70460494,24
2,10,10,7,12,PASS,FC40,338,7,12,6,14.21416847,24,7,14.10710248,24
2,11,11,7,11,FAIL,FC40,371,7,11,4,0.7103338145,24,5,0.9610170964,24
3,1,1,5,12,PASS,FC40,387,5,12,6,9.832345544,24,7,12.3935682,24
3,2,2,5,9,PASS,FC40,354,5,9,0,10.9465744,24,1,9.593364421,24
3,3,3,5,15,PASS,FC40,371,5,15,13,13.58346665,24,12,12.55892226,24
3,4,4,6,16,PASS,FC40,403,6,16,15,12.1601436,24,14,14.20363787,24
3,5,5,6,15,PASS,FC40,354,6,15,13,11.69493932,24,12,11.28610219,24
3,6,6,5,16,PASS,FC40,338,5,16,15,11.05238275,24,14,16.13545791,24
3,7,7,5,10,PASS,FC40,338,5,10,2,9.671472434,24,3,9.850900727,24
3,8,8,5,14,PASS,FC40,371,5,14,11,14.01936486,24,10,12.50013148,24
3,9,9,5,11,PASS,FC40,354,5,11,4,13.50427763,24,5,15.87952734,24
3,10,10,6,14,FAIL,FC80,0,6,14,11,0.7845669094,24,10,0.8292281069,24
3,11,11,5,13,PASS,FC40,387,5,13,9,16.35026793,24,8,15.72034451,24
4,1,1,6,1,FAIL,FC40,290,6,1,16,75.7204294,24,17,4.012710163,24
4,2,2,6,3,PASS,FC40,338,6,3,20,14.08099995,24,21,13.53157518,24
4,3,3,5,7,PASS,FC40,387,5,7,29,14.4451842,24,28,12.53168709,24
4,4,4,6,2,PASS,FC40,354,6,2,18,14.80642058,24,19,15.22920687,24
4,5,5,5,2,FAIL,FC80,0,5,2,18,0.9409063654,24,19,0.8791846467,24
4,6,6,5,8,PASS,FC40,371,5,8,31,13.76066299,24,30,12.0883241,24
4,7,7,5,4,PASS,FC40,371,5,4,22,13.09629453,24,23,13.63438143,24
4,8,8,5,3,PASS,FC40,354,5,3,20,14.39897487,24,21,12.92169753,24
4,9,9,5,1,FAIL,FC80,32,5,1,16,0.9986410386,24,17,0.8361360986,24
4,10,10,5,5,PASS,FC40,354,5,5,25,11.32021785,24,24,15.05269146,24
4,11,11,5,6,PASS,FC40,387,5,6,27,8.531495415,24,26,5.378945819,24
5,1,1,15,7,PASS,FC40,306,15,7,29,17.15799158,24,28,17.29524696,24
5,2,2,16,5,PASS,FC40,338,16,5,25,45.41394345,24,24,36.39083962,24
5,3,3,15,8,PASS,FC40,338,15,8,31,15.13662021,24,30,13.36822217,24
5,4,4,16,1,PASS,FC40,338,16,1,16,11.0965627,24,17,12.06474781,24
5,5,5,16,8,PASS,FC40,371,16,8,31,14.25237832,24,30,15.35918895,24
5,6,6,15,6,PASS,FC40,371,15,6,27,11.46895754,24,26,12.25514607,24
5,7,7,16,7,PASS,FC40,354,16,7,29,15.72561135,24,28,13.69612457,24
5,8,8,16,4,PASS,FC40,338,16,4,22,10.00135555,24,23,11.94625782,24
5,9,9,16,3,PASS,FC40,371,16,3,20,10.56356628,24,21,11.14265051,24
5,10,10,16,6,PASS,FC40,387,16,6,27,12.35752839,24,26,13.56371657,24
5,11,11,16,2,PASS,FC40,322,16,2,18,13.22732093,24,19,13.50420298,24
6,1,1,14,2,PASS,FC40,322,14,2,18,13.87211982,24,19,11.72061903,24
6,2,2,13,6,PASS,FC40,403,13,6,27,13.04311724,24,26,15.34657781,24
6,3,11,13,2,PASS,FC40,354,13,2,18,18.12620114,24,19,15.36859361,24
6,4,4,13,7,PASS,FC40,419,13,7,29,12.13857906,24,28,15.89777785,24
6,5,5,13,3,PASS,FC40,354,13,3,20,14.16130245,24,21,15.56764805,24
6,6,6,13,8,PASS,FC40,322,13,8,31,13.09334122,24,30,11.58668818,24
6,7,7,13,5,PASS,FC40,387,13,5,25,16.80089782,24,24,14.65828858,24
6,8,8,14,1,PASS,FC40,371,14,1,16,17.89990155,24,17,13.75067963,24
6,9,9,13,4,PASS,FC40,387,13,4,22,12.05659347,24,23,11.95285039,24
6,10,10,16,9,PASS,FC40,371,16,9,0,15.19515057,24,1,16.34991587,24
6,11,12,15,3,PASS,FC40,387,15,3,20,12.29440492,24,21,13.91271432,24
7,1,1,15,11,PASS,FC40,338,15,11,4,12.34207961,24,5,11.73244519,24
7,2,2,16,13,FAIL,FC80,0,16,13,9,0.9117364067,24,8,0.3168892736,24
7,3,3,16,14,PASS,FC40,306,16,14,11,12.14324507,24,10,13.70723126,24
7,4,4,16,12,PASS,FC40,371,16,12,6,11.74987939,24,7,11.08497292,24
7,5,5,16,11,FAIL,FC40,338,16,11,4,0.8396640644,24,5,0.8410825214,24
7,6,6,15,10,PASS,FC40,371,15,10,2,12.05424625,24,3,17.32054595,24
7,7,7,16,10,PASS,FC40,371,16,10,2,12.19726812,24,3,13.13201114,24
7,8,8,16,16,PASS,FC40,338,16,16,15,14.76193177,24,14,13.94735756,24
7,9,9,15,12,PASS,FC40,387,15,12,6,12.97773585,24,7,14.77365382,24
7,10,10,16,15,PASS,FC40,290,16,15,13,26.29844948,24,12,23.11361985,24
7,11,11,15,9,PASS,FC40,322,15,9,0,10.70103539,24,1,11.76667892,24
8,1,1,15,5,PASS,FC40,403,15,5,25,17.21723637,24,24,16.19292605,24
8,2,2,15,2,PASS,FC40,354,15,2,18,31.13907985,24,19,16.62798766,24
8,3,3,15,4,PASS,FC40,322,15,4,22,13.32495327,24,23,12.00396279,24
8,4,4,14,6,PASS,FC40,338,14,6,27,14.67987909,24,26,15.63923912,24
8,5,5,14,4,PASS,FC40,403,14,4,22,14.20184887,24,23,16.03581068,24
8,6,6,15,1,PASS,FC40,403,15,1,16,15.8924747,24,17,14.38944772,24
8,7,7,14,5,PASS,FC40,387,14,5,25,16.02590525,24,24,17.43595803,24
8,8,8,14,3,PASS,FC40,322,14,3,20,9.870281852,24,21,11.38220908,24
8,9,9,14,7,PASS,FC40,371,14,7,29,15.13172281,24,28,15.23507279,24
8,10,10,14,8,PASS,FC40,403,14,8,31,16.37662937,24,30,17.80407132,24
9,1,1,11,12,PASS,FC40,338,11,12,6,12.8118759,24,7,13.5621446,24
9,2,2,10,12,PASS,FC40,322,10,12,6,12.73166551,24,7,12.84731682,24
9,3,3,11,13,PASS,FC40,354,11,13,9,14.59016465,24,8,11.71588167,24
9,4,4,11,9,PASS,FC40,387,11,9,0,14.95301617,24,1,14.37308931,24
9,5,5,11,14,PASS,FC40,371,11,14,11,12.97801356,24,10,13.27472689,24
9,6,6,10,13,PASS,FC40,387,10,13,9,23.61982128,24,8,14.8838891,24
9,7,7,10,14,PASS,FC40,354,10,14,11,10.5539592,24,10,9.362453864,24
9,8,8,10,16,PASS,FC40,322,10,16,15,24.73321638,24,14,18.34120812,24
9,9,9,10,15,PASS,FC40,354,10,15,13,14.39461794,24,12,14.18279973,24
9,10,10,11,11,PASS,FC40,354,11,11,4,12.07319218,24,5,13.68668569,24
9,11,11,11,10,PASS,FC40,338,11,10,2,19.3549161,24,3,17.15556425,24
10,1,1,2,2,PASS,FC40,354,2,2,18,14.45254748,24,19,14.56343815,24
10,2,2,2,3,PASS,FC40,371,2,3,20,16.46497418,24,21,11.8063474,24
10,3,3,3,7,PASS,FC40,371,3,7,29,18.17783145,24,28,14.80362713,24
10,4,4,2,5,PASS,FC40,354,2,5,25,15.85027982,24,24,14.37212133,24
10,5,5,3,6,PASS,FC40,354,3,6,27,15.29704337,24,26,15.41504919,24
10,6,6,3,3,PASS,FC40,371,3,3,20,8.947948695,24,21,11.33013373,24
10,7,7,2,4,PASS,FC40,322,2,4,22,13.39686983,24,23,11.86311142,24
10,8,8,3,8,PASS,FC40,371,3,8,31,13.58982484,24,30,15.11216949,24
10,9,9,3,4,PASS,FC40,338,3,4,22,12.91042598,24,23,15.21031801,24
10,10,10,3,5,PASS,FC40,354,3,5,25,13.23591029,24,24,13.93436086,24
10,11,11,2,1,PASS,FC40,387,2,1,16,15.47375224,24,17,12.92003661,24
11,1,1,4,7,PASS,FC40,354,4,7,29,12.54104763,24,28,14.32742111,24
11,2,2,4,5,PASS,FC40,354,4,5,25,21.2388133,24,24,21.86309383,24
11,3,3,4,1,PASS,FC40,354,4,1,16,15.37001258,24,17,16.82972949,24
11,4,4,4,6,PASS,FC40,419,4,6,27,17.17394406,24,26,12.49987196,24
11,5,5,4,4,PASS,FC40,322,4,4,22,6.965907742,24,23,7.572102841,24
11,6,6,4,8,PASS,FC40,338,4,8,31,15.81841984,24,30,13.36620404,24
11,7,7,4,2,PASS,FC40,354,4,2,18,21.74054632,24,19,14.27269112,24
11,8,11,4,3,PASS,FC40,387,4,3,20,16.09215495,24,21,14.35971551,24
11,9,12,3,2,PASS,FC40,387,3,2,18,13.57736092,24,19,14.16689788,24
11,10,10,3,1,PASS,FC40,371,3,1,16,14.18153529,24,17,15.0037411,24
12,1,1,9,10,PASS,FC40,354,9,10,2,11.65507115,24,3,10.02817949,24
12,2,2,9,16,PASS,FC40,354,9,16,15,25.71513896,24,14,12.06789848,24
12,3,3,9,11,PASS,FC40,354,9,11,4,14.52567478,24,5,15.43975087,24
12,4,4,9,9,PASS,FC40,354,9,9,0,12.03706779,24,1,15.03594634,24
12,5,5,9,13,PASS,FC40,322,9,13,9,13.24534576,24,8,11.02186379,24
12,6,12,10,10,PASS,FC40,338,10,10,2,11.44457196,24,3,12.60093353,24
12,7,7,10,11,PASS,FC40,371,10,11,4,14.32777401,24,5,12.92752286,24
12,8,8,9,15,PASS,FC40,322,9,15,13,15.80335866,24,12,14.27285171,24
12,9,9,9,12,PASS,FC40,354,9,12,6,12.67333868,24,7,11.09584424,24
12,10,10,10,9,PASS,FC40,322,10,9,0,15.86347346,24,1,16.59537283,24
12,11,11,9,14,PASS,FC40,322,9,14,11,11.19634467,24,10,13.10701958,24
13,1,1,12,9,PASS,FC40,354,12,9,0,11.62324562,24,1,11.97857861,24
13,2,2,12,10,PASS,FC40,387,12,10,2,14.35772169,24,3,13.44250496,24
13,3,3,12,14,PASS,FC40,371,12,14,11,13.77067252,24,10,13.91900315,24
13,4,4,12,15,PASS,FC40,387,12,15,13,13.41461019,24,12,12.43239928,24
13,5,5,9,1,PASS,FC40,371,9,1,16,14.05964576,24,17,15.27922592,24
13,6,6,12,13,PASS,FC40,371,12,13,9,12.44402925,24,8,14.04787093,24
13,7,7,12,12,PASS,FC40,387,12,12,6,9.745644944,24,7,10.41138123,24
13,8,8,12,16,PASS,FC40,354,12,16,15,13.07872094,24,14,12.11392574,24
13,9,9,11,16,PASS,FC40,354,11,16,15,16.51790349,24,14,11.6092979,24
13,10,10,11,15,PASS,FC40,338,11,15,13,15.76811345,24,12,15.77185509,24
13,11,11,12,11,PASS,FC40,387,12,11,4,7.213310536,24,5,13.89206722,24
14,1,12,9,6,PASS,FC40,322,9,6,27,8.098739439,24,26,4.860718213,24
14,2,2,9,3,PASS,FC40,371,9,3,20,13.68573463,24,21,16.85083305,24
14,3,3,10,5,PASS,FC40,371,10,5,25,17.36422813,24,24,14.82811938,24
14,4,4,9,8,PASS,FC40,371,9,8,31,11.51231788,24,30,10.34087163,24
14,5,5,9,5,PASS,FC40,338,9,5,25,15.67927637,24,24,16.60532013,24
14,6,6,9,7,PASS,FC40,371,9,7,29,15.1055557,24,28,13.87036938,24
14,7,7,10,7,PASS,FC40,354,10,7,29,14.25808894,24,28,15.65950428,24
14,8,8,10,8,PASS,FC40,371,10,8,31,11.52448137,24,30,8.268735962,24
14,9,9,9,2,PASS,FC40,371,9,2,18,12.22574043,24,19,13.27792877,24
14,10,10,10,6,PASS,FC40,354,10,6,27,13.42021382,24,26,15.56539186,24
14,11,11,9,4,PASS,FC40,354,9,4,22,19.05289974,24,23,13.96384774,24
15,1,1,11,8,PASS,FC40,354,11,8,31,16.5241851,24,30,17.14977957,24
15,2,2,11,6,PASS,FC40,354,11,6,27,24.89023991,24,26,16.71286824,24
15,3,3,10,2,PASS,FC40,435,10,2,18,15.72431884,24,19,15.07874949,24
15,4,4,10,4,FAIL,FC80,0,10,4,22,0.9618408932,24,23,0.6042137222,24
15,5,11,11,3,PASS,FC40,338,11,3,20,14.16299575,24,21,11.97287893,24
15,6,6,10,3,PASS,FC40,354,10,3,20,15.16115682,24,21,14.79643802,24
15,7,7,11,5,PASS,FC40,354,11,5,25,10.79407904,24,24,11.60500836,24
15,8,8,10,1,PASS,FC40,322,10,1,16,14.80619689,24,17,13.5603512,24
15,9,9,11,7,PASS,FC40,419,11,7,29,12.28242712,24,28,12.22049351,24
15,10,10,11,4,PASS,FC40,387,11,4,22,13.44346043,24,23,13.84170989,24
16,1,1,12,4,PASS,FC40,354,12,4,22,15.5361534,24,23,12.38752181,24
16,2,2,12,7,PASS,FC40,371,12,7,29,19.40968203,24,28,8.91677129,24
16,3,3,12,2,PASS,FC40,371,12,2,18,17.87039557,24,19,13.16904673,24
16,4,4,12,6,PASS,FC40,354,12,6,27,8.601339868,24,26,5.026053254,24
16,5,5,13,1,PASS,FC40,371,13,1,16,11.47900595,24,17,14.35513964,24
16,6,6,11,1,PASS,FC40,387,11,1,16,16.24999575,24,17,18.12404738,24
16,7,7,12,3,PASS,FC40,354,12,3,20,11.14705662,24,21,13.55074808,24
16,8,8,11,2,PASS,FC40,387,11,2,18,13.12965936,24,19,12.74208657,24
16,9,9,12,8,PASS,FC40,354,12,8,31,13.57033781,24,30,14.39297608,24
16,10,10,12,5,FAIL,FC40,0,12,5,25,0.8941400257,24,24,0.3648941328,24
16,11,11,12,1,PASS,FC40,354,12,1,16,12.2905553,24,17,12.74435639,24
17,1,1,14,9,PASS,FC40,371,14,9,0,14.06849153,24,1,16.0895621,24
17,2,2,14,14,PASS,FC40,387,14,14,11,14.19562899,24,10,13.97219991,24
17,3,3,15,16,PASS,FC40,387,15,16,15,12.75384564,24,14,15.28697692,24
17,4,4,14,11,PASS,FC40,371,14,11,4,13.78621172,24,5,16.3365556,24
17,5,5,14,13,PASS,FC40,387,14,13,9,17.52138362,24,8,13.50617206,24
17,6,6,15,13,PASS,FC40,371,15,13,9,13.3497361,24,8,13.94636146,24
17,7,7,15,15,PASS,FC40,354,15,15,13,14.56039231,24,12,14.69381385,24
17,8,8,14,12,PASS,FC40,354,14,12,6,14.98637196,24,7,15.33214056,24
17,9,9,15,14,PASS,FC40,387,15,14,11,14.18852934,24,10,16.21793491,24
17,10,10,14,10,PASS,FC40,419,14,10,2,13.47633857,24,3,14.68070225,24
18,1,1,6,8,PASS,FC40,322,6,8,31,5.627229393,24,30,5.259062884,24
18,2,2,7,2,PASS,FC40,403,7,2,18,14.73031118,24,19,12.90008541,24
18,3,3,6,6,PASS,FC40,354,6,6,27,10.87174307,24,26,10.3425128,24
18,4,4,6,4,PASS,FC40,387,6,4,22,12.8119627,24,23,12.12906819,24
18,5,5,7,3,PASS,FC40,435,7,3,20,12.85136103,24,21,13.28287394,24
18,6,6,6,5,PASS,FC40,387,6,5,25,14.21582254,24,24,12.82072581,24
18,7,7,7,1,PASS,FC40,354,7,1,16,12.28509023,24,17,13.05044156,24
18,8,8,7,4,PASS,FC40,387,7,4,22,11.2455782,24,23,13.15904345,24
18,9,9,7,5,PASS,FC40,371,7,5,25,10.59956347,24,24,11.86802021,24
18,10,10,6,7,PASS,FC40,435,6,7,29,17.60358432,24,28,14.51813534,24
19,1,1,8,5,PASS,FC40,371,8,5,25,15.02794076,24,24,11.74371822,24
19,2,2,8,7,PASS,FC40,371,8,7,29,15.79545612,24,28,13.95643443,24
19,3,3,8,8,PASS,FC40,371,8,8,31,10.47683623,24,30,13.01140532,24
19,4,4,7,8,PASS,FC40,338,7,8,31,14.27463434,24,30,15.37323575,24
19,5,5,8,6,PASS,FC40,338,8,6,27,14.3283547,24,26,13.68238319,24
19,6,6,8,4,PASS,FC40,354,8,4,22,9.602006746,24,23,11.87988686,24
19,7,7,8,2,PASS,FC40,306,8,2,18,14.67749652,24,19,13.13372475,24
19,8,8,7,7,PASS,FC40,338,7,7,29,15.01114271,24,28,11.54080731,24
19,9,9,7,6,PASS,FC40,371,7,6,27,32.35411563,24,26,25.39199758,24
19,10,10,8,3,PASS,FC40,354,8,3,20,15.08450872,24,21,13.86912376,24
19,11,11,8,1,PASS,FC40,371,8,1,16,1.988635394,24,17,1.529363754,24
20,1,1,13,9,PASS,FC40,338,13,9,0,15.73583392,24,1,16.95012485,24
20,2,2,14,15,PASS,FC40,371,14,15,13,20.79061382,24,12,13.4449847,24
20,3,3,14,16,PASS,FC40,403,14,16,15,15.71115857,24,14,13.68810367,24
20,4,4,13,14,PASS,FC40,435,13,14,11,14.61410264,24,10,14.99385043,24
20,5,5,13,13,PASS,FC40,371,13,13,9,14.09923849,24,8,16.46448658,24
20,6,6,13,12,PASS,FC40,338,13,12,6,10.58526303,24,7,13.88514826,24
20,7,7,13,11,PASS,FC40,354,13,11,4,12.87290115,24,5,13.2806052,24
20,8,8,13,16,PASS,FC40,354,13,16,15,16.09931232,24,14,16.48768594,24
20,9,9,13,10,PASS,FC40,354,13,10,2,14.66483677,24,3,16.67924307,24
20,10,10,13,15,PASS,FC40,387,13,15,13,13.01729006,24,12,13.90270751,24
21,1,1,1,8,PASS,FC40,403,1,8,31,12.39605093,24,30,12.17185788,24
21,2,2,2,8,PASS,FC40,387,2,8,31,11.3215669,24,30,12.86251797,24
21,3,3,1,7,PASS,FC40,354,1,7,29,12.25505664,24,28,11.90237181,24
21,4,4,1,2,PASS,FC40,387,1,2,18,14.09530003,24,19,15.74842266,24
21,5,5,2,7,PASS,FC40,387,2,7,29,16.00668504,24,28,16.84616307,24
21,6,6,1,5,PASS,FC40,435,1,5,25,28.34406998,24,24,15.77225936,24
21,7,12,2,6,PASS,FC40,387,2,6,27,15.183158,24,26,15.39701107,24
21,8,8,1,4,PASS,FC40,354,1,4,22,12.7046533,24,23,12.38377511,24
21,9,9,1,1,PASS,FC40,354,1,1,16,15.69066441,24,17,14.43215854,24
21,10,10,1,3,PASS,FC40,387,1,3,20,12.51734745,24,21,12.72870899,24
21,11,11,1,6,PASS,FC40,387,1,6,27,15.26482612,24,26,16.73337002,24
22,1,1,1,11,PASS,FC40,387,1,11,4,7.836805448,24,5,9.981568899,24
22,2,2,1,15,PASS,FC40,403,1,15,13,10.15172446,24,12,14.12985514,24
22,3,3,1,10,PASS,FC40,322,1,10,2,12.95964315,24,3,12.93542257,24
22,4,4,1,12,PASS,FC40,403,1,12,6,13.15628969,24,7,13.67456075,24
22,5,5,1,13,PASS,FC40,354,1,13,9,14.13623469,24,8,12.70407143,24
22,6,6,2,11,PASS,FC40,306,2,11,4,20.77039045,24,5,12.36604196,24
22,7,7,1,14,PASS,FC40,322,1,14,11,14.37833748,24,10,15.4860524,24
22,8,8,2,10,PASS,FC40,338,2,10,2,12.07776819,24,3,13.70442216,24
22,9,9,2,9,PASS,FC40,371,2,9,0,13.12227928,24,1,11.96200479,24
22,10,10,1,16,PASS,FC40,419,1,16,15,11.73558658,24,14,16.14745295,24
22,11,11,1,9,FAIL,FC40,322,1,9,0,0.7902667186,24,1,0.9045302145,24
23,1,1,4,16,PASS,FC40,322,4,16,15,10.13908272,24,14,8.844209301,24
23,2,2,4,15,PASS,FC40,354,4,15,13,10.12699163,24,12,10.100442,24
23,3,3,3,16,PASS,FC40,354,3,16,15,10.76768268,24,14,11.435513,24
23,4,4,3,15,PASS,FC40,354,3,15,13,11.68160421,24,12,10.72054896,24
23,5,5,4,14,PASS,FC40,387,4,14,11,9.626112951,24,10,8.954368155,24
23,6,6,4,13,PASS,FC40,387,4,13,9,57.61553634,24,8,40.31994692,24
23,7,7,4,11,PASS,FC40,354,4,11,4,10.74323935,24,5,10.58988291,24
23,8,8,4,10,PASS,FC40,338,4,10,2,8.461320265,24,3,9.848451847,24
23,9,9,4,12,PASS,FC40,387,4,12,6,10.78686915,24,7,9.913414736,24
23,10,10,4,9,PASS,FC40,322,4,9,0,8.991833622,24,1,10.96702511,24
24,1,1,3,9,PASS,FC40,371,3,9,0,13.12201285,24,1,14.38380871,24
24,2,2,2,14,PASS,FC40,354,2,14,11,14.08645236,24,10,15.9679004,24
24,3,3,3,13,PASS,FC40,371,3,13,9,12.33770409,24,8,14.58858208,24
24,4,4,3,14,PASS,FC40,387,3,14,11,15.00576745,24,10,17.44169023,24
24,5,5,3,12,PASS,FC40,338,3,12,6,14.21845437,24,7,15.94561279,24
24,6,6,2,16,PASS,FC40,387,2,16,15,15.19796208,24,14,18.98560646,24
24,7,7,2,12,PASS,FC40,354,2,12,6,11.82258591,24,7,14.25579161,24
24,8,8,3,10,PASS,FC40,387,3,10,2,15.69176263,24,3,19.9178293,24
24,9,9,2,13,PASS,FC40,371,2,13,9,9.530596587,24,8,6.770245152,24
24,10,10,2,15,PASS,FC40,371,2,15,13,12.91892136,24,12,15.9703492,24
24,11,11,3,11,PASS,FC40,322,3,11,4,2.039024378,24,5,2.362210033,24