X,Y,antenna_station_id,station_id,x_pos,y_pos,z_pos,base_id,tpm_id,tpm_rx,status_x,status_y,tpm_name,delay_x,delay_y,station_num
116.670179023817,-26.7039175431092,0,SB1-1,-5.37842930998541,17.81248231365,0.008009209290524,0,40,16,,,Tile 40,0,0,3
116.670193522233,-26.7039342079978,0,SB1-2,-3.93555916679255,15.9659273075,0.016015175670209,0,40,10,,,Tile 40,0,0,3
116.670185662936,-26.7039509654042,0,SB1-3,-4.71770869438343,14.1091200693409,0.034019041525679,0,39,10,,,Tile 39,0,0,3
116.670180795038,-26.7039692285549,0,SB1-4,-5.20215665976134,12.0854685894604,0.018022840272201,0,40,11,,,Tile 40,0,0,3
116.670200694235,-26.7039745837705,0,SB1-5,-3.22180679244832,11.4920837589791,0.023025247038579,0,40,14,,,Tile 40,0,0,3
116.670206699962,-26.7039556731829,0,SB1-6,-2.62412280331521,13.5874745138154,0.028021382969004,0,40,13,,,Tile 40,0,0,3
116.670225896731,-26.7039640785258,0,SB1-7,-0.713677878983511,12.6561194223328,0.019023806803232,0,40,15,,,Tile 40,0,0,3
116.67021622614,-26.7039395697274,0,SB1-8,-1.67608657054841,15.3718205422102,0.019017633056085,0,40,9,,,Tile 40,0,0,3
116.670228371399,-26.7039250975545,0,SB1-9,-0.467401303810481,16.9754120508459,0.037013751327243,0,40,12,,,Tile 40,0,0,3
116.670204733682,-26.7039193544444,0,SB1-10,-2.81980613043903,17.6117778810742,0.011011411890674,0,39,9,,,Tile 39,0,0,3
116.670143908052,-26.7039354470538,0,SB2-1,-8.87311800772219,15.8286309843857,-0.001989437965576,0,39,15,,,Tile 39,0,0,3
116.670119231016,-26.7039415203232,0,SB2-2,-11.3289539202006,15.1556794280825,-0.019991682331783,0,39,14,,,Tile 39,0,0,3
116.670138852007,-26.7039527165887,0,SB2-3,-9.37628967492531,13.9150770976595,-0.018985674110102,0,39,16,,,Tile 39,0,0,3
116.670115520266,-26.7039594069475,0,SB2-4,-11.6982426080919,13.1737488998685,-0.02998792477759,0,39,13,,,Tile 39,0,0,3
116.670115086839,-26.7039772560433,0,SB2-5,-11.7413749823942,11.1959770319877,-0.033984209169936,0,38,13,,,Tile 38,0,0,3
116.67013782451,-26.7039708983728,0,SB2-6,-9.47854380040178,11.9004416797417,0.016018270710728,0,38,10,,,Tile 38,0,0,3
116.670139360436,-26.7039890951424,0,SB2-7,-9.32568823894546,9.88414584353695,-0.025978044355964,0,38,11,,,Tile 38,0,0,3
116.670160134664,-26.7039873195789,0,SB2-8,-7.2582568379818,10.080888837029,0.005024331771959,0,38,12,,,Tile 38,0,0,3
116.670159536474,-26.70396814084,0,SB2-9,-7.31778936683965,12.2059919062576,-0.011979465651153,0,38,9,,,Tile 38,0,0,3
116.670162543603,-26.703950225493,0,SB2-10,-7.01852369808676,14.1911049117891,0.004016742617011,0,39,12,,,Tile 39,0,0,3
116.670169005807,-26.7039333835819,0,SB2-11,-6.37541203986304,16.0572758182163,0.004012973092276,0,39,11,,,Tile 39,0,0,3
116.670092952282,-26.7039696745154,0,SB3-1,-13.9441863548642,12.0360471671798,-0.037990177553272,0,37,12,,,Tile 37,0,0,3
116.670094550001,-26.7039873567827,0,SB3-2,-13.785180701945,10.0767609664259,-0.047986422053885,0,37,9,,,Tile 37,0,0,3
116.670074846483,-26.7040013147891,0,SB3-3,-15.7460543971638,8.5301396265148,-0.048988691094976,0,37,15,,,Tile 37,0,0,3
116.670099112501,-26.7040053168064,0,SB3-4,-13.3311229834922,8.08669826218543,-0.03098261087377,0,38,16,,,Tile 38,0,0,3
116.670081030646,-26.7040181770585,0,SB3-5,-15.1306101561121,6.66171400437055,-0.043984968236977,0,38,15,,,Tile 38,0,0,3
116.670090625737,-26.7040339908753,0,SB3-6,-14.1757140232828,4.90946266741848,-0.054981179360263,0,37,16,,,Tile 37,0,0,3
116.670107689742,-26.7040220040584,0,SB3-7,-12.4775222624451,6.23766556736202,-0.044978798770838,0,37,10,,,Tile 37,0,0,3
116.67010373348,-26.7040483411467,0,SB3-8,-12.8712426244129,3.31938000915305,-0.05897738467684,0,37,14,,,Tile 37,0,0,3
116.670120332563,-26.7040372200207,0,SB3-9,-11.2193195132587,4.55165968376662,-0.042975030703902,0,37,11,,,Tile 37,0,0,3
116.670126364798,-26.7040126032439,0,SB3-10,-10.6189997479665,7.27932599741587,-0.026976545964629,0,38,14,,,Tile 38,0,0,3
116.670118784181,-26.7039954307492,0,SB3-11,-11.3734172002884,9.18212630693615,-0.007980311454931,0,37,13,,,Tile 37,0,0,3
116.67016605782,-26.7040075490119,0,SB4-1,-6.66878875308054,7.83936370090783,0.014028137692861,0,38,1,,,Tile 38,0,0,3
116.670146051187,-26.7040080803739,0,SB4-2,-8.65982965319979,7.78048481637819,-0.007974181878792,0,38,3,,,Tile 38,0,0,3
116.670138549005,-26.7040299850709,0,SB4-3,-9.40643782717515,5.35333092443969,-0.009972727841261,0,37,7,,,Tile 37,0,0,3
116.670158501229,-26.7040274040269,0,SB4-4,-7.42081217068859,5.63932522779842,-0.000970357638913,0,38,2,,,Tile 38,0,0,3
116.670159809757,-26.7040477671998,0,SB4-5,-7.29058734630653,3.38298073121659,-0.030968603676214,0,37,2,,,Tile 37,0,0,3
116.670180306095,-26.7040482391798,0,SB4-6,-5.25081212489706,3.33068394780678,0.00603342797887,0,37,8,,,Tile 37,0,0,3
116.670179523259,-26.7040303421136,0,SB4-7,-5.32872003113193,5.31377114114367,0.022032012872789,0,37,4,,,Tile 37,0,0,3
116.670200996916,-26.7040405224111,0,SB4-8,-3.19168243333374,4.18574239433193,0.013034283313692,0,37,3,,,Tile 37,0,0,3
116.670185808416,-26.7040121454581,0,SB4-9,-4.70322813340569,7.33005465311318,0.023030496632525,0,37,1,,,Tile 37,0,0,3
116.670198922755,-26.7039962850913,0,SB4-10,-3.39810212981355,9.08746545308708,0.004029053226771,0,37,5,,,Tile 37,0,0,3
116.670180274438,-26.7039894249582,0,SB4-11,-5.25396533467696,9.84760295601834,0.014026661764111,0,37,6,,,Tile 37,0,0,3
116.670217980308,-26.7039832194264,0,SB5-1,-1.50151272218128,10.535208858288,0.009027543684504,0,47,7,,,Tile 47,0,0,3
116.67021508541,-26.7040075455428,0,SB5-2,-1.78960989237744,7.83974972793558,0.020031368601762,0,48,5,,,Tile 48,0,0,3
116.670204092878,-26.7040231760894,0,SB5-3,-2.88357580168806,6.10780437203732,0.02703287193519,0,47,8,,,Tile 47,0,0,3
116.670221022714,-26.7040438103037,0,SB5-4,-1.19873472476813,3.8214272840434,0.00303519810783,0,48,1,,,Tile 48,0,0,3
116.670227579471,-26.704025551075,0,SB5-5,-0.546212835943968,5.84464402447144,0.016033747757825,0,48,8,,,Tile 48,0,0,3
116.670245270722,-26.7040366164386,0,SB5-6,1.2144031946484,4.61854462814624,3.46663512724721E-05,0,47,6,,,Tile 47,0,0,3
116.670262490071,-26.7040265350582,0,SB5-7,2.92805606972457,5.73561328118982,0.015033200494701,0,48,7,,,Tile 48,0,0,3
116.670242262623,-26.7040129808624,0,SB5-8,0.915040337463014,7.23748839002682,0.028032270713656,0,48,4,,,Tile 48,0,0,3
116.670232519504,-26.7039962006212,0,SB5-9,-0.054585523167519,9.09682564326161,0.009029943689475,0,48,3,,,Tile 48,0,0,3
116.670254192465,-26.7039895334767,0,SB5-10,2.10228712614578,9.83557947124702,0.020028496277607,0,48,6,,,Tile 48,0,0,3
116.67024139663,-26.7039750846258,0,SB5-11,0.828857795877287,11.4365867755705,0.015026107547854,0,48,2,,,Tile 48,0,0,3
116.670065018208,-26.7040350328845,0,SB6-1,-16.724149984514,4.79399957579815,-0.058987259108854,0,46,2,,,Tile 46,0,0,3
116.670056883345,-26.7040183286004,0,SB6-2,-17.533726129025,6.64491926712901,-0.06299109848504,0,45,6,,,Tile 45,0,0,3
116.670051894272,-26.7040542158454,0,SB6-3,-18.0302281461835,2.66842681663754,-0.073989565901497,0,45,2,,,Tile 45,0,0,3
116.670042049413,-26.7040762414963,0,SB6-4,-19.0099750091282,0.227869722447935,-0.079991851465437,0,45,7,,,Tile 45,0,0,3
116.670055492018,-26.7040895090843,0,SB6-5,-17.6721786129368,-1.24224549974392,-0.07898812525894,0,45,3,,,Tile 45,0,0,3
116.670064167479,-26.7040686183539,0,SB6-6,-16.8088087949021,1.07255629860233,-0.075985762440885,0,45,8,,,Tile 45,0,0,3
116.670078658823,-26.7040807597669,0,SB6-7,-15.366643161905,-0.27277301930433,-0.088982043715515,0,45,5,,,Tile 45,0,0,3
116.670096293134,-26.7040906512617,0,SB6-8,-13.6116934505419,-1.36879963379864,-0.081978201381143,0,46,1,,,Tile 46,0,0,3
116.670106784844,-26.7040743965668,0,SB6-9,-12.5675710357666,0.432305431051026,-0.068975926531165,0,45,4,,,Tile 45,0,0,3
116.670089746457,-26.7040635313389,0,SB6-10,-14.2632152674729,1.63622690289487,-0.110979687236771,0,48,9,,,Tile 48,0,0,3
116.670076113291,-26.7040501098201,0,SB6-11,-15.619976155326,3.12339879034973,-0.061983419164548,0,47,3,,,Tile 47,0,0,3
116.670137973088,-26.7040519329486,0,SB7-1,-9.46375069108109,2.92139285646233,-0.022971228133129,0,47,11,,,Tile 47,0,0,3
116.670121077962,-26.7040611302365,0,SB7-2,-11.1451358469782,1.90228456223008,-0.040973555910698,0,48,13,,,Tile 48,0,0,3
116.670143556608,-26.7040714121958,0,SB7-3,-8.90808277916495,0.762992230513136,-0.033969801762545,0,48,14,,,Tile 48,0,0,3
116.670128041685,-26.7040830685479,0,SB7-4,-10.4521110733672,-0.528592866574906,-0.0469721198591,0,48,12,,,Tile 48,0,0,3
116.670140677025,-26.7041008848093,0,SB7-5,-9.1946535414864,-2.50272551862449,-0.058970655654058,0,48,11,,,Tile 48,0,0,3
116.670155151768,-26.7040873841467,0,SB7-6,-7.75414312930178,-1.0067815302458,-0.035968330083549,0,47,10,,,Tile 47,0,0,3
116.670171335733,-26.7040982293239,0,SB7-7,-6.14353100218765,-2.20848220245594,-0.035966880785726,0,48,10,,,Tile 48,0,0,3
116.670198115017,-26.7040847662742,0,SB7-8,-3.47848476744694,-0.716705868517979,-0.010964528445658,0,48,16,,,Tile 48,0,0,3
116.670176832474,-26.7040780354538,0,SB7-9,-5.59650199924512,0.029102981801914,-0.02196599284799,0,47,12,,,Tile 47,0,0,3
116.670190866293,-26.7040640462033,0,SB7-10,-4.19987118489557,1.57918461718283,-0.004965116903851,0,48,15,,,Tile 48,0,0,3
116.670163823139,-26.7040644167574,0,SB7-11,-6.89117858984406,1.53812412653422,-0.029967445765838,0,47,9,,,Tile 47,0,0,3
116.670089001538,-26.7041092428448,0,SB8-1,-14.3373432011139,-3.42884370377569,-0.074980568337749,0,47,5,,,Tile 47,0,0,3
116.670071172659,-26.7041005878539,0,SB8-2,-16.1116557637802,-2.46982821605632,-0.084984355760104,0,47,2,,,Tile 47,0,0,3
116.670050591656,-26.7041120518453,0,SB8-3,-18.1598539962892,-3.74010033791024,-0.081990476292422,0,47,4,,,Tile 47,0,0,3
116.670067622465,-26.7041220593164,0,SB8-4,-16.464964326956,-4.84897742731323,-0.072986628498476,0,46,6,,,Tile 46,0,0,3
116.670067567457,-26.704144640426,0,SB8-5,-16.4704354482631,-7.35108079814261,-0.088989047036538,0,46,4,,,Tile 46,0,0,3
116.670085827435,-26.7041292795893,0,SB8-6,-14.6532240415428,-5.64901867163736,-0.071982873602268,0,47,1,,,Tile 47,0,0,3
116.670105387853,-26.7041335957094,0,SB8-7,-12.7065916000629,-6.12726493105114,-0.072979145383469,0,46,5,,,Tile 46,0,0,3
116.670131453525,-26.7041166007206,0,SB8-8,-10.1125653202959,-4.24413022299791,-0.056972969530601,0,46,3,,,Tile 46,0,0,3
116.670108970396,-26.7041148510439,0,SB8-9,-12.3500627676421,-4.05025899516267,-0.068976779505555,0,46,7,,,Tile 46,0,0,3
116.670116479248,-26.7040976142971,0,SB8-10,-11.6027915052921,-2.14033787487293,-0.061974446145476,0,46,8,,,Tile 46,0,0,3
116.670176407729,-26.7041207952594,0,SB9-1,-5.63877006351566,-4.70890398123137,-0.040967777869785,0,43,12,,,Tile 43,0,0,3
116.670157237612,-26.7041135998421,0,SB9-2,-7.54656036103459,-3.91161563694649,-0.043969206809845,0,42,12,,,Tile 42,0,0,3
116.670153317392,-26.7041309171607,0,SB9-3,-7.9366953113637,-5.83046406498929,-0.048971152885461,0,43,13,,,Tile 43,0,0,3
116.670148871983,-26.7041490819737,0,SB9-4,-8.3790963829634,-7.84321931817852,-0.044973884216689,0,43,9,,,Tile 43,0,0,3
116.670170976945,-26.7041390300148,0,SB9-5,-6.17923493341701,-6.72940916866793,-0.043970098547852,0,43,14,,,Tile 43,0,0,3
116.670172362634,-26.704157036828,0,SB9-6,-6.04133174773635,-8.72465690590523,-0.018972394927923,0,42,13,,,Tile 42,0,0,3
116.670196070025,-26.7041595477653,0,SB9-7,-3.68199793411549,-9.00288076800134,-0.040970986874326,0,42,14,,,Tile 42,0,0,3
116.670192634323,-26.7041412743519,0,SB9-8,-4.02391583841396,-6.97809243001198,-0.035968644908639,0,42,16,,,Tile 42,0,0,3
116.670196574368,-26.7041205622181,0,SB9-9,-3.63180752506319,-4.683081110103,0.009033698997468,0,42,15,,,Tile 42,0,0,3
116.670215207713,-26.7041116849704,0,SB9-10,-1.77743676539056,-3.69943584863523,-0.043964866021825,0,43,11,,,Tile 43,0,0,3
116.670191532385,-26.7041015356754,0,SB9-11,-4.13358101188707,-2.57484218067146,-0.038965400094968,0,43,10,,,Tile 43,0,0,3
116.670106405884,-26.704153597052,0,SB10-1,-12.6052761130007,-8.34351675002479,-0.058981471276849,0,34,2,,,Tile 34,0,0,3
116.670086912632,-26.7041503916408,0,SB10-2,-14.545223729823,-7.98834272589556,-0.068985140210606,0,34,3,,,Tile 34,0,0,3
116.6700721662,-26.7041674671026,0,SB10-3,-16.0127702818767,-9.88039370984235,-0.074991315493293,0,35,7,,,Tile 35,0,0,3
116.670091796343,-26.7041720091087,0,SB10-4,-14.0591994704757,-10.3836691014053,-0.068987517209441,0,34,5,,,Tile 34,0,0,3
116.670100842914,-26.7041932841243,0,SB10-5,-13.1588921745593,-12.7410495545048,-0.083989891987997,0,35,6,,,Tile 35,0,0,3
116.670111474658,-26.7041737883857,0,SB10-6,-12.1008350420537,-10.5808201190301,-0.086983828637801,0,35,3,,,Tile 35,0,0,3
116.670120928337,-26.7041933308005,0,SB10-7,-11.1600134026817,-12.7462196397295,-0.06498609226558,0,34,4,,,Tile 34,0,0,3
116.670132057422,-26.7041721839304,0,SB10-8,-10.0524612394265,-10.403036503932,-0.029979980449644,0,35,8,,,Tile 35,0,0,3
116.670152248297,-26.7041670302104,0,SB10-9,-8.04308792964444,-9.83197623497087,-0.075976222506467,0,35,4,,,Tile 35,0,0,3
116.670127115923,-26.7041531756769,0,SB10-10,-10.5442354562452,-8.29682432336051,-0.067977672314957,0,35,5,,,Tile 35,0,0,3
116.670127059053,-26.7041345309004,0,SB10-11,-10.549896920218,-6.23088696823581,-0.047975316822079,0,34,1,,,Tile 34,0,0,3
116.670160341465,-26.7041842580671,0,SB11-1,-7.23766366015106,-11.7409111639392,-0.055978500652202,0,36,7,,,Tile 36,0,0,3
116.670140649715,-26.7041906318474,0,SB11-2,-9.19736428796624,-12.4471602254294,-0.021982368732593,0,36,5,,,Tile 36,0,0,3
116.670153769604,-26.7042077540094,0,SB11-3,-7.89168639344007,-14.3443831622522,-0.046984625285158,0,36,1,,,Tile 36,0,0,3
116.670134516256,-26.704211997991,0,SB11-4,-9.80775732748106,-14.8146394563032,-0.084988363710709,0,36,6,,,Tile 36,0,0,3
116.670151706581,-26.7042294546514,0,SB11-5,-8.09699449728737,-16.748926257627,-0.085990770575332,0,36,4,,,Tile 36,0,0,3
116.670170753322,-26.7042236481907,0,SB11-6,-6.20148511653838,-16.1055394580947,-0.06098698297725,0,36,8,,,Tile 36,0,0,3
116.670190930429,-26.7042372383951,0,SB11-7,-4.19348199834209,-17.6114034051892,-0.053989347527732,0,36,2,,,Tile 36,0,0,3
116.670172206919,-26.7042006279154,0,SB11-8,-6.05682600182272,-13.5547741477691,-0.063980885106577,0,36,3,,,Tile 36,0,0,3
116.670189378063,-26.7041898421795,0,SB11-9,-4.3479735233892,-12.3596583230735,-0.041977053073731,0,35,2,,,Tile 35,0,0,3
116.670178435069,-26.7041743051332,0,SB11-10,-5.43700877856819,-10.6380738840658,-0.033974769434347,0,35,1,,,Tile 35,0,0,3
116.670235268486,-26.7042005757865,0,SB12-1,0.218990130628131,-13.5489966498611,-0.01997800323074,0,41,10,,,Tile 41,0,0,3
116.670218111125,-26.7041891234202,0,SB12-2,-1.48849128886693,-12.2800154297091,-0.037975591816387,0,41,16,,,Tile 41,0,0,3
116.670204567565,-26.7042039173827,0,SB12-3,-2.83633087079456,-13.9192629745131,-0.054979431030431,0,41,11,,,Tile 41,0,0,3
116.670222710774,-26.7042151372899,0,SB12-4,-1.03073907818097,-15.1624863432914,-0.034981730877604,0,41,9,,,Tile 41,0,0,3
116.67018844079,-26.7042150937888,0,SB12-5,-4.4412488853922,-15.1576668543151,-0.066983182642126,0,41,13,,,Tile 41,0,0,3
116.670207616236,-26.7042274266489,0,SB12-6,-2.53293006731003,-16.524210848251,-0.062985548827115,0,42,10,,,Tile 42,0,0,3
116.670230137343,-26.704236941238,0,SB12-7,-0.291655293160082,-17.578476163799,-0.059987886192012,0,42,11,,,Tile 42,0,0,3
116.670214604694,-26.7042477669008,0,SB12-8,-1.83744645084625,-18.7780155708321,-0.059991579924826,0,41,15,,,Tile 41,0,0,3
116.670254899634,-26.7042431745161,0,SB12-9,2.17265903551979,-18.2691557696012,-0.037990199522644,0,41,12,,,Tile 41,0,0,3
116.670243686225,-26.7042237905423,0,SB12-10,1.05671380144131,-16.1213114292179,-0.002984099491657,0,42,9,,,Tile 42,0,0,3
116.67024440712,-26.7041829094327,0,SB12-11,1.12845689874022,-11.591473587587,-0.006974222407519,0,41,14,,,Tile 41,0,0,3
116.670285641337,-26.7041767933396,0,SB13-1,5.23204063941572,-10.9137799643834,-0.000975067177674,0,44,9,,,Tile 44,0,0,3
116.670283355159,-26.7041957035405,0,SB13-2,5.00452193501784,-13.0091276508332,-0.013978833010393,0,44,10,,,Tile 44,0,0,3
116.670254737554,-26.7042086928338,0,SB13-3,2.15652969909158,-14.4484075179241,-0.029980347519328,0,44,14,,,Tile 44,0,0,3
116.670276930725,-26.704213394259,0,SB13-4,4.3651687386206,-14.9693502376062,-0.031982684036626,0,44,15,,,Tile 44,0,0,3
116.670267023385,-26.7042291988793,0,SB13-5,3.37920114961124,-16.7205834230875,-0.023986455749899,0,41,1,,,Tile 41,0,0,3
116.670292110284,-26.7042309274921,0,SB13-6,5.8758203564587,-16.9121235643572,-0.015988773448991,0,44,13,,,Tile 44,0,0,3
116.670300109388,-26.704214495445,0,SB13-7,6.67188292873468,-15.0913683858041,-0.009984966486657,0,44,12,,,Tile 44,0,0,3
116.670317800694,-26.7042290459486,0,SB13-8,8.4325005754672,-16.7036403164859,-0.002991086718656,0,44,16,,,Tile 44,0,0,3
116.670324374173,-26.7042119605096,0,SB13-9,9.08668700867736,-14.8104860104645,0.008012713869388,0,43,16,,,Tile 43,0,0,3
116.670305146251,-26.7041969008205,0,SB13-10,7.17314695399438,-13.1417935142189,-0.004981172605874,0,43,15,,,Tile 43,0,0,3
116.670306285267,-26.7041783852259,0,SB13-11,7.28650167456505,-11.090170217417,0.017022613251618,0,44,11,,,Tile 44,0,0,3
116.670343617823,-26.7041517193442,0,SB14-1,11.0017989643914,-8.13545566035804,0.030021764098051,0,41,6,,,Tile 41,0,0,3
116.6703490248,-26.7041696813209,0,SB14-2,11.5398936626706,-10.1257358246529,0.03501795158986,0,41,3,,,Tile 41,0,0,3
116.670323526707,-26.7041571441897,0,SB14-3,9.00235241340246,-8.73655493756027,0.016024099150201,0,42,5,,,Tile 42,0,0,3
116.670327866216,-26.7041757537677,0,SB14-4,9.43421417684603,-10.7985925039482,0.022020302128229,0,41,8,,,Tile 41,0,0,3
116.670327833113,-26.7041942358154,0,SB14-5,9.43091821012518,-12.8464987187381,0.017016493788382,0,41,5,,,Tile 41,0,0,3
116.670350581959,-26.7041874989241,0,SB14-6,11.6948586854903,-12.1000183215036,0.032014212031436,0,41,7,,,Tile 41,0,0,3
116.670348911974,-26.7042053812643,0,SB14-7,11.5286617941701,-14.0814737042656,0.025010428826061,0,42,7,,,Tile 42,0,0,3
116.670372695378,-26.704195459576,0,SB14-8,13.8955605787061,-12.9821018633399,0.042008059422759,0,42,8,,,Tile 42,0,0,3
116.670372777959,-26.7041772485097,0,SB14-9,13.9037811167424,-10.9642217756972,0.046011847830442,0,41,2,,,Tile 41,0,0,3
116.670393285381,-26.7041634006754,0,SB14-10,15.9446590996535,-9.42981272511944,0.064009539218951,0,42,6,,,Tile 42,0,0,3
116.67036940057,-26.7041596614309,0,SB14-11,13.5676691966054,-9.01548235850971,0.049015637840357,0,41,4,,,Tile 41,0,0,3
116.670228145338,-26.7041257729974,0,SB15-1,-0.489897809153744,-5.26046179793608,-0.019965739391261,0,43,8,,,Tile 43,0,0,3
116.670236348254,-26.7041467842071,0,SB15-2,0.326447574308293,-7.58861217886775,-0.034968084287867,0,43,6,,,Tile 43,0,0,3
116.670212260467,-26.7041367332752,0,SB15-3,-2.07074316741536,-6.47491724065116,-0.04296717743999,0,42,2,,,Tile 42,0,0,3
116.670218157434,-26.7041555902546,0,SB15-4,-1.48388310636153,-8.56436772121238,-0.043969491539666,0,42,4,,,Tile 42,0,0,3
116.670205101434,-26.7041756221023,0,SB15-5,-2.78320148976848,-10.7839999084451,-0.08597330791582,0,43,3,,,Tile 43,0,0,3
116.670229261431,-26.7041710734986,0,SB15-6,-0.378825290561527,-10.2799909478378,-0.036971875901073,0,42,3,,,Tile 42,0,0,3
116.670262689543,-26.7041911681845,0,SB15-7,2.94790317402078,-12.5065861841009,-0.005976541733355,0,43,5,,,Tile 43,0,0,3
116.670266668566,-26.7041708804969,0,SB15-8,3.34389166395194,-10.2586058335055,-0.014972706042419,0,42,1,,,Tile 42,0,0,3
116.670249837747,-26.7041612346695,0,SB15-9,1.66890721683089,-9.18979803625329,-0.039970411710492,0,43,7,,,Tile 43,0,0,3
116.670249356224,-26.7041329550878,0,SB15-10,1.62098697294582,-6.05627455192636,-0.021966633585076,0,43,4,,,Tile 43,0,0,3
116.670298163649,-26.7041186583563,0,SB16-1,6.47825061887144,-4.47212454051662,0.012031596616157,0,44,4,,,Tile 44,0,0,3
116.670275129833,-26.7041126457939,0,SB16-2,4.18594980059222,-3.805900639878,-0.000966054156953,0,44,7,,,Tile 44,0,0,3
116.670274143087,-26.7041306470957,0,SB16-3,4.08774920898029,-5.80053769789181,3.24998030789558E-05,0,44,2,,,Tile 44,0,0,3
116.670294139023,-26.7041373297689,0,SB16-4,6.07772310962982,-6.54101315822945,0.009030195720428,0,44,6,,,Tile 44,0,0,3
116.670265127669,-26.7041474198784,0,SB16-5,3.19054389852486,-7.65904827070339,-0.001968958603368,0,45,1,,,Tile 45,0,0,3
116.670283551529,-26.7041554351762,0,SB16-6,5.0240661980679,-8.54718519927555,-0.004971271505463,0,43,1,,,Tile 43,0,0,3
116.670303316653,-26.7041584877008,0,SB16-7,6.99106978053132,-8.88542164120433,0.022026412990673,0,44,3,,,Tile 44,0,0,3
116.670314443076,-26.7041382527271,0,SB16-8,8.09836067817333,-6.64328283748543,0.025027845509301,0,43,2,,,Tile 43,0,0,3
116.67033389616,-26.704134460629,0,SB16-9,10.0343111634853,-6.22310020978611,0.044025522499413,0,44,8,,,Tile 44,0,0,3
116.670318564386,-26.7041174236353,0,SB16-10,8.5085105875771,-4.33531229736029,0.031029309903343,0,44,5,,,Tile 44,0,0,3
116.670337451477,-26.7041111924237,0,SB16-11,10.3881346365874,-3.64486330989688,0.038026959672125,0,44,1,,,Tile 44,0,0,3
116.670383408078,-26.7040989295699,0,SB17-1,14.9616891740142,-2.28608045131298,0.097018512514418,0,46,9,,,Tile 46,0,0,3
116.67035413954,-26.7041005861233,0,SB17-2,12.0489143529668,-2.46963200254538,0.064024605788841,0,46,14,,,Tile 46,0,0,3
116.670369299776,-26.7041143542591,0,SB17-3,13.5576437635951,-3.99521400191112,0.085020803616031,0,47,16,,,Tile 47,0,0,3
116.670352487363,-26.7041262514028,0,SB17-4,11.884488747344,-5.3134772129383,0.071023170954807,0,46,11,,,Tile 46,0,0,3
116.670362714395,-26.7041425632574,0,SB17-5,12.9022702679337,-7.12091584839939,0.069019425324865,0,46,13,,,Tile 46,0,0,3
116.670380293626,-26.7041296927736,0,SB17-6,14.651738236771,-5.69480178154083,0.107017089212794,0,47,13,,,Tile 47,0,0,3
116.670388409141,-26.7041461532145,0,SB17-7,15.4593833373765,-7.51870449011277,0.081013283912898,0,47,15,,,Tile 47,0,0,3
116.670405145372,-26.7041292900037,0,SB17-8,17.1249575750504,-5.6501758760156,0.087010971039629,0,46,12,,,Tile 46,0,0,3
116.670395560542,-26.704113385943,0,SB17-9,16.1710877694873,-3.88792264890134,0.094014783693659,0,47,14,,,Tile 47,0,0,3
116.670419166136,-26.7041093506659,0,SB17-10,18.5202924048904,-3.44079634860065,0.100008657890116,0,46,10,,,Tile 46,0,0,3
116.670233825772,-26.7040592433213,0,SB18-1,0.075412982370936,2.11136940483672,0.005036108984612,0,38,8,,,Tile 38,0,0,3
116.670210508212,-26.7040610039581,0,SB18-2,-2.24512717544883,1.91628157390325,0.002035775457311,0,39,2,,,Tile 39,0,0,3
116.670221009373,-26.704076368427,0,SB18-3,-1.20006208871738,0.213819333718849,0.0110363431802,0,38,6,,,Tile 38,0,0,3
116.670216145505,-26.704093232111,0,SB18-4,-1.6841090095711,-1.65476387706596,-0.006963977948603,0,38,4,,,Tile 38,0,0,3
116.670236807259,-26.7041060830665,0,SB18-5,0.372127454648926,-3.07871591221675,-0.004964297709146,0,39,3,,,Tile 39,0,0,3
116.670243771267,-26.7040895312423,0,SB18-6,1.0651783321103,-1.24468847427549,0.004036248961699,0,38,5,,,Tile 38,0,0,3
116.670254455124,-26.7041147647028,0,SB18-7,2.12842440131001,-4.04068615813867,-0.010965181434998,0,39,1,,,Tile 39,0,0,3
116.670265530091,-26.704094944942,0,SB18-8,3.23059405629335,-1.8445546842214,0.008035374559057,0,39,4,,,Tile 39,0,0,3
116.670259610986,-26.7040767921659,0,SB18-9,2.64153126463935,0.166866659108361,0.009035911340643,0,39,5,,,Tile 39,0,0,3
116.670252249912,-26.7040531916231,0,SB18-10,1.90896501217923,2.78192862809392,0.01203556553361,0,38,7,,,Tile 38,0,0,3
116.670272598347,-26.7040631345451,0,SB19-1,3.93402062113441,1.68020113325679,0.014035025542153,0,40,5,,,Tile 40,0,0,3
116.670293140863,-26.7040685183287,0,SB19-2,5.97839090183165,1.08364934877152,0.025033568540702,0,40,7,,,Tile 40,0,0,3
116.670282978086,-26.7040857579499,0,SB19-3,4.96700088839918,-0.826589142542565,0.018034473741742,0,40,8,,,Tile 40,0,0,3
116.670294515238,-26.704100935213,0,SB19-4,6.11516561117446,-2.50830867228725,0.002033033759063,0,39,8,,,Tile 39,0,0,3
116.670307682444,-26.7040806778929,0,SB19-5,7.42555357077598,-0.263693831716355,0.023032135904962,0,40,6,,,Tile 40,0,0,3
116.670316490207,-26.7040976184765,0,SB19-6,8.30209193147006,-2.1407984053647,0.019030697951454,0,40,4,,,Tile 40,0,0,3
116.670334387843,-26.7040893805551,0,SB19-7,10.083246893563,-1.22799552202861,0.038028376770439,0,40,2,,,Tile 40,0,0,3
116.670325103732,-26.704070289992,0,SB19-8,9.15930325377349,0.887338027354798,0.035029827017104,0,39,7,,,Tile 39,0,0,3
116.670348799074,-26.7040769812488,0,SB19-9,11.51743906446,0.145910340979131,0.046026066840213,0,39,6,,,Tile 39,0,0,3
116.670337861066,-26.7040562165024,0,SB19-10,10.4289015294635,2.44675227880077,0.033027468367098,0,40,3,,,Tile 40,0,0,3
116.670345981564,-26.7040395138676,0,SB19-11,11.2370470091693,4.29748966708424,0.048025113526722,0,40,1,,,Tile 40,0,0,3
116.670385828289,-26.7040509105572,0,SB20-1,15.2025524203925,3.03467356006344,0.073017630349682,0,45,9,,,Tile 45,0,0,3
116.670366829665,-26.7040435079021,0,SB20-2,13.3118290154168,3.85492804677892,0.06002140912111,0,46,15,,,Tile 46,0,0,3
116.670359701351,-26.7040612692214,0,SB20-3,12.6024243508647,1.88688298170954,0.058023738192624,0,46,16,,,Tile 46,0,0,3
116.67037840546,-26.7040697095153,0,SB20-4,14.4638374166895,0.951652908094659,0.069020000676375,0,45,14,,,Tile 45,0,0,3
116.670367770554,-26.7040868306708,0,SB20-5,13.405460350545,-0.94545827161741,0.065022311252681,0,45,13,,,Tile 45,0,0,3
116.670394719168,-26.7040808890371,0,SB20-6,16.087359618879,-0.287097729948588,0.085016180413202,0,45,12,,,Tile 45,0,0,3
116.6704081508,-26.7040944906353,0,SB20-7,17.4240599199771,-1.79422673423865,0.089012423560775,0,45,11,,,Tile 45,0,0,3
116.670417150042,-26.7040728512373,0,SB20-8,18.3196586300361,0.603528922621281,0.0850101412093,0,45,16,,,Tile 45,0,0,3
116.670402518235,-26.704060601186,0,SB20-9,16.8635178563211,1.96089981989624,0.08801388008866,0,45,10,,,Tile 45,0,0,3
116.670406964878,-26.704038499774,0,SB20-10,17.3060466710646,4.40984966809297,0.086011468362291,0,45,15,,,Tile 45,0,0,3
116.670278382519,-26.7039884971699,0,SB21-1,4.50965857371739,9.95040701847564,0.043027069665529,0,33,8,,,Tile 33,0,0,3
116.67028343979,-26.7040057089397,0,SB21-2,5.01295265626768,8.04325396115327,0.030029397723646,0,34,8,,,Tile 34,0,0,3
116.670261411385,-26.7040066419219,0,SB21-3,2.82070684112083,7.93987539287842,0.022030872509216,0,33,7,,,Tile 33,0,0,3
116.670282470708,-26.704024558998,0,SB21-4,4.91650973506778,5.95457034632601,0.036031774896458,0,33,2,,,Tile 33,0,0,3
116.670273486307,-26.7040445280784,0,SB21-5,4.02239017685836,3.74189356793697,0.021034091695546,0,34,7,,,Tile 34,0,0,3
116.670293154212,-26.7040464246815,0,SB21-6,5.97972056087079,3.53173940711737,0.030032677510104,0,33,5,,,Tile 33,0,0,3
116.670311203065,-26.7040554954841,0,SB21-7,7.77592387151911,2.5266467286191,0.039031221105333,0,34,6,,,Tile 34,0,0,3
116.6703030859,-26.7040291393784,0,SB21-8,6.96811339410722,5.4470396309301,0.041030319896267,0,33,4,,,Tile 33,0,0,3
116.670321833635,-26.7040398821463,0,SB21-9,8.83386879804005,4.25668438915453,0.049028921678251,0,33,1,,,Tile 33,0,0,3
116.670306113401,-26.7040111247579,0,SB21-10,7.26940843628468,7.44315230231413,0.038027957886891,0,33,3,,,Tile 33,0,0,3
116.670303651295,-26.7039933772831,0,SB21-11,7.02438310080314,9.4096641733095,0.049025622565558,0,33,6,,,Tile 33,0,0,3
116.670364088738,-26.7039829267564,0,SB22-1,13.0390616257804,10.5676316847188,0.062014348235628,0,33,11,,,Tile 33,0,0,3
116.670349055174,-26.7040019879355,0,SB22-2,11.5429333927987,8.45555616796244,0.039020392984051,0,33,15,,,Tile 33,0,0,3
116.670327956867,-26.7040045934314,0,SB22-3,9.44324977323847,8.16685553089036,0.041024222624949,0,33,10,,,Tile 33,0,0,3
116.670327301611,-26.7040226857926,0,SB22-4,9.37803784012224,6.16212865815665,0.041026580287712,0,33,12,,,Tile 33,0,0,3
116.670349562349,-26.7040213650978,0,SB22-5,11.5934050414838,6.30846662232667,0.035022797988993,0,33,13,,,Tile 33,0,0,3
116.670370324052,-26.7040239413964,0,SB22-6,13.6595893463418,6.0229974104367,0.051018987639563,0,34,11,,,Tile 34,0,0,3
116.670389356445,-26.7040300891146,0,SB22-7,15.5536737495901,5.34179635896246,0.065015262702501,0,33,14,,,Tile 33,0,0,3
116.670406981194,-26.7040153678117,0,SB22-8,17.3076738932377,6.97299039076326,0.086009165383233,0,34,10,,,Tile 34,0,0,3
116.670388706216,-26.7040080210129,0,SB22-9,15.4889665990897,7.78705590708897,0.064012891780334,0,34,9,,,Tile 34,0,0,3
116.670383753958,-26.7039857533156,0,SB22-10,14.9961255071126,10.2544321869663,0.062010563767447,0,33,16,,,Tile 33,0,0,3
116.670369196592,-26.7040035244722,0,SB22-11,13.5473880133346,8.2852980271349,0.06101667843582,0,33,9,,,Tile 33,0,0,3
116.67032133134,-26.7039454840002,0,SB23-1,8.78388824121185,14.7164858100288,0.070013360404915,0,36,16,,,Tile 36,0,0,3
116.670302506437,-26.7039510743037,0,SB23-2,6.91045055455418,14.0970524988313,0.063017072143902,0,36,15,,,Tile 36,0,0,3
116.670296382833,-26.7039760159162,0,SB23-3,6.30103362832348,11.333393527093,0.046023236218845,0,35,16,,,Tile 35,0,0,3
116.670315244475,-26.7039681413912,0,SB23-4,8.1781272830449,12.2059304222589,0.047019488190881,0,35,15,,,Tile 35,0,0,3
116.67032388832,-26.7039861470022,0,SB23-5,9.03835328723611,10.2108152963193,0.040021851698166,0,36,14,,,Tile 36,0,0,3
116.670334770265,-26.7039635278331,0,SB23-6,10.1213163102627,12.7171350685902,0.060015701085715,0,36,13,,,Tile 36,0,0,3
116.670343974129,-26.7039825550073,0,SB23-7,11.0372745507892,10.6088252872533,0.052018054866401,0,36,11,,,Tile 36,0,0,3
116.670354729173,-26.703962111503,0,SB23-8,12.1076086816116,12.8740700221817,0.066011924988469,0,36,10,,,Tile 36,0,0,3
116.670374709481,-26.7039637379536,0,SB23-9,14.0960303499288,12.6938488587561,0.066008207006818,0,36,12,,,Tile 36,0,0,3
116.670341264194,-26.7039426410478,0,SB23-10,10.767588106672,15.0314980466194,0.061009585185274,0,36,9,,,Tile 36,0,0,3
116.670243132803,-26.7039132769206,0,SB24-1,1.0016406128854,18.2851992096242,0.045010053167779,0,35,9,,,Tile 35,0,0,3
116.670250179199,-26.7039344389346,0,SB24-2,1.70289147306492,15.9403388883145,0.045016224248998,0,34,14,,,Tile 34,0,0,3
116.67023663986,-26.7039477792605,0,SB24-3,0.355468504167742,14.4621620806731,0.029019981867558,0,35,13,,,Tile 35,0,0,3
116.67025417049,-26.7039587629899,0,SB24-4,2.10010080351129,13.245108071644,0.030022299774049,0,35,14,,,Tile 35,0,0,3
116.670268455743,-26.7039726555084,0,SB24-5,3.52175567492491,11.7057450969769,0.038024698507431,0,35,12,,,Tile 35,0,0,3
116.670284716567,-26.7039602966201,0,SB24-6,5.14001840169483,13.0751730997076,0.043020928428335,0,34,16,,,Tile 34,0,0,3
116.670269376998,-26.7039459772967,0,SB24-7,3.61343894734297,14.6618284384848,0.026018508149565,0,34,12,,,Tile 34,0,0,3
116.670285942538,-26.7039360207991,0,SB24-8,5.26202702244083,15.7650592028222,0.055014719264321,0,35,10,,,Tile 35,0,0,3
116.670304420325,-26.7039287864347,0,SB24-9,7.10092025573482,16.5666632156077,0.069010898339902,0,34,13,,,Tile 34,0,0,3
116.670283892503,-26.7039148162184,0,SB24-10,5.05801030338636,18.1146361426161,0.05400861601951,0,34,15,,,Tile 34,0,0,3
116.670266335878,-26.7039233348213,0,SB24-11,3.31079012291582,17.1707315962294,0.052012383646126,0,35,11,,,Tile 35,0,0,3
