{
  "dev": {
    "AUTH_SERVER_URL": "",
    "BASE_META_URL": "https://localhost:44336",
    "BASE_DATA_URL": "https://localhost:44336"
  },
  "qa": {
    "AUTH_SERVER_URL": "",
    "BASE_META_URL": "https://localhost:44336",
    "BASE_DATA_URL": "https://localhost:44336"
  },
  "uat": {
    "AUTH_SERVER_URL": "",
    "BASE_META_URL": "https://localhost:44336",
    "BASE_DATA_URL": "https://localhost:44336"
  },
  "prod": {
    "AUTH_SERVER_URL": "",
    "BASE_META_URL": "https://localhost:44336",
    "BASE_DATA_URL": "https://localhost:44336"
  }
}


