(kicad_symbol_lib (version 20220914) (generator kicad_symbol_editor)
  (symbol "Conn_01x20_Male-Connector" (pin_names (offset 1.016) hide) (in_bom yes) (on_board yes)
    (property "Reference" "J" (at 0 25.4 0)
      (effects (font (size 1.27 1.27)))
    )
    (property "Value" "Connector_Conn_01x20_Male" (at 0 -27.94 0)
      (effects (font (size 1.27 1.27)))
    )
    (property "Footprint" "" (at 0 0 0)
      (effects (font (size 1.27 1.27)) hide)
    )
    (property "Datasheet" "" (at 0 0 0)
      (effects (font (size 1.27 1.27)) hide)
    )
    (property "ki_fp_filters" "Connector*:*_1x??_*" (at 0 0 0)
      (effects (font (size 1.27 1.27)) hide)
    )
    (symbol "Conn_01x20_Male-Connector_1_1"
      (polyline
        (pts
          (xy 1.27 -25.4)
          (xy 0.8636 -25.4)
        )
        (stroke (width 0.1524) (type solid))
        (fill (type none))
      )
      (polyline
        (pts
          (xy 1.27 -22.86)
          (xy 0.8636 -22.86)
        )
        (stroke (width 0.1524) (type solid))
        (fill (type none))
      )
      (polyline
        (pts
          (xy 1.27 -20.32)
          (xy 0.8636 -20.32)
        )
        (stroke (width 0.1524) (type solid))
        (fill (type none))
      )
      (polyline
        (pts
          (xy 1.27 -17.78)
          (xy 0.8636 -17.78)
        )
        (stroke (width 0.1524) (type solid))
        (fill (type none))
      )
      (polyline
        (pts
          (xy 1.27 -15.24)
          (xy 0.8636 -15.24)
        )
        (stroke (width 0.1524) (type solid))
        (fill (type none))
      )
      (polyline
        (pts
          (xy 1.27 -12.7)
          (xy 0.8636 -12.7)
        )
        (stroke (width 0.1524) (type solid))
        (fill (type none))
      )
      (polyline
        (pts
          (xy 1.27 -10.16)
          (xy 0.8636 -10.16)
        )
        (stroke (width 0.1524) (type solid))
        (fill (type none))
      )
      (polyline
        (pts
          (xy 1.27 -7.62)
          (xy 0.8636 -7.62)
        )
        (stroke (width 0.1524) (type solid))
        (fill (type none))
      )
      (polyline
        (pts
          (xy 1.27 -5.08)
          (xy 0.8636 -5.08)
        )
        (stroke (width 0.1524) (type solid))
        (fill (type none))
      )
      (polyline
        (pts
          (xy 1.27 -2.54)
          (xy 0.8636 -2.54)
        )
        (stroke (width 0.1524) (type solid))
        (fill (type none))
      )
      (polyline
        (pts
          (xy 1.27 0)
          (xy 0.8636 0)
        )
        (stroke (width 0.1524) (type solid))
        (fill (type none))
      )
      (polyline
        (pts
          (xy 1.27 2.54)
          (xy 0.8636 2.54)
        )
        (stroke (width 0.1524) (type solid))
        (fill (type none))
      )
      (polyline
        (pts
          (xy 1.27 5.08)
          (xy 0.8636 5.08)
        )
        (stroke (width 0.1524) (type solid))
        (fill (type none))
      )
      (polyline
        (pts
          (xy 1.27 7.62)
          (xy 0.8636 7.62)
        )
        (stroke (width 0.1524) (type solid))
        (fill (type none))
      )
      (polyline
        (pts
          (xy 1.27 10.16)
          (xy 0.8636 10.16)
        )
        (stroke (width 0.1524) (type solid))
        (fill (type none))
      )
      (polyline
        (pts
          (xy 1.27 12.7)
          (xy 0.8636 12.7)
        )
        (stroke (width 0.1524) (type solid))
        (fill (type none))
      )
      (polyline
        (pts
          (xy 1.27 15.24)
          (xy 0.8636 15.24)
        )
        (stroke (width 0.1524) (type solid))
        (fill (type none))
      )
      (polyline
        (pts
          (xy 1.27 17.78)
          (xy 0.8636 17.78)
        )
        (stroke (width 0.1524) (type solid))
        (fill (type none))
      )
      (polyline
        (pts
          (xy 1.27 20.32)
          (xy 0.8636 20.32)
        )
        (stroke (width 0.1524) (type solid))
        (fill (type none))
      )
      (polyline
        (pts
          (xy 1.27 22.86)
          (xy 0.8636 22.86)
        )
        (stroke (width 0.1524) (type solid))
        (fill (type none))
      )
      (rectangle (start 0.8636 -25.273) (end 0 -25.527)
        (stroke (width 0.1524) (type solid))
        (fill (type outline))
      )
      (rectangle (start 0.8636 -22.733) (end 0 -22.987)
        (stroke (width 0.1524) (type solid))
        (fill (type outline))
      )
      (rectangle (start 0.8636 -20.193) (end 0 -20.447)
        (stroke (width 0.1524) (type solid))
        (fill (type outline))
      )
      (rectangle (start 0.8636 -17.653) (end 0 -17.907)
        (stroke (width 0.1524) (type solid))
        (fill (type outline))
      )
      (rectangle (start 0.8636 -15.113) (end 0 -15.367)
        (stroke (width 0.1524) (type solid))
        (fill (type outline))
      )
      (rectangle (start 0.8636 -12.573) (end 0 -12.827)
        (stroke (width 0.1524) (type solid))
        (fill (type outline))
      )
      (rectangle (start 0.8636 -10.033) (end 0 -10.287)
        (stroke (width 0.1524) (type solid))
        (fill (type outline))
      )
      (rectangle (start 0.8636 -7.493) (end 0 -7.747)
        (stroke (width 0.1524) (type solid))
        (fill (type outline))
      )
      (rectangle (start 0.8636 -4.953) (end 0 -5.207)
        (stroke (width 0.1524) (type solid))
        (fill (type outline))
      )
      (rectangle (start 0.8636 -2.413) (end 0 -2.667)
        (stroke (width 0.1524) (type solid))
        (fill (type outline))
      )
      (rectangle (start 0.8636 0.127) (end 0 -0.127)
        (stroke (width 0.1524) (type solid))
        (fill (type outline))
      )
      (rectangle (start 0.8636 2.667) (end 0 2.413)
        (stroke (width 0.1524) (type solid))
        (fill (type outline))
      )
      (rectangle (start 0.8636 5.207) (end 0 4.953)
        (stroke (width 0.1524) (type solid))
        (fill (type outline))
      )
      (rectangle (start 0.8636 7.747) (end 0 7.493)
        (stroke (width 0.1524) (type solid))
        (fill (type outline))
      )
      (rectangle (start 0.8636 10.287) (end 0 10.033)
        (stroke (width 0.1524) (type solid))
        (fill (type outline))
      )
      (rectangle (start 0.8636 12.827) (end 0 12.573)
        (stroke (width 0.1524) (type solid))
        (fill (type outline))
      )
      (rectangle (start 0.8636 15.367) (end 0 15.113)
        (stroke (width 0.1524) (type solid))
        (fill (type outline))
      )
      (rectangle (start 0.8636 17.907) (end 0 17.653)
        (stroke (width 0.1524) (type solid))
        (fill (type outline))
      )
      (rectangle (start 0.8636 20.447) (end 0 20.193)
        (stroke (width 0.1524) (type solid))
        (fill (type outline))
      )
      (rectangle (start 0.8636 22.987) (end 0 22.733)
        (stroke (width 0.1524) (type solid))
        (fill (type outline))
      )
      (pin passive line (at 5.08 22.86 180) (length 3.81)
        (name "Pin_1" (effects (font (size 1.27 1.27))))
        (number "1" (effects (font (size 1.27 1.27))))
      )
      (pin passive line (at 5.08 0 180) (length 3.81)
        (name "Pin_10" (effects (font (size 1.27 1.27))))
        (number "10" (effects (font (size 1.27 1.27))))
      )
      (pin passive line (at 5.08 -2.54 180) (length 3.81)
        (name "Pin_11" (effects (font (size 1.27 1.27))))
        (number "11" (effects (font (size 1.27 1.27))))
      )
      (pin passive line (at 5.08 -5.08 180) (length 3.81)
        (name "Pin_12" (effects (font (size 1.27 1.27))))
        (number "12" (effects (font (size 1.27 1.27))))
      )
      (pin passive line (at 5.08 -7.62 180) (length 3.81)
        (name "Pin_13" (effects (font (size 1.27 1.27))))
        (number "13" (effects (font (size 1.27 1.27))))
      )
      (pin passive line (at 5.08 -10.16 180) (length 3.81)
        (name "Pin_14" (effects (font (size 1.27 1.27))))
        (number "14" (effects (font (size 1.27 1.27))))
      )
      (pin passive line (at 5.08 -12.7 180) (length 3.81)
        (name "Pin_15" (effects (font (size 1.27 1.27))))
        (number "15" (effects (font (size 1.27 1.27))))
      )
      (pin passive line (at 5.08 -15.24 180) (length 3.81)
        (name "Pin_16" (effects (font (size 1.27 1.27))))
        (number "16" (effects (font (size 1.27 1.27))))
      )
      (pin passive line (at 5.08 -17.78 180) (length 3.81)
        (name "Pin_17" (effects (font (size 1.27 1.27))))
        (number "17" (effects (font (size 1.27 1.27))))
      )
      (pin passive line (at 5.08 -20.32 180) (length 3.81)
        (name "Pin_18" (effects (font (size 1.27 1.27))))
        (number "18" (effects (font (size 1.27 1.27))))
      )
      (pin passive line (at 5.08 -22.86 180) (length 3.81)
        (name "Pin_19" (effects (font (size 1.27 1.27))))
        (number "19" (effects (font (size 1.27 1.27))))
      )
      (pin passive line (at 5.08 20.32 180) (length 3.81)
        (name "Pin_2" (effects (font (size 1.27 1.27))))
        (number "2" (effects (font (size 1.27 1.27))))
      )
      (pin passive line (at 5.08 -25.4 180) (length 3.81)
        (name "Pin_20" (effects (font (size 1.27 1.27))))
        (number "20" (effects (font (size 1.27 1.27))))
      )
      (pin passive line (at 5.08 17.78 180) (length 3.81)
        (name "Pin_3" (effects (font (size 1.27 1.27))))
        (number "3" (effects (font (size 1.27 1.27))))
      )
      (pin passive line (at 5.08 15.24 180) (length 3.81)
        (name "Pin_4" (effects (font (size 1.27 1.27))))
        (number "4" (effects (font (size 1.27 1.27))))
      )
      (pin passive line (at 5.08 12.7 180) (length 3.81)
        (name "Pin_5" (effects (font (size 1.27 1.27))))
        (number "5" (effects (font (size 1.27 1.27))))
      )
      (pin passive line (at 5.08 10.16 180) (length 3.81)
        (name "Pin_6" (effects (font (size 1.27 1.27))))
        (number "6" (effects (font (size 1.27 1.27))))
      )
      (pin passive line (at 5.08 7.62 180) (length 3.81)
        (name "Pin_7" (effects (font (size 1.27 1.27))))
        (number "7" (effects (font (size 1.27 1.27))))
      )
      (pin passive line (at 5.08 5.08 180) (length 3.81)
        (name "Pin_8" (effects (font (size 1.27 1.27))))
        (number "8" (effects (font (size 1.27 1.27))))
      )
      (pin passive line (at 5.08 2.54 180) (length 3.81)
        (name "Pin_9" (effects (font (size 1.27 1.27))))
        (number "9" (effects (font (size 1.27 1.27))))
      )
    )
  )
  (symbol "R_POT-Device" (pin_names (offset 1.016) hide) (in_bom yes) (on_board yes)
    (property "Reference" "RV" (at -4.445 0 90)
      (effects (font (size 1.27 1.27)))
    )
    (property "Value" "Device_R_POT" (at -2.54 0 90)
      (effects (font (size 1.27 1.27)))
    )
    (property "Footprint" "" (at 0 0 0)
      (effects (font (size 1.27 1.27)) hide)
    )
    (property "Datasheet" "" (at 0 0 0)
      (effects (font (size 1.27 1.27)) hide)
    )
    (property "ki_fp_filters" "Potentiometer*" (at 0 0 0)
      (effects (font (size 1.27 1.27)) hide)
    )
    (symbol "R_POT-Device_0_1"
      (polyline
        (pts
          (xy 2.54 0)
          (xy 1.524 0)
        )
        (stroke (width 0) (type solid))
        (fill (type none))
      )
      (polyline
        (pts
          (xy 1.143 0)
          (xy 2.286 0.508)
          (xy 2.286 -0.508)
          (xy 1.143 0)
        )
        (stroke (width 0) (type solid))
        (fill (type outline))
      )
      (rectangle (start 1.016 2.54) (end -1.016 -2.54)
        (stroke (width 0.254) (type solid))
        (fill (type none))
      )
    )
    (symbol "R_POT-Device_1_1"
      (pin passive line (at 0 3.81 270) (length 1.27)
        (name "1" (effects (font (size 1.27 1.27))))
        (number "1" (effects (font (size 1.27 1.27))))
      )
      (pin passive line (at 3.81 0 180) (length 1.27)
        (name "2" (effects (font (size 1.27 1.27))))
        (number "2" (effects (font (size 1.27 1.27))))
      )
      (pin passive line (at 0 -3.81 90) (length 1.27)
        (name "3" (effects (font (size 1.27 1.27))))
        (number "3" (effects (font (size 1.27 1.27))))
      )
    )
  )
)
