(kicad_symbol_lib (version 20211014) (generator SamacSys_ECAD_Model)
  (symbol "TRF3765IRHBT" (in_bom yes) (on_board yes)
    (property "Reference" "IC" (at 41.91 20.32 0)
      (effects (font (size 1.27 1.27)) (justify left top))
    )
    (property "Value" "TRF3765IRHBT" (at 41.91 17.78 0)
      (effects (font (size 1.27 1.27)) (justify left top))
    )
    (property "Footprint" "QFN50P500X500X100-33M-D" (at 41.91 -82.22 0)
      (effects (font (size 1.27 1.27)) (justify left top) hide)
    )
    (property "Datasheet" "http://www.ti.com/lit/gpn/trf3765" (at 41.91 -182.22 0)
      (effects (font (size 1.27 1.27)) (justify left top) hide)
    )
    (property "ki_description" "300M-4800MHz Low Noise Integer-N/Fractional-N PLL with Integrated VCO and up to 8 Outputs" (at 41.91 -282.22 0)
      (effects (font (size 1.27 1.27)) (justify left top) hide)
    )
    (property "Height" "1" (at 41.91 -382.22 0)
      (effects (font (size 1.27 1.27)) (justify left top) hide)
    )
    (property "Mouser Part Number" "595-TRF3765IRHBT" (at 41.91 -482.22 0)
      (effects (font (size 1.27 1.27)) (justify left top) hide)
    )
    (property "Mouser Price/Stock" "https://www.mouser.com/Search/Refine.aspx?Keyword=595-TRF3765IRHBT" (at 41.91 -582.22 0)
      (effects (font (size 1.27 1.27)) (justify left top) hide)
    )
    (property "Manufacturer_Name" "Texas Instruments" (at 41.91 -682.22 0)
      (effects (font (size 1.27 1.27)) (justify left top) hide)
    )
    (property "Manufacturer_Part_Number" "TRF3765IRHBT" (at 41.91 -782.22 0)
      (effects (font (size 1.27 1.27)) (justify left top) hide)
    )
    (rectangle
      (start 5.08 15.24)
      (end 40.64 -33.02)
      (stroke (width 0.254) (type default))
      (fill (type background))
    )
    (pin passive line (at 0 0 0) (length 5.08)
      (name "GND_DIG" (effects (font (size 1.27 1.27))))
      (number "1" (effects (font (size 1.27 1.27))))
    )
    (pin passive line (at 0 -2.54 0) (length 5.08)
      (name "VCC_DIG" (effects (font (size 1.27 1.27))))
      (number "2" (effects (font (size 1.27 1.27))))
    )
    (pin passive line (at 0 -5.08 0) (length 5.08)
      (name "DATA" (effects (font (size 1.27 1.27))))
      (number "3" (effects (font (size 1.27 1.27))))
    )
    (pin passive line (at 0 -7.62 0) (length 5.08)
      (name "CLOCK" (effects (font (size 1.27 1.27))))
      (number "4" (effects (font (size 1.27 1.27))))
    )
    (pin passive line (at 0 -10.16 0) (length 5.08)
      (name "STROBE" (effects (font (size 1.27 1.27))))
      (number "5" (effects (font (size 1.27 1.27))))
    )
    (pin passive line (at 0 -12.7 0) (length 5.08)
      (name "READBACK" (effects (font (size 1.27 1.27))))
      (number "6" (effects (font (size 1.27 1.27))))
    )
    (pin passive line (at 0 -15.24 0) (length 5.08)
      (name "VCC_DIV" (effects (font (size 1.27 1.27))))
      (number "7" (effects (font (size 1.27 1.27))))
    )
    (pin passive line (at 0 -17.78 0) (length 5.08)
      (name "GND_BUFF1" (effects (font (size 1.27 1.27))))
      (number "8" (effects (font (size 1.27 1.27))))
    )
    (pin passive line (at 12.7 -38.1 90) (length 5.08)
      (name "LO1_OUTP" (effects (font (size 1.27 1.27))))
      (number "9" (effects (font (size 1.27 1.27))))
    )
    (pin passive line (at 15.24 -38.1 90) (length 5.08)
      (name "LO1_OUTM" (effects (font (size 1.27 1.27))))
      (number "10" (effects (font (size 1.27 1.27))))
    )
    (pin passive line (at 17.78 -38.1 90) (length 5.08)
      (name "LO2_OUTM" (effects (font (size 1.27 1.27))))
      (number "11" (effects (font (size 1.27 1.27))))
    )
    (pin passive line (at 20.32 -38.1 90) (length 5.08)
      (name "LO2_OUTP" (effects (font (size 1.27 1.27))))
      (number "12" (effects (font (size 1.27 1.27))))
    )
    (pin passive line (at 22.86 -38.1 90) (length 5.08)
      (name "LO3_OUTP" (effects (font (size 1.27 1.27))))
      (number "13" (effects (font (size 1.27 1.27))))
    )
    (pin passive line (at 25.4 -38.1 90) (length 5.08)
      (name "LO3_OUTM" (effects (font (size 1.27 1.27))))
      (number "14" (effects (font (size 1.27 1.27))))
    )
    (pin passive line (at 27.94 -38.1 90) (length 5.08)
      (name "LO4_OUTM" (effects (font (size 1.27 1.27))))
      (number "15" (effects (font (size 1.27 1.27))))
    )
    (pin passive line (at 30.48 -38.1 90) (length 5.08)
      (name "LO4_OUTP" (effects (font (size 1.27 1.27))))
      (number "16" (effects (font (size 1.27 1.27))))
    )
    (pin passive line (at 45.72 0 180) (length 5.08)
      (name "VTUNE_REF" (effects (font (size 1.27 1.27))))
      (number "24" (effects (font (size 1.27 1.27))))
    )
    (pin passive line (at 45.72 -2.54 180) (length 5.08)
      (name "VTUNE_IN" (effects (font (size 1.27 1.27))))
      (number "23" (effects (font (size 1.27 1.27))))
    )
    (pin passive line (at 45.72 -5.08 180) (length 5.08)
      (name "GND_OSC" (effects (font (size 1.27 1.27))))
      (number "22" (effects (font (size 1.27 1.27))))
    )
    (pin passive line (at 45.72 -7.62 180) (length 5.08)
      (name "VCC_OSC" (effects (font (size 1.27 1.27))))
      (number "21" (effects (font (size 1.27 1.27))))
    )
    (pin passive line (at 45.72 -10.16 180) (length 5.08)
      (name "VCC_TK" (effects (font (size 1.27 1.27))))
      (number "20" (effects (font (size 1.27 1.27))))
    )
    (pin passive line (at 45.72 -12.7 180) (length 5.08)
      (name "EXTVCO_CTRL" (effects (font (size 1.27 1.27))))
      (number "19" (effects (font (size 1.27 1.27))))
    )
    (pin passive line (at 45.72 -15.24 180) (length 5.08)
      (name "EXTVCO_IN" (effects (font (size 1.27 1.27))))
      (number "18" (effects (font (size 1.27 1.27))))
    )
    (pin passive line (at 45.72 -17.78 180) (length 5.08)
      (name "GND_BUFF2" (effects (font (size 1.27 1.27))))
      (number "17" (effects (font (size 1.27 1.27))))
    )
    (pin passive line (at 12.7 20.32 270) (length 5.08)
      (name "EP" (effects (font (size 1.27 1.27))))
      (number "33" (effects (font (size 1.27 1.27))))
    )
    (pin passive line (at 15.24 20.32 270) (length 5.08)
      (name "LD" (effects (font (size 1.27 1.27))))
      (number "32" (effects (font (size 1.27 1.27))))
    )
    (pin passive line (at 17.78 20.32 270) (length 5.08)
      (name "GND_2" (effects (font (size 1.27 1.27))))
      (number "31" (effects (font (size 1.27 1.27))))
    )
    (pin passive line (at 20.32 20.32 270) (length 5.08)
      (name "REF_IN" (effects (font (size 1.27 1.27))))
      (number "30" (effects (font (size 1.27 1.27))))
    )
    (pin passive line (at 22.86 20.32 270) (length 5.08)
      (name "GND_1" (effects (font (size 1.27 1.27))))
      (number "29" (effects (font (size 1.27 1.27))))
    )
    (pin passive line (at 25.4 20.32 270) (length 5.08)
      (name "VCC_PLL" (effects (font (size 1.27 1.27))))
      (number "28" (effects (font (size 1.27 1.27))))
    )
    (pin passive line (at 27.94 20.32 270) (length 5.08)
      (name "VCC_CP" (effects (font (size 1.27 1.27))))
      (number "27" (effects (font (size 1.27 1.27))))
    )
    (pin passive line (at 30.48 20.32 270) (length 5.08)
      (name "CP_OUT" (effects (font (size 1.27 1.27))))
      (number "26" (effects (font (size 1.27 1.27))))
    )
    (pin passive line (at 33.02 20.32 270) (length 5.08)
      (name "CP_REF" (effects (font (size 1.27 1.27))))
      (number "25" (effects (font (size 1.27 1.27))))
    )
  )
)
