(kicad_sch (version 20230121) (generator eeschema)

  (uuid 3af62524-98f9-4392-9d37-ff91ea75a7fd)

  (paper "A4")

  (title_block
    (title "Étage conversion modulateur carte HERMES")
    (rev "2.1")
    (company "IUT GEII")
    (comment 1 "LAFFEZ J. - LOUISE K. - ANDRIEU J.")
  )

  (lib_symbols
    (symbol "Device:R" (pin_numbers hide) (pin_names (offset 0)) (in_bom yes) (on_board yes)
      (property "Reference" "R" (at 2.032 0 90)
        (effects (font (size 1.27 1.27)))
      )
      (property "Value" "R" (at 0 0 90)
        (effects (font (size 1.27 1.27)))
      )
      (property "Footprint" "" (at -1.778 0 90)
        (effects (font (size 1.27 1.27)) hide)
      )
      (property "Datasheet" "~" (at 0 0 0)
        (effects (font (size 1.27 1.27)) hide)
      )
      (property "ki_keywords" "R res resistor" (at 0 0 0)
        (effects (font (size 1.27 1.27)) hide)
      )
      (property "ki_description" "Resistor" (at 0 0 0)
        (effects (font (size 1.27 1.27)) hide)
      )
      (property "ki_fp_filters" "R_*" (at 0 0 0)
        (effects (font (size 1.27 1.27)) hide)
      )
      (symbol "R_0_1"
        (rectangle (start -1.016 -2.54) (end 1.016 2.54)
          (stroke (width 0.254) (type default))
          (fill (type none))
        )
      )
      (symbol "R_1_1"
        (pin passive line (at 0 3.81 270) (length 1.27)
          (name "~" (effects (font (size 1.27 1.27))))
          (number "1" (effects (font (size 1.27 1.27))))
        )
        (pin passive line (at 0 -3.81 90) (length 1.27)
          (name "~" (effects (font (size 1.27 1.27))))
          (number "2" (effects (font (size 1.27 1.27))))
        )
      )
    )
    (symbol "Switch:SW_DIP_x08" (pin_names (offset 0) hide) (in_bom yes) (on_board yes)
      (property "Reference" "SW" (at 0 13.97 0)
        (effects (font (size 1.27 1.27)))
      )
      (property "Value" "SW_DIP_x08" (at 0 -11.43 0)
        (effects (font (size 1.27 1.27)))
      )
      (property "Footprint" "" (at 0 0 0)
        (effects (font (size 1.27 1.27)) hide)
      )
      (property "Datasheet" "~" (at 0 0 0)
        (effects (font (size 1.27 1.27)) hide)
      )
      (property "ki_keywords" "dip switch" (at 0 0 0)
        (effects (font (size 1.27 1.27)) hide)
      )
      (property "ki_description" "8x DIP Switch, Single Pole Single Throw (SPST) switch, small symbol" (at 0 0 0)
        (effects (font (size 1.27 1.27)) hide)
      )
      (property "ki_fp_filters" "SW?DIP?x8*" (at 0 0 0)
        (effects (font (size 1.27 1.27)) hide)
      )
      (symbol "SW_DIP_x08_0_0"
        (circle (center -2.032 -7.62) (radius 0.508)
          (stroke (width 0) (type default))
          (fill (type none))
        )
        (circle (center -2.032 -5.08) (radius 0.508)
          (stroke (width 0) (type default))
          (fill (type none))
        )
        (circle (center -2.032 -2.54) (radius 0.508)
          (stroke (width 0) (type default))
          (fill (type none))
        )
        (circle (center -2.032 0) (radius 0.508)
          (stroke (width 0) (type default))
          (fill (type none))
        )
        (circle (center -2.032 2.54) (radius 0.508)
          (stroke (width 0) (type default))
          (fill (type none))
        )
        (circle (center -2.032 5.08) (radius 0.508)
          (stroke (width 0) (type default))
          (fill (type none))
        )
        (circle (center -2.032 7.62) (radius 0.508)
          (stroke (width 0) (type default))
          (fill (type none))
        )
        (circle (center -2.032 10.16) (radius 0.508)
          (stroke (width 0) (type default))
          (fill (type none))
        )
        (polyline
          (pts
            (xy -1.524 -7.4676)
            (xy 2.3622 -6.4262)
          )
          (stroke (width 0) (type default))
          (fill (type none))
        )
        (polyline
          (pts
            (xy -1.524 -4.9276)
            (xy 2.3622 -3.8862)
          )
          (stroke (width 0) (type default))
          (fill (type none))
        )
        (polyline
          (pts
            (xy -1.524 -2.3876)
            (xy 2.3622 -1.3462)
          )
          (stroke (width 0) (type default))
          (fill (type none))
        )
        (polyline
          (pts
            (xy -1.524 0.127)
            (xy 2.3622 1.1684)
          )
          (stroke (width 0) (type default))
          (fill (type none))
        )
        (polyline
          (pts
            (xy -1.524 2.667)
            (xy 2.3622 3.7084)
          )
          (stroke (width 0) (type default))
          (fill (type none))
        )
        (polyline
          (pts
            (xy -1.524 5.207)
            (xy 2.3622 6.2484)
          )
          (stroke (width 0) (type default))
          (fill (type none))
        )
        (polyline
          (pts
            (xy -1.524 7.747)
            (xy 2.3622 8.7884)
          )
          (stroke (width 0) (type default))
          (fill (type none))
        )
        (polyline
          (pts
            (xy -1.524 10.287)
            (xy 2.3622 11.3284)
          )
          (stroke (width 0) (type default))
          (fill (type none))
        )
        (circle (center 2.032 -7.62) (radius 0.508)
          (stroke (width 0) (type default))
          (fill (type none))
        )
        (circle (center 2.032 -5.08) (radius 0.508)
          (stroke (width 0) (type default))
          (fill (type none))
        )
        (circle (center 2.032 -2.54) (radius 0.508)
          (stroke (width 0) (type default))
          (fill (type none))
        )
        (circle (center 2.032 0) (radius 0.508)
          (stroke (width 0) (type default))
          (fill (type none))
        )
        (circle (center 2.032 2.54) (radius 0.508)
          (stroke (width 0) (type default))
          (fill (type none))
        )
        (circle (center 2.032 5.08) (radius 0.508)
          (stroke (width 0) (type default))
          (fill (type none))
        )
        (circle (center 2.032 7.62) (radius 0.508)
          (stroke (width 0) (type default))
          (fill (type none))
        )
        (circle (center 2.032 10.16) (radius 0.508)
          (stroke (width 0) (type default))
          (fill (type none))
        )
      )
      (symbol "SW_DIP_x08_0_1"
        (rectangle (start -3.81 12.7) (end 3.81 -10.16)
          (stroke (width 0.254) (type default))
          (fill (type background))
        )
      )
      (symbol "SW_DIP_x08_1_1"
        (pin passive line (at -7.62 10.16 0) (length 5.08)
          (name "~" (effects (font (size 1.27 1.27))))
          (number "1" (effects (font (size 1.27 1.27))))
        )
        (pin passive line (at 7.62 -5.08 180) (length 5.08)
          (name "~" (effects (font (size 1.27 1.27))))
          (number "10" (effects (font (size 1.27 1.27))))
        )
        (pin passive line (at 7.62 -2.54 180) (length 5.08)
          (name "~" (effects (font (size 1.27 1.27))))
          (number "11" (effects (font (size 1.27 1.27))))
        )
        (pin passive line (at 7.62 0 180) (length 5.08)
          (name "~" (effects (font (size 1.27 1.27))))
          (number "12" (effects (font (size 1.27 1.27))))
        )
        (pin passive line (at 7.62 2.54 180) (length 5.08)
          (name "~" (effects (font (size 1.27 1.27))))
          (number "13" (effects (font (size 1.27 1.27))))
        )
        (pin passive line (at 7.62 5.08 180) (length 5.08)
          (name "~" (effects (font (size 1.27 1.27))))
          (number "14" (effects (font (size 1.27 1.27))))
        )
        (pin passive line (at 7.62 7.62 180) (length 5.08)
          (name "~" (effects (font (size 1.27 1.27))))
          (number "15" (effects (font (size 1.27 1.27))))
        )
        (pin passive line (at 7.62 10.16 180) (length 5.08)
          (name "~" (effects (font (size 1.27 1.27))))
          (number "16" (effects (font (size 1.27 1.27))))
        )
        (pin passive line (at -7.62 7.62 0) (length 5.08)
          (name "~" (effects (font (size 1.27 1.27))))
          (number "2" (effects (font (size 1.27 1.27))))
        )
        (pin passive line (at -7.62 5.08 0) (length 5.08)
          (name "~" (effects (font (size 1.27 1.27))))
          (number "3" (effects (font (size 1.27 1.27))))
        )
        (pin passive line (at -7.62 2.54 0) (length 5.08)
          (name "~" (effects (font (size 1.27 1.27))))
          (number "4" (effects (font (size 1.27 1.27))))
        )
        (pin passive line (at -7.62 0 0) (length 5.08)
          (name "~" (effects (font (size 1.27 1.27))))
          (number "5" (effects (font (size 1.27 1.27))))
        )
        (pin passive line (at -7.62 -2.54 0) (length 5.08)
          (name "~" (effects (font (size 1.27 1.27))))
          (number "6" (effects (font (size 1.27 1.27))))
        )
        (pin passive line (at -7.62 -5.08 0) (length 5.08)
          (name "~" (effects (font (size 1.27 1.27))))
          (number "7" (effects (font (size 1.27 1.27))))
        )
        (pin passive line (at -7.62 -7.62 0) (length 5.08)
          (name "~" (effects (font (size 1.27 1.27))))
          (number "8" (effects (font (size 1.27 1.27))))
        )
        (pin passive line (at 7.62 -7.62 180) (length 5.08)
          (name "~" (effects (font (size 1.27 1.27))))
          (number "9" (effects (font (size 1.27 1.27))))
        )
      )
    )
    (symbol "Switch:SW_Push" (pin_numbers hide) (pin_names (offset 1.016) hide) (in_bom yes) (on_board yes)
      (property "Reference" "SW" (at 1.27 2.54 0)
        (effects (font (size 1.27 1.27)) (justify left))
      )
      (property "Value" "SW_Push" (at 0 -1.524 0)
        (effects (font (size 1.27 1.27)))
      )
      (property "Footprint" "" (at 0 5.08 0)
        (effects (font (size 1.27 1.27)) hide)
      )
      (property "Datasheet" "~" (at 0 5.08 0)
        (effects (font (size 1.27 1.27)) hide)
      )
      (property "ki_keywords" "switch normally-open pushbutton push-button" (at 0 0 0)
        (effects (font (size 1.27 1.27)) hide)
      )
      (property "ki_description" "Push button switch, generic, two pins" (at 0 0 0)
        (effects (font (size 1.27 1.27)) hide)
      )
      (symbol "SW_Push_0_1"
        (circle (center -2.032 0) (radius 0.508)
          (stroke (width 0) (type default))
          (fill (type none))
        )
        (polyline
          (pts
            (xy 0 1.27)
            (xy 0 3.048)
          )
          (stroke (width 0) (type default))
          (fill (type none))
        )
        (polyline
          (pts
            (xy 2.54 1.27)
            (xy -2.54 1.27)
          )
          (stroke (width 0) (type default))
          (fill (type none))
        )
        (circle (center 2.032 0) (radius 0.508)
          (stroke (width 0) (type default))
          (fill (type none))
        )
        (pin passive line (at -5.08 0 0) (length 2.54)
          (name "1" (effects (font (size 1.27 1.27))))
          (number "1" (effects (font (size 1.27 1.27))))
        )
        (pin passive line (at 5.08 0 180) (length 2.54)
          (name "2" (effects (font (size 1.27 1.27))))
          (number "2" (effects (font (size 1.27 1.27))))
        )
      )
    )
    (symbol "power:GND" (power) (pin_names (offset 0)) (in_bom yes) (on_board yes)
      (property "Reference" "#PWR" (at 0 -6.35 0)
        (effects (font (size 1.27 1.27)) hide)
      )
      (property "Value" "GND" (at 0 -3.81 0)
        (effects (font (size 1.27 1.27)))
      )
      (property "Footprint" "" (at 0 0 0)
        (effects (font (size 1.27 1.27)) hide)
      )
      (property "Datasheet" "" (at 0 0 0)
        (effects (font (size 1.27 1.27)) hide)
      )
      (property "ki_keywords" "global power" (at 0 0 0)
        (effects (font (size 1.27 1.27)) hide)
      )
      (property "ki_description" "Power symbol creates a global label with name \"GND\" , ground" (at 0 0 0)
        (effects (font (size 1.27 1.27)) hide)
      )
      (symbol "GND_0_1"
        (polyline
          (pts
            (xy 0 0)
            (xy 0 -1.27)
            (xy 1.27 -1.27)
            (xy 0 -2.54)
            (xy -1.27 -1.27)
            (xy 0 -1.27)
          )
          (stroke (width 0) (type default))
          (fill (type none))
        )
      )
      (symbol "GND_1_1"
        (pin power_in line (at 0 0 270) (length 0) hide
          (name "GND" (effects (font (size 1.27 1.27))))
          (number "1" (effects (font (size 1.27 1.27))))
        )
      )
    )
  )

  (junction (at 144.78 73.66) (diameter 0) (color 0 0 0 0)
    (uuid 0dfba7dc-47fb-4202-980d-9889d7e4153f)
  )
  (junction (at 186.69 50.8) (diameter 0) (color 0 0 0 0)
    (uuid 1981eab7-ee28-4b54-a18e-44ae86869e9c)
  )
  (junction (at 175.26 71.12) (diameter 0) (color 0 0 0 0)
    (uuid 1a7e6578-d3a3-4682-9527-828d31d770e6)
  )
  (junction (at 63.5 68.58) (diameter 0) (color 0 0 0 0)
    (uuid 21589301-6c7e-4d3d-bb16-06a879ec9388)
  )
  (junction (at 190.5 81.28) (diameter 0) (color 0 0 0 0)
    (uuid 2a925018-51f2-4abb-92d4-40e00ef696e2)
  )
  (junction (at 194.31 83.82) (diameter 0) (color 0 0 0 0)
    (uuid 3ad9c881-af7d-4926-9854-7fdcbab7a3bf)
  )
  (junction (at 179.07 50.8) (diameter 0) (color 0 0 0 0)
    (uuid 5c8dafb1-5ad7-4b3a-bcd9-3a6e95152473)
  )
  (junction (at 144.78 76.2) (diameter 0) (color 0 0 0 0)
    (uuid 5d5989fa-2802-4737-99d8-5310eef92bae)
  )
  (junction (at 182.88 76.2) (diameter 0) (color 0 0 0 0)
    (uuid 6db48acc-4593-40ee-aca7-42022a2b7ae0)
  )
  (junction (at 144.78 68.58) (diameter 0) (color 0 0 0 0)
    (uuid 70362b24-0ac6-430c-a40f-f8307c8505ad)
  )
  (junction (at 175.26 50.8) (diameter 0) (color 0 0 0 0)
    (uuid 727fdf0b-8cc6-4e1f-90bd-4a7801f9ee2d)
  )
  (junction (at 171.45 50.8) (diameter 0) (color 0 0 0 0)
    (uuid 803adf4d-18f6-461c-ac83-e3155c52f3c0)
  )
  (junction (at 167.64 66.04) (diameter 0) (color 0 0 0 0)
    (uuid 8202b7c4-9464-4141-815f-d099a2c9de7a)
  )
  (junction (at 171.45 68.58) (diameter 0) (color 0 0 0 0)
    (uuid 84125f1b-3700-4277-bbde-a47ca2c9b098)
  )
  (junction (at 182.88 50.8) (diameter 0) (color 0 0 0 0)
    (uuid 861c7355-beb1-42dd-99c5-64ad6bc7bbe1)
  )
  (junction (at 83.82 68.58) (diameter 0) (color 0 0 0 0)
    (uuid 86748ab9-b959-45ba-9dda-a2d1a2d1e007)
  )
  (junction (at 144.78 71.12) (diameter 0) (color 0 0 0 0)
    (uuid 9c1c913a-6942-4e91-968a-666c915b07c0)
  )
  (junction (at 190.5 50.8) (diameter 0) (color 0 0 0 0)
    (uuid b8f39a5e-6598-4758-9814-fa85541dce6c)
  )
  (junction (at 144.78 83.82) (diameter 0) (color 0 0 0 0)
    (uuid cccf8e8b-a430-42f7-9011-8cc99ca78000)
  )
  (junction (at 179.07 73.66) (diameter 0) (color 0 0 0 0)
    (uuid ce2c3830-9179-4073-9aac-1aa21126e1c1)
  )
  (junction (at 194.31 50.8) (diameter 0) (color 0 0 0 0)
    (uuid d7e84eec-714d-4cb8-9cef-8b1321778a78)
  )
  (junction (at 144.78 78.74) (diameter 0) (color 0 0 0 0)
    (uuid e1b39912-7343-44da-9116-50b521e9aedf)
  )
  (junction (at 144.78 81.28) (diameter 0) (color 0 0 0 0)
    (uuid f1c3d5a6-8cca-4c21-ab97-4753a79a71e2)
  )
  (junction (at 186.69 78.74) (diameter 0) (color 0 0 0 0)
    (uuid fca873cd-f592-48c8-8499-b39187157f5b)
  )

  (wire (pts (xy 194.31 54.61) (xy 194.31 50.8))
    (stroke (width 0) (type default))
    (uuid 074f52a3-f529-41b8-8917-2914ef3fcfff)
  )
  (wire (pts (xy 171.45 68.58) (xy 171.45 62.23))
    (stroke (width 0) (type default))
    (uuid 0df3d16f-fb61-40cb-82e9-28835133a0a4)
  )
  (wire (pts (xy 163.83 71.12) (xy 175.26 71.12))
    (stroke (width 0) (type default))
    (uuid 0f63c6fe-c39f-4c84-b89e-10223b6c05fb)
  )
  (wire (pts (xy 63.5 68.58) (xy 67.31 68.58))
    (stroke (width 0) (type default))
    (uuid 226a0e0a-8e7b-4804-8d96-858a79fbeb91)
  )
  (wire (pts (xy 179.07 73.66) (xy 179.07 62.23))
    (stroke (width 0) (type default))
    (uuid 389922ce-c164-4c37-a4c0-96a89b490781)
  )
  (wire (pts (xy 63.5 72.39) (xy 63.5 68.58))
    (stroke (width 0) (type default))
    (uuid 398e1bd7-669b-4f7f-9018-45287f350d64)
  )
  (wire (pts (xy 171.45 54.61) (xy 171.45 50.8))
    (stroke (width 0) (type default))
    (uuid 3b3003ef-807c-48a0-99df-40179e8007d0)
  )
  (wire (pts (xy 163.83 76.2) (xy 182.88 76.2))
    (stroke (width 0) (type default))
    (uuid 421bf83e-23d9-489d-82a7-a0a82c06e66b)
  )
  (wire (pts (xy 144.78 68.58) (xy 148.59 68.58))
    (stroke (width 0) (type default))
    (uuid 42c8ebb0-22d8-4464-9e24-dfe0d3f85891)
  )
  (wire (pts (xy 179.07 50.8) (xy 182.88 50.8))
    (stroke (width 0) (type default))
    (uuid 42dd20f0-d613-418e-b7e6-15b830e21a8c)
  )
  (wire (pts (xy 163.83 83.82) (xy 194.31 83.82))
    (stroke (width 0) (type default))
    (uuid 45080505-2a58-497c-8526-dd6c5953bf02)
  )
  (wire (pts (xy 163.83 66.04) (xy 167.64 66.04))
    (stroke (width 0) (type default))
    (uuid 4e4ee5c4-9289-4989-90e0-106ec3398239)
  )
  (wire (pts (xy 175.26 54.61) (xy 175.26 50.8))
    (stroke (width 0) (type default))
    (uuid 530f5a29-c72f-44e1-b161-fe3e14393603)
  )
  (wire (pts (xy 182.88 76.2) (xy 182.88 62.23))
    (stroke (width 0) (type default))
    (uuid 563258e5-0a60-45f6-8d15-d551f59ecfcd)
  )
  (wire (pts (xy 144.78 83.82) (xy 144.78 87.63))
    (stroke (width 0) (type default))
    (uuid 592e86d8-fecf-4478-ac7c-64249ec655e9)
  )
  (wire (pts (xy 179.07 54.61) (xy 179.07 50.8))
    (stroke (width 0) (type default))
    (uuid 60904ef2-7767-4393-bc72-8d174ec300b7)
  )
  (wire (pts (xy 194.31 46.99) (xy 194.31 50.8))
    (stroke (width 0) (type default))
    (uuid 626691d3-841d-4726-84b0-47b79485982b)
  )
  (wire (pts (xy 83.82 86.36) (xy 83.82 82.55))
    (stroke (width 0) (type default))
    (uuid 62c46e0e-877e-4589-a455-ef91b31974f8)
  )
  (wire (pts (xy 190.5 81.28) (xy 198.12 81.28))
    (stroke (width 0) (type default))
    (uuid 652da5e8-f829-49b5-816d-fe65da51b0cc)
  )
  (wire (pts (xy 63.5 68.58) (xy 63.5 64.77))
    (stroke (width 0) (type default))
    (uuid 6665aff0-a21b-4aed-be40-707e72d80213)
  )
  (wire (pts (xy 190.5 50.8) (xy 194.31 50.8))
    (stroke (width 0) (type default))
    (uuid 66dcdf32-c8fc-49a2-863c-9d5fa3310437)
  )
  (wire (pts (xy 163.83 68.58) (xy 171.45 68.58))
    (stroke (width 0) (type default))
    (uuid 66e54a6c-8f35-4ee7-9d2c-420c6398b3ce)
  )
  (wire (pts (xy 171.45 50.8) (xy 175.26 50.8))
    (stroke (width 0) (type default))
    (uuid 6edd279c-4832-4ee3-821d-2953645e6b52)
  )
  (wire (pts (xy 190.5 81.28) (xy 190.5 62.23))
    (stroke (width 0) (type default))
    (uuid 6fc877a1-33ee-4e76-8204-8494c0b8f9ed)
  )
  (wire (pts (xy 182.88 50.8) (xy 186.69 50.8))
    (stroke (width 0) (type default))
    (uuid 717ddcd0-6321-4ae1-8943-164f4447ebba)
  )
  (wire (pts (xy 167.64 66.04) (xy 167.64 62.23))
    (stroke (width 0) (type default))
    (uuid 7a8c4baa-903a-47a0-a169-3e699dfdbe87)
  )
  (wire (pts (xy 83.82 68.58) (xy 87.63 68.58))
    (stroke (width 0) (type default))
    (uuid 7bcdf075-a73b-4b78-8ec5-c171867c3caa)
  )
  (wire (pts (xy 182.88 54.61) (xy 182.88 50.8))
    (stroke (width 0) (type default))
    (uuid 7cb31e77-1dc5-44cc-8a32-86235d5683a0)
  )
  (wire (pts (xy 167.64 66.04) (xy 198.12 66.04))
    (stroke (width 0) (type default))
    (uuid 8d8d03fb-b3f0-4adb-9083-9911b05a5df1)
  )
  (wire (pts (xy 194.31 83.82) (xy 194.31 62.23))
    (stroke (width 0) (type default))
    (uuid 92532c09-6fe7-4a9d-9b95-f642e9c2df6b)
  )
  (wire (pts (xy 175.26 50.8) (xy 179.07 50.8))
    (stroke (width 0) (type default))
    (uuid 93e2cc57-9410-4fc2-98ca-04cbc8f910e5)
  )
  (wire (pts (xy 144.78 71.12) (xy 148.59 71.12))
    (stroke (width 0) (type default))
    (uuid 95015991-789f-49c1-ab29-57239a26bc04)
  )
  (wire (pts (xy 163.83 73.66) (xy 179.07 73.66))
    (stroke (width 0) (type default))
    (uuid 9baf4fd6-65f4-43ed-b204-2c5a8c5c9b41)
  )
  (wire (pts (xy 63.5 86.36) (xy 63.5 82.55))
    (stroke (width 0) (type default))
    (uuid 9d24333b-84b3-4247-97f9-10e6c9dcd3d6)
  )
  (wire (pts (xy 186.69 78.74) (xy 186.69 62.23))
    (stroke (width 0) (type default))
    (uuid 9da8e155-e5e9-475e-afd7-c97ee8ec88a5)
  )
  (wire (pts (xy 144.78 83.82) (xy 144.78 81.28))
    (stroke (width 0) (type default))
    (uuid 9e7bfa67-712a-475b-8215-59916fa3763e)
  )
  (wire (pts (xy 144.78 81.28) (xy 144.78 78.74))
    (stroke (width 0) (type default))
    (uuid 9e8a321d-e32d-4830-829c-b732e6316718)
  )
  (wire (pts (xy 144.78 78.74) (xy 148.59 78.74))
    (stroke (width 0) (type default))
    (uuid a24767b4-42f2-4273-9918-9a9aa1c49c9b)
  )
  (wire (pts (xy 83.82 57.15) (xy 83.82 53.34))
    (stroke (width 0) (type default))
    (uuid a7a93304-4eaa-46aa-b241-3a0d6379ddc7)
  )
  (wire (pts (xy 144.78 73.66) (xy 144.78 76.2))
    (stroke (width 0) (type default))
    (uuid ad76cd2a-2787-47df-bcb8-9e9b00af87c9)
  )
  (wire (pts (xy 171.45 68.58) (xy 198.12 68.58))
    (stroke (width 0) (type default))
    (uuid ae1d3f41-add0-483a-b1f4-c50eff802ca9)
  )
  (wire (pts (xy 186.69 54.61) (xy 186.69 50.8))
    (stroke (width 0) (type default))
    (uuid ae8a8da5-cb99-4cc0-b84e-b9b97e67a916)
  )
  (wire (pts (xy 144.78 71.12) (xy 144.78 68.58))
    (stroke (width 0) (type default))
    (uuid aeb236e8-67f2-48a0-b44d-084d1f184634)
  )
  (wire (pts (xy 83.82 72.39) (xy 83.82 68.58))
    (stroke (width 0) (type default))
    (uuid af7c3fce-dea1-48d4-b2b7-8806f30a7855)
  )
  (wire (pts (xy 186.69 50.8) (xy 190.5 50.8))
    (stroke (width 0) (type default))
    (uuid b19f011f-daa8-4fdb-ab1b-fd5a2d583a3d)
  )
  (wire (pts (xy 163.83 78.74) (xy 186.69 78.74))
    (stroke (width 0) (type default))
    (uuid b7d6dd95-db59-48c7-80ec-2706c0a8c838)
  )
  (wire (pts (xy 179.07 73.66) (xy 198.12 73.66))
    (stroke (width 0) (type default))
    (uuid b8719da0-7702-4ec5-bda6-98f9eac0abb7)
  )
  (wire (pts (xy 148.59 73.66) (xy 144.78 73.66))
    (stroke (width 0) (type default))
    (uuid b9f1b8c0-0dde-4e70-8397-443b5806918e)
  )
  (wire (pts (xy 167.64 54.61) (xy 167.64 50.8))
    (stroke (width 0) (type default))
    (uuid ba520aba-6fb8-42a5-8565-049dfa27a07f)
  )
  (wire (pts (xy 194.31 83.82) (xy 198.12 83.82))
    (stroke (width 0) (type default))
    (uuid c8e61e53-fd6b-45ce-bae8-be76e35bc9c7)
  )
  (wire (pts (xy 63.5 57.15) (xy 63.5 53.34))
    (stroke (width 0) (type default))
    (uuid cf9af8db-4623-4337-9251-ce978e333a8d)
  )
  (wire (pts (xy 144.78 78.74) (xy 144.78 76.2))
    (stroke (width 0) (type default))
    (uuid d0cc6ba0-79ff-4abe-966b-9587abe4ed4a)
  )
  (wire (pts (xy 144.78 81.28) (xy 148.59 81.28))
    (stroke (width 0) (type default))
    (uuid d10eec8e-e10e-4b83-b2b7-6de4561b76bc)
  )
  (wire (pts (xy 190.5 54.61) (xy 190.5 50.8))
    (stroke (width 0) (type default))
    (uuid d2a1508b-d96e-44d3-a20a-424189d0712b)
  )
  (wire (pts (xy 167.64 50.8) (xy 171.45 50.8))
    (stroke (width 0) (type default))
    (uuid dbdf10a1-3118-4fc1-8db6-2736ddb7a6d6)
  )
  (wire (pts (xy 144.78 66.04) (xy 148.59 66.04))
    (stroke (width 0) (type default))
    (uuid dc3f0fdd-58f4-4326-9874-f62cf1caa786)
  )
  (wire (pts (xy 186.69 78.74) (xy 198.12 78.74))
    (stroke (width 0) (type default))
    (uuid e768e5a1-acd6-4dd7-a1df-d2f8be0dea1c)
  )
  (wire (pts (xy 182.88 76.2) (xy 198.12 76.2))
    (stroke (width 0) (type default))
    (uuid ea7144a0-8821-4941-966c-06c17347dc02)
  )
  (wire (pts (xy 163.83 81.28) (xy 190.5 81.28))
    (stroke (width 0) (type default))
    (uuid eace02ce-18c2-4387-b674-f792cd9e92ea)
  )
  (wire (pts (xy 148.59 83.82) (xy 144.78 83.82))
    (stroke (width 0) (type default))
    (uuid ee8b5d63-d469-4534-8c31-0e5ccb3756a1)
  )
  (wire (pts (xy 144.78 76.2) (xy 148.59 76.2))
    (stroke (width 0) (type default))
    (uuid efab189c-bbb1-4d4f-b9d9-cc0080dcc190)
  )
  (wire (pts (xy 144.78 73.66) (xy 144.78 71.12))
    (stroke (width 0) (type default))
    (uuid f1f2c995-1145-455e-8e9b-b9853b6eb2e9)
  )
  (wire (pts (xy 144.78 68.58) (xy 144.78 66.04))
    (stroke (width 0) (type default))
    (uuid f3e2c624-55cc-4c82-88dd-cbbd0b7b3649)
  )
  (wire (pts (xy 83.82 68.58) (xy 83.82 64.77))
    (stroke (width 0) (type default))
    (uuid f78208df-1572-4c53-81b5-1b7ba8446bc5)
  )
  (wire (pts (xy 175.26 71.12) (xy 175.26 62.23))
    (stroke (width 0) (type default))
    (uuid fbe1ad2d-abec-4c11-b625-f6080fd79190)
  )
  (wire (pts (xy 175.26 71.12) (xy 198.12 71.12))
    (stroke (width 0) (type default))
    (uuid fed2a1f5-8042-4434-9e28-74ef632694e6)
  )

  (global_label "128" (shape bidirectional) (at 198.12 68.58 0) (fields_autoplaced)
    (effects (font (size 1.27 1.27)) (justify left))
    (uuid 01dad3d8-3187-4806-8138-51704101fae5)
    (property "Intersheetrefs" "${INTERSHEET_REFS}" (at 205.032 68.58 0)
      (effects (font (size 1.27 1.27)) (justify left))
    )
  )
  (global_label "+3.3V" (shape bidirectional) (at 83.82 53.34 90) (fields_autoplaced)
    (effects (font (size 1.27 1.27)) (justify left))
    (uuid 2b2e59c8-6f58-455a-a180-1eb6be34ea83)
    (property "Intersheetrefs" "${INTERSHEET_REFS}" (at 83.82 44.3717 90)
      (effects (font (size 1.27 1.27)) (justify left))
    )
  )
  (global_label "131" (shape bidirectional) (at 198.12 71.12 0) (fields_autoplaced)
    (effects (font (size 1.27 1.27)) (justify left))
    (uuid 33b74bee-8f59-4aef-a1d1-fdf3dd7ce64e)
    (property "Intersheetrefs" "${INTERSHEET_REFS}" (at 205.032 71.12 0)
      (effects (font (size 1.27 1.27)) (justify left))
    )
  )
  (global_label "137" (shape bidirectional) (at 198.12 76.2 0) (fields_autoplaced)
    (effects (font (size 1.27 1.27)) (justify left))
    (uuid 6d1111f6-dd16-4ff3-a6ba-a75b51c10e12)
    (property "Intersheetrefs" "${INTERSHEET_REFS}" (at 205.032 76.2 0)
      (effects (font (size 1.27 1.27)) (justify left))
    )
  )
  (global_label "114" (shape bidirectional) (at 67.31 68.58 0) (fields_autoplaced)
    (effects (font (size 1.27 1.27)) (justify left))
    (uuid 6d8dd428-9ce0-49e6-9d83-de1a077564d1)
    (property "Intersheetrefs" "${INTERSHEET_REFS}" (at 74.222 68.58 0)
      (effects (font (size 1.27 1.27)) (justify left))
    )
  )
  (global_label "117" (shape bidirectional) (at 87.63 68.58 0) (fields_autoplaced)
    (effects (font (size 1.27 1.27)) (justify left))
    (uuid 7a56f6e2-32c6-4502-b90f-6f7aa458699d)
    (property "Intersheetrefs" "${INTERSHEET_REFS}" (at 94.542 68.58 0)
      (effects (font (size 1.27 1.27)) (justify left))
    )
  )
  (global_label "141" (shape bidirectional) (at 198.12 81.28 0) (fields_autoplaced)
    (effects (font (size 1.27 1.27)) (justify left))
    (uuid 7da39194-2965-4567-a0ee-8bba3ef66d06)
    (property "Intersheetrefs" "${INTERSHEET_REFS}" (at 205.032 81.28 0)
      (effects (font (size 1.27 1.27)) (justify left))
    )
  )
  (global_label "133" (shape bidirectional) (at 198.12 73.66 0) (fields_autoplaced)
    (effects (font (size 1.27 1.27)) (justify left))
    (uuid 885f2820-dda3-44c1-9f67-8ec060c1b101)
    (property "Intersheetrefs" "${INTERSHEET_REFS}" (at 205.032 73.66 0)
      (effects (font (size 1.27 1.27)) (justify left))
    )
  )
  (global_label "+3.3V" (shape bidirectional) (at 63.5 53.34 90) (fields_autoplaced)
    (effects (font (size 1.27 1.27)) (justify left))
    (uuid 9dab7321-9c51-4b14-ab70-8c5cdd427f05)
    (property "Intersheetrefs" "${INTERSHEET_REFS}" (at 63.5 44.3717 90)
      (effects (font (size 1.27 1.27)) (justify left))
    )
  )
  (global_label "126" (shape bidirectional) (at 198.12 66.04 0) (fields_autoplaced)
    (effects (font (size 1.27 1.27)) (justify left))
    (uuid ac863560-b93f-4662-a8fd-06b05bc360fb)
    (property "Intersheetrefs" "${INTERSHEET_REFS}" (at 205.032 66.04 0)
      (effects (font (size 1.27 1.27)) (justify left))
    )
  )
  (global_label "139" (shape bidirectional) (at 198.12 78.74 0) (fields_autoplaced)
    (effects (font (size 1.27 1.27)) (justify left))
    (uuid c3cc8008-2f0f-43bd-8295-91e0ca04a0c5)
    (property "Intersheetrefs" "${INTERSHEET_REFS}" (at 205.032 78.74 0)
      (effects (font (size 1.27 1.27)) (justify left))
    )
  )
  (global_label "+3.3V" (shape bidirectional) (at 194.31 46.99 90) (fields_autoplaced)
    (effects (font (size 1.27 1.27)) (justify left))
    (uuid d724a8e4-88f8-4713-a68a-6b3596ec002b)
    (property "Intersheetrefs" "${INTERSHEET_REFS}" (at 194.31 38.0217 90)
      (effects (font (size 1.27 1.27)) (justify left))
    )
  )
  (global_label "143" (shape bidirectional) (at 198.12 83.82 0) (fields_autoplaced)
    (effects (font (size 1.27 1.27)) (justify left))
    (uuid dd758cdc-0923-4fd7-974b-91dedd7fbeba)
    (property "Intersheetrefs" "${INTERSHEET_REFS}" (at 205.032 83.82 0)
      (effects (font (size 1.27 1.27)) (justify left))
    )
  )

  (symbol (lib_id "Device:R") (at 83.82 60.96 0) (mirror x) (unit 1)
    (in_bom yes) (on_board yes) (dnp no) (fields_autoplaced)
    (uuid 2d89f0ac-fe77-44c0-b868-7d7bd8bbadac)
    (property "Reference" "R21" (at 86.36 62.23 0)
      (effects (font (size 1.27 1.27)) (justify left))
    )
    (property "Value" "10k" (at 86.36 59.69 0)
      (effects (font (size 1.27 1.27)) (justify left))
    )
    (property "Footprint" "Resistor_SMD:R_1206_3216Metric" (at 82.042 60.96 90)
      (effects (font (size 1.27 1.27)) hide)
    )
    (property "Datasheet" "~" (at 83.82 60.96 0)
      (effects (font (size 1.27 1.27)) hide)
    )
    (pin "1" (uuid a100929f-520a-41bf-a79d-0a0cb3cf7943))
    (pin "2" (uuid 0ddc90a4-a55b-4557-bf7c-129ee6a167d0))
    (instances
      (project "carte_fille"
        (path "/b4a3c5fa-a079-4b99-9f45-c8b23442e518/5fdf5b15-deaf-4e77-93e0-15e5c037048f"
          (reference "R21") (unit 1)
        )
      )
    )
  )

  (symbol (lib_id "Device:R") (at 190.5 58.42 180) (unit 1)
    (in_bom yes) (on_board yes) (dnp no)
    (uuid 3315da36-838e-49c8-b241-584b9dee180a)
    (property "Reference" "R28" (at 190.5 58.42 90)
      (effects (font (size 1.27 1.27)))
    )
    (property "Value" "10k" (at 189.23 53.34 90)
      (effects (font (size 1.27 1.27)))
    )
    (property "Footprint" "Resistor_SMD:R_1206_3216Metric" (at 192.278 58.42 90)
      (effects (font (size 1.27 1.27)) hide)
    )
    (property "Datasheet" "~" (at 190.5 58.42 0)
      (effects (font (size 1.27 1.27)) hide)
    )
    (pin "1" (uuid 870cb3e4-ad39-4dec-b516-639422183faa))
    (pin "2" (uuid 2533a109-4b9a-42a6-9fc4-3060581246ab))
    (instances
      (project "carte_fille"
        (path "/b4a3c5fa-a079-4b99-9f45-c8b23442e518/5fdf5b15-deaf-4e77-93e0-15e5c037048f"
          (reference "R28") (unit 1)
        )
      )
    )
  )

  (symbol (lib_id "Switch:SW_DIP_x08") (at 156.21 76.2 0) (unit 1)
    (in_bom yes) (on_board yes) (dnp no) (fields_autoplaced)
    (uuid 3553a0ec-e5f2-46f1-ba03-832b646ab712)
    (property "Reference" "SW3" (at 154.94 62.23 90)
      (effects (font (size 1.27 1.27)) (justify left))
    )
    (property "Value" "SW_DIP_x08" (at 157.48 62.23 90)
      (effects (font (size 1.27 1.27)) (justify left))
    )
    (property "Footprint" "Button_Switch_THT:SW_DIP_SPSTx08_Slide_9.78x22.5mm_W7.62mm_P2.54mm" (at 156.21 76.2 0)
      (effects (font (size 1.27 1.27)) hide)
    )
    (property "Datasheet" "~" (at 156.21 76.2 0)
      (effects (font (size 1.27 1.27)) hide)
    )
    (pin "14" (uuid c5d16599-a57b-44cc-b0b1-31466b389fca))
    (pin "16" (uuid 028fa8f7-c151-4e56-bcc7-0ba980291010))
    (pin "7" (uuid e794922c-897b-434f-bb0b-fdcc43efc2cd))
    (pin "1" (uuid a5f4a836-1c03-4cf7-8cfe-e5598acbf056))
    (pin "3" (uuid 81a10b0a-26a6-455a-84e9-08b2110e460c))
    (pin "11" (uuid ea320398-c342-4358-8f09-7e3195770ee9))
    (pin "5" (uuid af3760ab-4a62-4e47-8b87-6ea834739059))
    (pin "15" (uuid bf20ed8d-fa54-44e6-a2f3-c615ae66227e))
    (pin "2" (uuid 261805fa-c97d-4a57-96eb-b30fd17342bf))
    (pin "6" (uuid 6f003fba-b1b4-4c75-acf1-20cf522ffb24))
    (pin "8" (uuid 6150f5ee-7c86-43a8-b009-5c19c89bc6b0))
    (pin "4" (uuid c3bae01b-6296-4abb-8b52-dbd66ebde6ac))
    (pin "10" (uuid 6b66bd1a-2a10-4a50-bfeb-577db90881f1))
    (pin "12" (uuid 0244bd5f-2d08-48b6-8d3c-96497d01f6a7))
    (pin "13" (uuid 992f59eb-5388-414e-a0b5-fb7bd2762ef5))
    (pin "9" (uuid ecbface9-aabe-4722-a090-ef242608f943))
    (instances
      (project "carte_fille"
        (path "/b4a3c5fa-a079-4b99-9f45-c8b23442e518/5fdf5b15-deaf-4e77-93e0-15e5c037048f"
          (reference "SW3") (unit 1)
        )
      )
    )
  )

  (symbol (lib_id "Device:R") (at 194.31 58.42 180) (unit 1)
    (in_bom yes) (on_board yes) (dnp no)
    (uuid 45c3d8a0-2a47-4110-a2a8-50e1eb161339)
    (property "Reference" "R29" (at 194.31 58.42 90)
      (effects (font (size 1.27 1.27)))
    )
    (property "Value" "10k" (at 193.04 53.34 90)
      (effects (font (size 1.27 1.27)))
    )
    (property "Footprint" "Resistor_SMD:R_1206_3216Metric" (at 196.088 58.42 90)
      (effects (font (size 1.27 1.27)) hide)
    )
    (property "Datasheet" "~" (at 194.31 58.42 0)
      (effects (font (size 1.27 1.27)) hide)
    )
    (pin "1" (uuid 502190a0-7339-4004-b624-38cf30c0737d))
    (pin "2" (uuid ab7f9f94-920f-4886-8684-d00067e10738))
    (instances
      (project "carte_fille"
        (path "/b4a3c5fa-a079-4b99-9f45-c8b23442e518/5fdf5b15-deaf-4e77-93e0-15e5c037048f"
          (reference "R29") (unit 1)
        )
      )
    )
  )

  (symbol (lib_id "power:GND") (at 83.82 86.36 0) (unit 1)
    (in_bom yes) (on_board yes) (dnp no) (fields_autoplaced)
    (uuid 4e448775-5621-4160-865f-6b6c6b322ff9)
    (property "Reference" "#PWR045" (at 83.82 92.71 0)
      (effects (font (size 1.27 1.27)) hide)
    )
    (property "Value" "GND" (at 83.82 91.44 0)
      (effects (font (size 1.27 1.27)))
    )
    (property "Footprint" "" (at 83.82 86.36 0)
      (effects (font (size 1.27 1.27)) hide)
    )
    (property "Datasheet" "" (at 83.82 86.36 0)
      (effects (font (size 1.27 1.27)) hide)
    )
    (pin "1" (uuid a7d4f1c4-9f1f-4665-84b5-907595aedb24))
    (instances
      (project "carte_fille"
        (path "/b4a3c5fa-a079-4b99-9f45-c8b23442e518/5fdf5b15-deaf-4e77-93e0-15e5c037048f"
          (reference "#PWR045") (unit 1)
        )
      )
    )
  )

  (symbol (lib_id "Switch:SW_Push") (at 83.82 77.47 90) (mirror x) (unit 1)
    (in_bom yes) (on_board yes) (dnp no) (fields_autoplaced)
    (uuid 4f78be6e-ac09-49bb-9a57-c6a6f9c71b2f)
    (property "Reference" "SW2" (at 85.09 78.74 90)
      (effects (font (size 1.27 1.27)) (justify right))
    )
    (property "Value" "SW_Push" (at 85.09 76.2 90)
      (effects (font (size 1.27 1.27)) (justify right))
    )
    (property "Footprint" "Button_Switch_THT:SW_PUSH_6mm_H4.3mm" (at 78.74 77.47 0)
      (effects (font (size 1.27 1.27)) hide)
    )
    (property "Datasheet" "~" (at 78.74 77.47 0)
      (effects (font (size 1.27 1.27)) hide)
    )
    (pin "1" (uuid 2f0a6329-a9f3-4d63-b6be-c0254d4e489b))
    (pin "2" (uuid fd332d7c-1c9a-4eb4-995e-057bcf9e91cd))
    (instances
      (project "carte_fille"
        (path "/b4a3c5fa-a079-4b99-9f45-c8b23442e518/5fdf5b15-deaf-4e77-93e0-15e5c037048f"
          (reference "SW2") (unit 1)
        )
      )
    )
  )

  (symbol (lib_id "Device:R") (at 175.26 58.42 180) (unit 1)
    (in_bom yes) (on_board yes) (dnp no)
    (uuid 4febeb59-7b71-42c0-8584-e5f2e962ae62)
    (property "Reference" "R24" (at 175.26 58.42 90)
      (effects (font (size 1.27 1.27)))
    )
    (property "Value" "10k" (at 173.99 53.34 90)
      (effects (font (size 1.27 1.27)))
    )
    (property "Footprint" "Resistor_SMD:R_1206_3216Metric" (at 177.038 58.42 90)
      (effects (font (size 1.27 1.27)) hide)
    )
    (property "Datasheet" "~" (at 175.26 58.42 0)
      (effects (font (size 1.27 1.27)) hide)
    )
    (pin "1" (uuid 84049e52-ab2c-4ab1-9f9c-2d017e76648a))
    (pin "2" (uuid 1569fb04-5cd3-454b-996f-c84b1587a23d))
    (instances
      (project "carte_fille"
        (path "/b4a3c5fa-a079-4b99-9f45-c8b23442e518/5fdf5b15-deaf-4e77-93e0-15e5c037048f"
          (reference "R24") (unit 1)
        )
      )
    )
  )

  (symbol (lib_id "Device:R") (at 171.45 58.42 180) (unit 1)
    (in_bom yes) (on_board yes) (dnp no)
    (uuid 517ae111-0475-4010-974b-1a9c0703a4ee)
    (property "Reference" "R23" (at 171.45 58.42 90)
      (effects (font (size 1.27 1.27)))
    )
    (property "Value" "10k" (at 170.18 53.34 90)
      (effects (font (size 1.27 1.27)))
    )
    (property "Footprint" "Resistor_SMD:R_1206_3216Metric" (at 173.228 58.42 90)
      (effects (font (size 1.27 1.27)) hide)
    )
    (property "Datasheet" "~" (at 171.45 58.42 0)
      (effects (font (size 1.27 1.27)) hide)
    )
    (pin "1" (uuid a988ba97-84cf-4ed7-beeb-b58654d3db3a))
    (pin "2" (uuid 787e2935-2fad-43f4-a56c-534593148412))
    (instances
      (project "carte_fille"
        (path "/b4a3c5fa-a079-4b99-9f45-c8b23442e518/5fdf5b15-deaf-4e77-93e0-15e5c037048f"
          (reference "R23") (unit 1)
        )
      )
    )
  )

  (symbol (lib_id "Device:R") (at 182.88 58.42 180) (unit 1)
    (in_bom yes) (on_board yes) (dnp no)
    (uuid 8f5b698e-4281-4ef2-8573-23cea34d6a8e)
    (property "Reference" "R26" (at 182.88 58.42 90)
      (effects (font (size 1.27 1.27)))
    )
    (property "Value" "10k" (at 181.61 53.34 90)
      (effects (font (size 1.27 1.27)))
    )
    (property "Footprint" "Resistor_SMD:R_1206_3216Metric" (at 184.658 58.42 90)
      (effects (font (size 1.27 1.27)) hide)
    )
    (property "Datasheet" "~" (at 182.88 58.42 0)
      (effects (font (size 1.27 1.27)) hide)
    )
    (pin "1" (uuid 4ffe5091-93d2-481e-94eb-04cd282e308d))
    (pin "2" (uuid fc75085d-b709-4340-b0ee-0e242812232f))
    (instances
      (project "carte_fille"
        (path "/b4a3c5fa-a079-4b99-9f45-c8b23442e518/5fdf5b15-deaf-4e77-93e0-15e5c037048f"
          (reference "R26") (unit 1)
        )
      )
    )
  )

  (symbol (lib_id "Device:R") (at 186.69 58.42 180) (unit 1)
    (in_bom yes) (on_board yes) (dnp no)
    (uuid 92e1f971-a990-4c76-9279-56662acdd6b8)
    (property "Reference" "R27" (at 186.69 58.42 90)
      (effects (font (size 1.27 1.27)))
    )
    (property "Value" "10k" (at 185.42 53.34 90)
      (effects (font (size 1.27 1.27)))
    )
    (property "Footprint" "Resistor_SMD:R_1206_3216Metric" (at 188.468 58.42 90)
      (effects (font (size 1.27 1.27)) hide)
    )
    (property "Datasheet" "~" (at 186.69 58.42 0)
      (effects (font (size 1.27 1.27)) hide)
    )
    (pin "1" (uuid ae0e882a-ac0c-4663-acee-65c7bb24c30e))
    (pin "2" (uuid efd431a5-eaa2-42bc-8db1-43daa4702ac3))
    (instances
      (project "carte_fille"
        (path "/b4a3c5fa-a079-4b99-9f45-c8b23442e518/5fdf5b15-deaf-4e77-93e0-15e5c037048f"
          (reference "R27") (unit 1)
        )
      )
    )
  )

  (symbol (lib_id "power:GND") (at 63.5 86.36 0) (unit 1)
    (in_bom yes) (on_board yes) (dnp no) (fields_autoplaced)
    (uuid a9041dab-adda-466e-9069-2f9ff9130d6f)
    (property "Reference" "#PWR044" (at 63.5 92.71 0)
      (effects (font (size 1.27 1.27)) hide)
    )
    (property "Value" "GND" (at 63.5 91.44 0)
      (effects (font (size 1.27 1.27)))
    )
    (property "Footprint" "" (at 63.5 86.36 0)
      (effects (font (size 1.27 1.27)) hide)
    )
    (property "Datasheet" "" (at 63.5 86.36 0)
      (effects (font (size 1.27 1.27)) hide)
    )
    (pin "1" (uuid 193ae22b-a32f-4623-b687-3b96600a9b42))
    (instances
      (project "carte_fille"
        (path "/b4a3c5fa-a079-4b99-9f45-c8b23442e518/5fdf5b15-deaf-4e77-93e0-15e5c037048f"
          (reference "#PWR044") (unit 1)
        )
      )
    )
  )

  (symbol (lib_id "power:GND") (at 144.78 87.63 0) (unit 1)
    (in_bom yes) (on_board yes) (dnp no) (fields_autoplaced)
    (uuid b77a899f-8ef2-4718-8817-86dc65ae044d)
    (property "Reference" "#PWR054" (at 144.78 93.98 0)
      (effects (font (size 1.27 1.27)) hide)
    )
    (property "Value" "GND" (at 144.78 92.71 0)
      (effects (font (size 1.27 1.27)))
    )
    (property "Footprint" "" (at 144.78 87.63 0)
      (effects (font (size 1.27 1.27)) hide)
    )
    (property "Datasheet" "" (at 144.78 87.63 0)
      (effects (font (size 1.27 1.27)) hide)
    )
    (pin "1" (uuid a8404e16-4c9a-41b7-8218-9ed1f58b97d7))
    (instances
      (project "carte_fille"
        (path "/b4a3c5fa-a079-4b99-9f45-c8b23442e518/5fdf5b15-deaf-4e77-93e0-15e5c037048f"
          (reference "#PWR054") (unit 1)
        )
      )
    )
  )

  (symbol (lib_id "Device:R") (at 63.5 60.96 0) (mirror x) (unit 1)
    (in_bom yes) (on_board yes) (dnp no) (fields_autoplaced)
    (uuid bee77d26-4d24-4bb6-a2b9-34539b7e5917)
    (property "Reference" "R20" (at 66.04 62.23 0)
      (effects (font (size 1.27 1.27)) (justify left))
    )
    (property "Value" "10k" (at 66.04 59.69 0)
      (effects (font (size 1.27 1.27)) (justify left))
    )
    (property "Footprint" "Resistor_SMD:R_1206_3216Metric" (at 61.722 60.96 90)
      (effects (font (size 1.27 1.27)) hide)
    )
    (property "Datasheet" "~" (at 63.5 60.96 0)
      (effects (font (size 1.27 1.27)) hide)
    )
    (pin "1" (uuid 087d3b03-94bd-47c5-bfde-a81f72113803))
    (pin "2" (uuid f6ecdd1e-59c5-4b09-a650-4dad97497794))
    (instances
      (project "carte_fille"
        (path "/b4a3c5fa-a079-4b99-9f45-c8b23442e518/5fdf5b15-deaf-4e77-93e0-15e5c037048f"
          (reference "R20") (unit 1)
        )
      )
    )
  )

  (symbol (lib_id "Device:R") (at 167.64 58.42 180) (unit 1)
    (in_bom yes) (on_board yes) (dnp no)
    (uuid c5db45c9-82f1-4a5e-9d22-bcea10476ee3)
    (property "Reference" "R22" (at 167.64 58.42 90)
      (effects (font (size 1.27 1.27)))
    )
    (property "Value" "10k" (at 166.37 53.34 90)
      (effects (font (size 1.27 1.27)))
    )
    (property "Footprint" "Resistor_SMD:R_1206_3216Metric" (at 169.418 58.42 90)
      (effects (font (size 1.27 1.27)) hide)
    )
    (property "Datasheet" "~" (at 167.64 58.42 0)
      (effects (font (size 1.27 1.27)) hide)
    )
    (pin "1" (uuid d1bd204d-9a98-4ab8-9849-b551f5eb4936))
    (pin "2" (uuid 49bb05db-b73c-4b12-8561-c8818cc1be0f))
    (instances
      (project "carte_fille"
        (path "/b4a3c5fa-a079-4b99-9f45-c8b23442e518/5fdf5b15-deaf-4e77-93e0-15e5c037048f"
          (reference "R22") (unit 1)
        )
      )
    )
  )

  (symbol (lib_id "Switch:SW_Push") (at 63.5 77.47 90) (mirror x) (unit 1)
    (in_bom yes) (on_board yes) (dnp no) (fields_autoplaced)
    (uuid cdf52a53-5ff3-4fba-ad78-41059c5c9f35)
    (property "Reference" "SW1" (at 64.77 78.74 90)
      (effects (font (size 1.27 1.27)) (justify right))
    )
    (property "Value" "SW_Push" (at 64.77 76.2 90)
      (effects (font (size 1.27 1.27)) (justify right))
    )
    (property "Footprint" "Button_Switch_THT:SW_PUSH_6mm_H4.3mm" (at 58.42 77.47 0)
      (effects (font (size 1.27 1.27)) hide)
    )
    (property "Datasheet" "~" (at 58.42 77.47 0)
      (effects (font (size 1.27 1.27)) hide)
    )
    (pin "1" (uuid 0e3187a7-8d5a-4a32-8b51-e83acbf4441f))
    (pin "2" (uuid b8a9e140-9307-43dc-9e24-0c791ec952cb))
    (instances
      (project "carte_fille"
        (path "/b4a3c5fa-a079-4b99-9f45-c8b23442e518/5fdf5b15-deaf-4e77-93e0-15e5c037048f"
          (reference "SW1") (unit 1)
        )
      )
    )
  )

  (symbol (lib_id "Device:R") (at 179.07 58.42 180) (unit 1)
    (in_bom yes) (on_board yes) (dnp no)
    (uuid cfd4cb49-5bd6-4af1-9a71-4a1b5a1e430a)
    (property "Reference" "R25" (at 179.07 58.42 90)
      (effects (font (size 1.27 1.27)))
    )
    (property "Value" "10k" (at 177.8 53.34 90)
      (effects (font (size 1.27 1.27)))
    )
    (property "Footprint" "Resistor_SMD:R_1206_3216Metric" (at 180.848 58.42 90)
      (effects (font (size 1.27 1.27)) hide)
    )
    (property "Datasheet" "~" (at 179.07 58.42 0)
      (effects (font (size 1.27 1.27)) hide)
    )
    (pin "1" (uuid 7fded075-aca5-463f-a1f1-5c4bc9aaac95))
    (pin "2" (uuid 7ce7ff8d-053a-415b-bcdc-620f2c191bda))
    (instances
      (project "carte_fille"
        (path "/b4a3c5fa-a079-4b99-9f45-c8b23442e518/5fdf5b15-deaf-4e77-93e0-15e5c037048f"
          (reference "R25") (unit 1)
        )
      )
    )
  )
)
