G04 #@! TF.GenerationSoftware,KiCad,Pcbnew,7.0.9*
G04 #@! TF.CreationDate,2023-11-19T01:26:04+01:00*
G04 #@! TF.ProjectId,carte_fille,63617274-655f-4666-996c-6c652e6b6963,1.1*
G04 #@! TF.SameCoordinates,Original*
G04 #@! TF.FileFunction,Copper,L4,Bot*
G04 #@! TF.FilePolarity,Positive*
%FSLAX46Y46*%
G04 Gerber Fmt 4.6, Leading zero omitted, Abs format (unit mm)*
G04 Created by KiCad (PCBNEW 7.0.9) date 2023-11-19 01:26:04*
%MOMM*%
%LPD*%
G01*
G04 APERTURE LIST*
G04 #@! TA.AperFunction,ComponentPad*
%ADD10C,2.050000*%
G04 #@! TD*
G04 #@! TA.AperFunction,ComponentPad*
%ADD11C,2.250000*%
G04 #@! TD*
G04 #@! TA.AperFunction,ComponentPad*
%ADD12R,1.700000X1.700000*%
G04 #@! TD*
G04 #@! TA.AperFunction,ComponentPad*
%ADD13O,1.700000X1.700000*%
G04 #@! TD*
G04 #@! TA.AperFunction,ComponentPad*
%ADD14C,10.160000*%
G04 #@! TD*
G04 APERTURE END LIST*
D10*
X135835000Y-107091200D03*
D11*
X138375000Y-109631200D03*
X138375000Y-104551200D03*
X133295000Y-104551200D03*
X133295000Y-109631200D03*
D10*
X135885800Y-116489200D03*
D11*
X138425800Y-119029200D03*
X138425800Y-113949200D03*
X133345800Y-113949200D03*
X133345800Y-119029200D03*
D12*
X81846600Y-115244600D03*
D13*
X81846600Y-117784600D03*
X81846600Y-120324600D03*
X81846600Y-122864600D03*
X81846600Y-125404600D03*
X81846600Y-127944600D03*
X81846600Y-130484600D03*
X81846600Y-133024600D03*
X81846600Y-135564600D03*
X81846600Y-138104600D03*
X81846600Y-140644600D03*
X81846600Y-143184600D03*
X81846600Y-145724600D03*
X81846600Y-148264600D03*
X81846600Y-150804600D03*
X81846600Y-153344600D03*
X81846600Y-155884600D03*
X81846600Y-158424600D03*
X81846600Y-160964600D03*
X81846600Y-163504600D03*
D12*
X79294600Y-115244600D03*
D13*
X79294600Y-117784600D03*
X79294600Y-120324600D03*
X79294600Y-122864600D03*
X79294600Y-125404600D03*
X79294600Y-127944600D03*
X79294600Y-130484600D03*
X79294600Y-133024600D03*
X79294600Y-135564600D03*
X79294600Y-138104600D03*
X79294600Y-140644600D03*
X79294600Y-143184600D03*
X79294600Y-145724600D03*
X79294600Y-148264600D03*
X79294600Y-150804600D03*
X79294600Y-153344600D03*
X79294600Y-155884600D03*
X79294600Y-158424600D03*
X79294600Y-160964600D03*
X79294600Y-163504600D03*
D14*
X120761400Y-184154800D03*
X105771400Y-184154800D03*
X90791400Y-184154800D03*
D10*
X135887849Y-125815249D03*
D11*
X138427849Y-123275249D03*
X133347849Y-123275249D03*
X138427849Y-128355249D03*
X133347849Y-128355249D03*
D10*
X135276200Y-149407600D03*
D11*
X132736200Y-146867600D03*
X132736200Y-151947600D03*
X137816200Y-146867600D03*
X137816200Y-151947600D03*
D12*
X72690600Y-115244600D03*
D13*
X72690600Y-117784600D03*
X72690600Y-120324600D03*
X72690600Y-122864600D03*
X72690600Y-125404600D03*
X72690600Y-127944600D03*
X72690600Y-130484600D03*
X72690600Y-133024600D03*
X72690600Y-135564600D03*
X72690600Y-138104600D03*
X72690600Y-140644600D03*
X72690600Y-143184600D03*
X72690600Y-145724600D03*
X72690600Y-148264600D03*
X72690600Y-150804600D03*
X72690600Y-153344600D03*
X72690600Y-155884600D03*
X72690600Y-158424600D03*
X72690600Y-160964600D03*
X72690600Y-163504600D03*
D12*
X70150600Y-115244600D03*
D13*
X70150600Y-117784600D03*
X70150600Y-120324600D03*
X70150600Y-122864600D03*
X70150600Y-125404600D03*
X70150600Y-127944600D03*
X70150600Y-130484600D03*
X70150600Y-133024600D03*
X70150600Y-135564600D03*
X70150600Y-138104600D03*
X70150600Y-140644600D03*
X70150600Y-143184600D03*
X70150600Y-145724600D03*
X70150600Y-148264600D03*
X70150600Y-150804600D03*
X70150600Y-153344600D03*
X70150600Y-155884600D03*
X70150600Y-158424600D03*
X70150600Y-160964600D03*
X70150600Y-163504600D03*
M02*
