<svg version="1.1" xmlns="http://www.w3.org/2000/svg" viewBox="0 0 332.5810112419245 100.99043048469281" width="332.5810112419245" height="100.99043048469281">
  <!-- svg-source:excalidraw -->
  
  <defs>
    <style class="style-fonts">
      @font-face {
        font-family: "Virgil";
        src: url("https://excalidraw.com/Virgil.woff2");
      }
      @font-face {
        font-family: "Cascadia";
        src: url("https://excalidraw.com/Cascadia.woff2");
      }
    </style>
    
  </defs>
  <g stroke-linecap="round" transform="translate(228.5810112419245 9.999999999999972) rotate(0 47 38.999999999999986)"><path d="M31.06 2.16 C38.49 -0.46, 50.16 0.3, 58.47 2.07 C66.77 3.83, 75.03 7.75, 80.89 12.75 C86.75 17.74, 92.14 25.18, 93.65 32.03 C95.15 38.89, 93.25 47.53, 89.93 53.87 C86.62 60.21, 80.67 66.17, 73.75 70.06 C66.82 73.95, 56.6 76.85, 48.39 77.24 C40.18 77.63, 31.85 75.87, 24.49 72.4 C17.14 68.93, 8.25 62.61, 4.27 56.42 C0.28 50.24, -0.35 42.15, 0.58 35.31 C1.51 28.46, 4.31 20.89, 9.85 15.37 C15.39 9.84, 29.24 4.53, 33.83 2.17 C38.42 -0.2, 37.05 0.59, 37.4 1.2 M69.6 4.12 C77.26 6.89, 84.44 13.28, 88.63 19.46 C92.82 25.63, 95.24 34.01, 94.73 41.17 C94.21 48.33, 90.62 56.53, 85.54 62.44 C80.46 68.35, 72.36 74.38, 64.24 76.63 C56.11 78.88, 45.41 77.74, 36.78 75.94 C28.15 74.14, 18.19 70.69, 12.46 65.82 C6.73 60.96, 4.16 53.35, 2.4 46.74 C0.63 40.13, -0.59 32.75, 1.88 26.16 C4.36 19.58, 10.11 11.66, 17.25 7.24 C24.39 2.82, 35.9 -0.04, 44.72 -0.35 C53.54 -0.66, 65.95 4.61, 70.17 5.39 C74.38 6.17, 70.62 3.63, 70.02 4.33" stroke="#1e1e1e" stroke-width="2" fill="none"></path></g><g transform="translate(248.0589828826021 26.422835533724623) rotate(0 27.288009643554688 22.5)"><text x="27.288009643554688" y="0" font-family="Virgil, Segoe UI Emoji" font-size="36px" fill="#1e1e1e" text-anchor="middle" style="white-space: pre;" direction="ltr" dominant-baseline="text-before-edge">T2</text></g><g stroke-linecap="round" transform="translate(10 12.990430484692808) rotate(0 47 39)"><path d="M39.25 1.11 C47.13 -0.3, 58.71 1.14, 66.37 4 C74.04 6.86, 80.66 12.45, 85.25 18.29 C89.83 24.12, 93.57 31.99, 93.89 39.01 C94.2 46.02, 91.58 54.59, 87.12 60.37 C82.66 66.15, 74.74 70.7, 67.12 73.69 C59.51 76.67, 49.84 79.1, 41.42 78.28 C33 77.45, 23.11 73.43, 16.62 68.73 C10.14 64.02, 5.07 56.74, 2.52 50.04 C-0.03 43.34, -0.74 35.07, 1.33 28.51 C3.41 21.95, 7.18 15.37, 14.96 10.69 C22.75 6.02, 41 2.09, 48.06 0.47 C55.13 -1.15, 57.16 0.38, 57.37 0.98 M61.67 2.53 C69.94 3.97, 79.28 8.12, 84.83 13.53 C90.38 18.93, 94.24 27.92, 94.97 34.93 C95.69 41.94, 93.19 49.17, 89.18 55.6 C85.18 62.03, 78.34 70.02, 70.95 73.51 C63.55 77, 53.26 76.77, 44.81 76.55 C36.36 76.34, 27.01 75.85, 20.25 72.21 C13.5 68.56, 7.39 61.33, 4.28 54.69 C1.16 48.04, -0.05 39.21, 1.56 32.35 C3.16 25.49, 8.55 18.52, 13.9 13.53 C19.25 8.55, 25.79 4.25, 33.64 2.46 C41.48 0.67, 56.11 2.71, 60.96 2.79 C65.82 2.87, 63 2.55, 62.76 2.93" stroke="#1e1e1e" stroke-width="2" fill="none"></path></g><g transform="translate(37.41597518071663 29.41326601841746) rotate(0 19.350006103515625 22.5)"><text x="19.350006103515625" y="0" font-family="Virgil, Segoe UI Emoji" font-size="36px" fill="#1e1e1e" text-anchor="middle" style="white-space: pre;" direction="ltr" dominant-baseline="text-before-edge">T1</text></g><g stroke-linecap="round"><g transform="translate(225.499524067943 44.97220648573463) rotate(0 -57.398078693051886 1.7075486275050054)"><path d="M-0.9 0.2 C-19.78 1.02, -95.61 3.77, -114.48 4.16 M0.83 -0.74 C-18.14 -0.17, -96.34 1.85, -115.62 2.56" stroke="#1e1e1e" stroke-width="2" fill="none"></path></g><g transform="translate(225.499524067943 44.97220648573463) rotate(0 -57.398078693051886 1.7075486275050054)"><path d="M-87.43 -9.18 C-91.76 -6.56, -100.11 -3.72, -116.75 2.45 M-87.81 -8.1 C-97.55 -4.98, -105.16 -1.57, -116.01 2.85" stroke="#1e1e1e" stroke-width="2" fill="none"></path></g><g transform="translate(225.499524067943 44.97220648573463) rotate(0 -57.398078693051886 1.7075486275050054)"><path d="M-86.8 11.33 C-91.13 9.84, -99.6 8.57, -116.75 2.45 M-87.19 12.41 C-96.97 8.81, -104.78 5.5, -116.01 2.85" stroke="#1e1e1e" stroke-width="2" fill="none"></path></g></g><mask></mask></svg>