<svg version="1.1" xmlns="http://www.w3.org/2000/svg" viewBox="0 0 590.4000091552734 441.40000915527344" width="590.4000091552734" height="441.40000915527344">
  <!-- svg-source:excalidraw -->
  
  <defs>
    <style class="style-fonts">
      @font-face {
        font-family: "Virgil";
        src: url("https://excalidraw.com/Virgil.woff2");
      }
      @font-face {
        font-family: "Cascadia";
        src: url("https://excalidraw.com/Cascadia.woff2");
      }
    </style>
    
  </defs>
  <g stroke-linecap="round" transform="translate(10 65.60000610351562) rotate(0 43.199989318847656 27.5)"><path d="M1.72 -0.57 C27.01 -0.15, 51.67 -1.35, 84.45 1.66 M-0.27 -0.07 C23.17 0.93, 46.64 -0.1, 85.54 0.9 M85.63 -0.56 C84.72 14.94, 87.07 28.78, 84.82 55.82 M86.63 0.8 C85.42 15.1, 86.27 31.62, 87.37 54.8 M85.67 56.11 C67.87 54.99, 44.8 56.58, 0.14 56.5 M85.71 54.67 C68.53 55.41, 50.2 55.82, -0.39 54.64 M1 53.36 C-0.23 33.69, -1.11 14.92, -0.4 -0.18 M-0.7 54.55 C-0.07 33.92, 0.2 13.43, -0.8 0.42" stroke="#1e1e1e" stroke-width="4" fill="none"></path></g><g transform="translate(42.957984924316406 70.60000610351562) rotate(0 10.24200439453125 22.5)"><text x="10.24200439453125" y="0" font-family="Virgil, Segoe UI Emoji" font-size="36px" fill="#1e1e1e" text-anchor="middle" style="white-space: pre;" direction="ltr" dominant-baseline="text-before-edge">d</text></g><g stroke-linecap="round" transform="translate(12 120.4000244140625) rotate(0 43.199989318847656 27.5)"><path d="M1.22 1.28 C27.49 -1.2, 54.42 -2.1, 88.01 0.46 M-0.63 0.84 C21.16 0.72, 41.91 0.6, 87 -0.39 M87.38 0.85 C84.48 17.85, 87.95 39.84, 84.66 53.42 M85.67 0.04 C86.13 14.39, 85.43 29.75, 86.82 55.79 M85.05 56.77 C57.73 53.71, 33.46 54.34, 0.46 55.58 M86.32 54.83 C56.04 54.89, 23.96 54.56, 0.29 55.01 M1.91 55.74 C0.93 35.02, 0.81 18.19, 0.27 0.69 M0.13 55.59 C0.54 37.59, 0.32 19.42, 0.22 0.26" stroke="#1e1e1e" stroke-width="4" fill="none"></path></g><g transform="translate(43.19398498535156 125.4000244140625) rotate(0 12.006004333496094 22.5)"><text x="12.006004333496094" y="0" font-family="Virgil, Segoe UI Emoji" font-size="36px" fill="#1e1e1e" text-anchor="middle" style="white-space: pre;" direction="ltr" dominant-baseline="text-before-edge">a</text></g><g stroke-linecap="round" transform="translate(11.5999755859375 176.00003051757812) rotate(0 43.199989318847656 27.5)"><path d="M0.42 1.02 C19.67 2.47, 35.23 1.81, 87.14 -0.73 M0.36 0.51 C33.09 0.66, 66.56 0.68, 85.95 -0.66 M88 -1.56 C85.6 12.93, 85.71 26.56, 87.87 53.13 M86.97 -0.03 C86.99 16.15, 86.56 31.69, 87.02 54.46 M85.23 53.94 C62.04 55.21, 39.04 54.23, -1.46 55.33 M87.02 55.42 C59.56 53.88, 32.79 54.82, -0.8 54.37 M-0.1 55.14 C0.8 34.9, -1.3 12.06, 0.17 -1.38 M0.05 55.99 C1.22 32.98, -0.36 12.11, 0.69 0.05" stroke="#1e1e1e" stroke-width="4" fill="none"></path></g><g transform="translate(45.781959533691406 181.00003051757812) rotate(0 9.01800537109375 22.5)"><text x="9.01800537109375" y="0" font-family="Virgil, Segoe UI Emoji" font-size="36px" fill="#1e1e1e" text-anchor="middle" style="white-space: pre;" direction="ltr" dominant-baseline="text-before-edge">g</text></g><g stroke-linecap="round" transform="translate(94.39999389648438 66.80000305175781) rotate(0 43.199989318847656 27.5)"><path d="M-1.83 -1.47 C29.11 -0.15, 60.28 1.79, 87.92 -1.88 M-0.36 0.61 C19.76 -1.1, 40.2 -0.31, 86.11 0.09 M85.58 -0.76 C85.27 22.81, 86.63 42.47, 85.42 54.92 M86.48 -0.02 C86.38 13.02, 85.81 26.86, 86.85 54.45 M87.71 56.11 C60.33 52.98, 29.02 54.71, -0.34 54.17 M86.73 54.35 C60.61 54.88, 34.03 54.75, -0.56 54.97 M0.7 56.17 C1.13 32.32, 1.48 11.35, 1.51 -1.51 M0.38 54.54 C0.44 41.97, 1.01 27.46, -0.25 -0.92" stroke="#1e1e1e" stroke-width="4" fill="none"></path></g><g transform="translate(126.47598266601562 71.80000305175781) rotate(0 11.124000549316406 22.5)"><text x="11.124000549316406" y="0" font-family="Virgil, Segoe UI Emoji" font-size="36px" fill="#1e1e1e" text-anchor="middle" style="white-space: pre;" direction="ltr" dominant-baseline="text-before-edge">5</text></g><g stroke-linecap="round" transform="translate(96.39999389648438 121.60002136230469) rotate(0 43.199989318847656 27.5)"><path d="M0.31 -1.02 C27.79 -2.48, 57.04 -0.09, 85.18 -1.72 M0.54 0.39 C23.32 -0.45, 45.95 -1.11, 86.97 -0.7 M84.87 -1.78 C88.61 19.72, 84.93 36.69, 85.79 53.05 M86.66 -0.43 C85.56 15.21, 86.41 31.01, 86.56 55.68 M85.02 53.12 C56.17 54.51, 23.12 56.34, 1.26 53.03 M87.4 54.54 C57.2 54.05, 27.73 54.86, 0.47 54.27 M0.53 54.09 C-0.11 41.88, -0.26 26.81, 0.65 1.56 M0.97 55.88 C0.68 36.51, 0.16 16.28, -0.13 0.26" stroke="#1e1e1e" stroke-width="4" fill="none"></path></g><g transform="translate(122.33798217773438 126.60002136230469) rotate(0 17.262001037597656 22.5)"><text x="17.262001037597656" y="0" font-family="Virgil, Segoe UI Emoji" font-size="36px" fill="#1e1e1e" text-anchor="middle" style="white-space: pre;" direction="ltr" dominant-baseline="text-before-edge">10</text></g><g stroke-linecap="round" transform="translate(95.99996948242188 177.2000274658203) rotate(0 43.199989318847656 27.5)"><path d="M1.28 1.91 C18.7 0.81, 41.27 -1.17, 88.01 1.67 M0.21 0.64 C26.53 0.22, 51 -1.11, 85.79 0.36 M85.4 -0.22 C85.95 13.31, 88.31 24.2, 86.24 56.41 M86.6 0.1 C86.49 13.49, 87.33 27.26, 86.2 55.43 M86.24 54.62 C55.67 53.18, 21.38 54.88, 0.29 54.24 M86.75 54.33 C65.71 55.62, 42.69 54.74, 0.91 54.37 M0.45 56.37 C-1.61 40.7, 0.2 24.99, 1.93 -1.64 M0.77 54.79 C-0.83 33.72, 0.66 11.05, 0.76 -0.6" stroke="#1e1e1e" stroke-width="4" fill="none"></path></g><g transform="translate(116.55595397949219 182.2000274658203) rotate(0 22.644004821777344 22.5)"><text x="22.644004821777344" y="0" font-family="Virgil, Segoe UI Emoji" font-size="36px" fill="#1e1e1e" text-anchor="middle" style="white-space: pre;" direction="ltr" dominant-baseline="text-before-edge">54</text></g><g stroke-linecap="round" transform="translate(403.2000427246094 10) rotate(0 43.199989318847656 27.5)"><path d="M1.91 -1.91 C21.01 -0.57, 45.97 -1.89, 86.57 -0.48 M-0.18 -0.42 C33.53 -0.48, 69.09 0.45, 86.42 -0.59 M86.06 0.88 C87.38 19.84, 86.9 36.98, 84.73 55.98 M86.11 0.95 C86.88 13.14, 85.79 28.44, 85.83 54.56 M85.19 54.16 C64.96 55.23, 46.34 56.4, 0.94 53.11 M86.86 54.81 C58.18 55.15, 30.18 54.65, -0.59 54.88 M1.54 56.83 C1.29 32.27, -1.52 9.95, -1.89 1.36 M0.7 54.33 C-0.91 40.6, 0.22 27.97, 0.07 -0.13" stroke="#1e1e1e" stroke-width="4" fill="none"></path></g><g transform="translate(436.1580276489258 15) rotate(0 10.24200439453125 22.5)"><text x="10.24200439453125" y="0" font-family="Virgil, Segoe UI Emoji" font-size="36px" fill="#1e1e1e" text-anchor="middle" style="white-space: pre;" direction="ltr" dominant-baseline="text-before-edge">d</text></g><g stroke-linecap="round" transform="translate(405.2000427246094 64.80001831054688) rotate(0 43.199989318847656 27.5)"><path d="M-1.82 0.02 C32.15 -0.48, 63.87 0.34, 88.3 -1.41 M-0.58 -0.95 C22.11 0.35, 42.53 -0.22, 86.72 -0.16 M87.47 1.58 C86.89 12.47, 84.64 25, 85.44 53.96 M87.16 -0.72 C85.92 20.34, 85.68 38.8, 85.77 54.72 M85.47 55.54 C64.62 56.36, 41.86 52.75, 0.48 54.1 M86.16 55.54 C64.06 54.87, 41.64 54.71, 0.96 54.51 M1.02 54.03 C-2.21 36, -2.31 21.44, -0.97 0.57 M-0.75 54.42 C-0.01 34.3, -0.32 12.22, 0.3 0.15" stroke="#1e1e1e" stroke-width="4" fill="none"></path></g><g transform="translate(436.39402770996094 69.80001831054688) rotate(0 12.006004333496094 22.5)"><text x="12.006004333496094" y="0" font-family="Virgil, Segoe UI Emoji" font-size="36px" fill="#1e1e1e" text-anchor="middle" style="white-space: pre;" direction="ltr" dominant-baseline="text-before-edge">a</text></g><g stroke-linecap="round" transform="translate(404.8000183105469 120.4000244140625) rotate(0 43.199989318847656 27.5)"><path d="M0.3 -1.3 C17.86 -0.49, 37.26 -1.41, 85.32 -0.36 M0.86 -0.01 C22.28 0.23, 44.85 0.66, 85.58 -0.17 M86.98 0.46 C85.03 19.91, 85.73 36.81, 87.53 54.43 M86.08 0.72 C86.25 21.26, 86.19 43.13, 86.03 54.39 M87.36 56.72 C65.03 53.34, 42.25 54.33, -0.89 55.92 M86.14 55.04 C61.58 55.34, 38.88 54.97, 0.17 55.77 M-1.79 53.46 C-2.17 34.82, -1.25 12.49, 1.75 1.4 M0.37 55.62 C0.48 42.04, 0.71 29.51, -0.53 -0.91" stroke="#1e1e1e" stroke-width="4" fill="none"></path></g><g transform="translate(438.9820022583008 125.4000244140625) rotate(0 9.01800537109375 22.5)"><text x="9.01800537109375" y="0" font-family="Virgil, Segoe UI Emoji" font-size="36px" fill="#1e1e1e" text-anchor="middle" style="white-space: pre;" direction="ltr" dominant-baseline="text-before-edge">g</text></g><g stroke-linecap="round" transform="translate(487.60003662109375 11.199996948242188) rotate(0 43.199989318847656 27.5)"><path d="M0.17 -0.48 C27.91 -0.84, 50.94 0.2, 85.55 -1.17 M0.02 -0.59 C18.03 -0.15, 34.59 -0.16, 86.84 0.53 M84.73 0.98 C85.6 19.81, 87.69 41.13, 88.29 56.52 M85.83 -0.44 C85.6 12.25, 85.85 24.44, 85.98 54.54 M87.34 53.11 C58.6 54.84, 28.97 56.66, -0.39 54.53 M85.81 54.88 C56.8 54.54, 25.45 55.8, 0.92 55.51 M-1.89 56.36 C-0.48 41.74, 2.25 28.73, -1.34 -1.5 M0.07 54.87 C0.09 41.82, -0.73 27.42, 0.84 -0.57" stroke="#1e1e1e" stroke-width="4" fill="none"></path></g><g transform="translate(519.676025390625 16.199996948242188) rotate(0 11.124000549316406 22.5)"><text x="11.124000549316406" y="0" font-family="Virgil, Segoe UI Emoji" font-size="36px" fill="#1e1e1e" text-anchor="middle" style="white-space: pre;" direction="ltr" dominant-baseline="text-before-edge">5</text></g><g stroke-linecap="round" transform="translate(489.60003662109375 66.00001525878906) rotate(0 43.199989318847656 27.5)"><path d="M1.9 -1.41 C19.22 -0.15, 39.76 -0.96, 84.5 1.71 M0.32 -0.16 C24.97 0.34, 52.02 1.04, 87.19 0.29 M85.44 -1.04 C87.08 17.19, 87.83 37.05, 84.95 54.35 M85.77 -0.28 C85.72 19.87, 85.67 40.5, 86.67 55.48 M86.88 54.1 C52.16 55.1, 19.3 53.71, 1.07 54.49 M87.36 54.51 C60.34 55.66, 34.86 55.4, -0.48 54.11 M-0.97 55.57 C2.27 44.13, -0.82 28.96, -1.15 0.75 M0.3 55.15 C-0.57 34.18, 0.81 14.62, 0.97 -0.3" stroke="#1e1e1e" stroke-width="4" fill="none"></path></g><g transform="translate(515.5380249023438 71.00001525878906) rotate(0 17.262001037597656 22.5)"><text x="17.262001037597656" y="0" font-family="Virgil, Segoe UI Emoji" font-size="36px" fill="#1e1e1e" text-anchor="middle" style="white-space: pre;" direction="ltr" dominant-baseline="text-before-edge">10</text></g><g stroke-linecap="round" transform="translate(489.20001220703125 121.60002136230469) rotate(0 43.199989318847656 27.5)"><path d="M-1.08 -0.36 C23 -0.56, 45.78 2.32, 86.37 0.03 M-0.82 -0.17 C21.28 0.67, 42.48 0.43, 86.63 -0.83 M87.53 -0.57 C88.03 20.72, 84.69 37.74, 87.85 53.87 M86.03 -0.61 C85.64 13.61, 86.33 28.62, 87.26 55.47 M85.51 55.92 C68.26 54.14, 51.98 54.1, 0.07 53.82 M86.57 55.77 C62.43 55.08, 36.15 53.68, -0.77 54.05 M1.75 56.4 C-1.07 33.25, -0.88 15.26, 1.24 0.13 M-0.53 54.09 C0.68 38.67, 0.81 23.18, 0.16 0.67" stroke="#1e1e1e" stroke-width="4" fill="none"></path></g><g transform="translate(509.75599670410156 126.60002136230469) rotate(0 22.644004821777344 22.5)"><text x="22.644004821777344" y="0" font-family="Virgil, Segoe UI Emoji" font-size="36px" fill="#1e1e1e" text-anchor="middle" style="white-space: pre;" direction="ltr" dominant-baseline="text-before-edge">54</text></g><g stroke-linecap="round" transform="translate(13.600006103515625 230.80001831054688) rotate(0 43.199989318847656 27.5)"><path d="M-1.23 -1.55 C31.07 1.82, 62.42 0.41, 88.02 0.52 M0.91 0.23 C27.55 0.65, 54.49 0.95, 86.68 -0.18 M86.16 -0.81 C84.75 11.43, 87.3 20.8, 84.77 56.35 M87.05 -0.44 C86.29 13.91, 86.37 25.77, 86.72 55.33 M86.29 56.5 C58.92 54.69, 32.08 53.44, -0.07 56.07 M86.55 55.62 C65.39 54.1, 43.75 54.67, -0.87 55.07 M-0.37 56.78 C1.44 37.08, -1.32 21.35, 0.15 0.15 M0.56 54.2 C-0.05 43.64, 1.32 31.94, 0.61 -0.12" stroke="#1e1e1e" stroke-width="4" fill="none"></path></g><g transform="translate(47.76399230957031 235.80001831054688) rotate(0 9.036003112792969 22.5)"><text x="9.036003112792969" y="0" font-family="Virgil, Segoe UI Emoji" font-size="36px" fill="#1e1e1e" text-anchor="middle" style="white-space: pre;" direction="ltr" dominant-baseline="text-before-edge">c</text></g><g stroke-linecap="round" transform="translate(15.600006103515625 285.60003662109375) rotate(0 43.199989318847656 27.5)"><path d="M-0.08 0.97 C17.52 0.22, 36.39 1.19, 86.73 -0.61 M0.2 0.23 C21.53 0.33, 43.76 -0.38, 85.45 -0.97 M85.29 0.15 C87.77 18.71, 84.7 42.29, 85.13 55.22 M86.23 0.91 C86.66 12.91, 87.08 26.61, 86.51 54.19 M85.83 54.35 C56.56 53.74, 27.63 56.72, -1.01 55.09 M86.94 54.72 C67.16 55.83, 46.13 55.6, 0.21 54.4 M1.11 54.72 C-1.55 39.08, 0.26 20.07, -1.83 -1.93 M-0.58 55.12 C0.49 38.34, 0.31 21.77, 0.07 0.24" stroke="#1e1e1e" stroke-width="4" fill="none"></path></g><g transform="translate(49.907989501953125 290.60003662109375) rotate(0 8.892005920410156 22.5)"><text x="8.892005920410156" y="0" font-family="Virgil, Segoe UI Emoji" font-size="36px" fill="#1e1e1e" text-anchor="middle" style="white-space: pre;" direction="ltr" dominant-baseline="text-before-edge">h</text></g><g stroke-linecap="round" transform="translate(15.199981689453125 341.2000427246094) rotate(0 43.199989318847656 27.5)"><path d="M0.13 -0.45 C20.83 0.1, 38.74 -1.02, 85.43 1.82 M-0.2 0.53 C28.21 -0.38, 54.9 -1.17, 87.12 -0.12 M87.84 -1.76 C84.46 15.61, 84.82 28.74, 85.18 56.31 M86.3 -0.22 C86.62 14.42, 86.42 27.36, 86.8 54.94 M85.91 53.1 C53.95 55.79, 20.63 54.81, -1.44 55.3 M86.86 55.29 C54.27 54.83, 24.09 54.16, 0.19 54.81 M-1.65 56.62 C-0.15 33.75, -2.13 10.27, 0.02 1.11 M0.79 54.89 C0.93 42.78, 0.38 31.05, 0.02 0.49" stroke="#1e1e1e" stroke-width="4" fill="none"></path></g><g transform="translate(52.4959716796875 346.2000427246094) rotate(0 5.903999328613281 22.5)"><text x="5.903999328613281" y="0" font-family="Virgil, Segoe UI Emoji" font-size="36px" fill="#1e1e1e" text-anchor="middle" style="white-space: pre;" direction="ltr" dominant-baseline="text-before-edge">j</text></g><g stroke-linecap="round" transform="translate(98 232.00001525878906) rotate(0 43.199989318847656 27.5)"><path d="M1.62 0.52 C30.42 -0.41, 59.22 2.02, 86.86 0.4 M0.28 -0.18 C26.94 -1.42, 56.5 -0.58, 85.99 -0.56 M84.77 1.35 C85.52 17.12, 85.57 35.11, 85.52 54.66 M86.72 0.33 C86.46 20.72, 86.74 42.99, 87.15 54.72 M86.33 56.07 C62.28 54.27, 38.74 54.48, 1.24 56.09 M85.53 55.07 C63.09 54.65, 39.55 55.07, 0.89 55.56 M0.15 55.15 C-1.37 37.35, 0.47 24.67, -1.6 -1.15 M0.61 54.88 C-0.37 38.1, -0.42 21.22, -0.57 0.07" stroke="#1e1e1e" stroke-width="4" fill="none"></path></g><g transform="translate(116.46797943115234 237.00001525878906) rotate(0 24.732009887695312 22.5)"><text x="24.732009887695312" y="0" font-family="Virgil, Segoe UI Emoji" font-size="36px" fill="#1e1e1e" text-anchor="middle" style="white-space: pre;" direction="ltr" dominant-baseline="text-before-edge">98</text></g><g stroke-linecap="round" transform="translate(100 286.80003356933594) rotate(0 43.199989318847656 27.5)"><path d="M0.33 -0.61 C23.02 1.6, 48.43 0.18, 86.86 -0.41 M-0.95 -0.97 C31.19 0.04, 60.53 -0.4, 86.47 0.72 M85.13 0.22 C84.73 12.96, 85.07 22.97, 88.23 54.81 M86.51 -0.81 C86.97 15.21, 87.32 30.25, 86.07 54.75 M85.39 55.09 C67.26 55.76, 52.24 56.55, -0.56 55.93 M86.61 54.4 C58.15 54.87, 30.42 55.61, -0.14 54.17 M-1.83 53.07 C-0.02 35.16, -1.64 11.94, 0.23 1.59 M0.07 55.24 C-0.32 39.61, -0.9 23.31, -0.17 0.88" stroke="#1e1e1e" stroke-width="4" fill="none"></path></g><g transform="translate(125.50598907470703 291.80003356933594) rotate(0 17.694000244140625 22.5)"><text x="17.694000244140625" y="0" font-family="Virgil, Segoe UI Emoji" font-size="36px" fill="#1e1e1e" text-anchor="middle" style="white-space: pre;" direction="ltr" dominant-baseline="text-before-edge">21</text></g><g stroke-linecap="round" transform="translate(99.5999755859375 342.40003967285156) rotate(0 43.199989318847656 27.5)"><path d="M-0.97 1.82 C28.61 0.66, 56.76 -0.15, 87.45 0.57 M0.72 -0.12 C23.95 0.28, 48.79 1.56, 85.52 -0.82 M85.18 1.31 C85.17 19.88, 87.88 40.25, 85.95 55.63 M86.8 -0.06 C87.21 18.05, 86.14 36.43, 85.45 54.96 M84.96 55.3 C57.08 56.12, 24.73 55.96, 0.58 53.27 M86.59 54.81 C60.79 55.04, 33.25 53.66, 0.81 55.08 M0.02 56.11 C-1.1 36.93, 0.73 22.75, -0.23 1.22 M0.02 55.49 C-0.6 39.25, -0.2 24.24, -0.27 -0.11" stroke="#1e1e1e" stroke-width="4" fill="none"></path></g><g transform="translate(117.59996032714844 347.40003967285156) rotate(0 25.20000457763672 22.5)"><text x="25.20000457763672" y="0" font-family="Virgil, Segoe UI Emoji" font-size="36px" fill="#1e1e1e" text-anchor="middle" style="white-space: pre;" direction="ltr" dominant-baseline="text-before-edge">20</text></g><g stroke-linecap="round" transform="translate(407.60003662109375 264.79998779296875) rotate(0 43.199989318847656 27.5)"><path d="M-0.85 -1.17 C17.95 1.87, 39.67 0.19, 85.22 0.64 M0.44 0.53 C25.34 0.44, 49.33 -0.68, 86.89 -0.48 M88.29 1.52 C85.27 12.99, 88.16 26.14, 85.52 53.75 M85.98 -0.46 C86.47 15.46, 87.06 30.43, 85.45 55.24 M86.01 54.53 C65.46 54.88, 42.45 54.22, -0.24 56.91 M87.32 55.51 C64.27 54.77, 42.33 54.72, 0.68 54.51 M-1.34 53.5 C-1.63 37.68, 0.76 18.99, -0.27 0.6 M0.84 54.43 C1.26 37.34, 0.45 20.97, 0.87 0.02" stroke="#1e1e1e" stroke-width="4" fill="none"></path></g><g transform="translate(441.76402282714844 269.79998779296875) rotate(0 9.036003112792969 22.5)"><text x="9.036003112792969" y="0" font-family="Virgil, Segoe UI Emoji" font-size="36px" fill="#1e1e1e" text-anchor="middle" style="white-space: pre;" direction="ltr" dominant-baseline="text-before-edge">c</text></g><g stroke-linecap="round" transform="translate(409.60003662109375 319.6000061035156) rotate(0 43.199989318847656 27.5)"><path d="M-1.9 1.71 C24.33 0.54, 47.54 1.14, 86.08 -1.63 M0.79 0.29 C24.66 -1.29, 49.35 -0.94, 85.88 0.57 M84.95 -0.65 C88.37 13.79, 86.04 28.6, 85.85 54.26 M86.67 0.48 C87.03 13.63, 85.22 26.56, 85.95 54.56 M87.47 54.49 C56.6 53.62, 26.41 56.71, -0.99 55.35 M85.92 54.11 C53.07 54.49, 21.96 54.95, 0.29 55.88 M-1.15 55.75 C1.61 34.79, 0.1 14.92, 0.31 -1.06 M0.97 54.7 C-0.31 44.19, 0.4 32.05, 0.18 0.81" stroke="#1e1e1e" stroke-width="4" fill="none"></path></g><g transform="translate(443.90802001953125 324.6000061035156) rotate(0 8.892005920410156 22.5)"><text x="8.892005920410156" y="0" font-family="Virgil, Segoe UI Emoji" font-size="36px" fill="#1e1e1e" text-anchor="middle" style="white-space: pre;" direction="ltr" dominant-baseline="text-before-edge">h</text></g><g stroke-linecap="round" transform="translate(409.20001220703125 375.20001220703125) rotate(0 43.199989318847656 27.5)"><path d="M-0.03 0.03 C19.7 -0.1, 41.44 -2.37, 86.06 0.88 M0.23 -0.83 C31.02 -0.73, 60.54 0.32, 86.11 0.95 M87.85 -1.13 C85.12 19.44, 85.45 40.65, 85.19 54.16 M87.26 0.47 C85.6 14.19, 86.1 27.46, 86.86 54.81 M86.47 53.82 C62.28 56.69, 37.65 55.13, 1.54 56.83 M85.63 54.05 C56.77 53.74, 26.07 55.1, 0.7 54.33 M1.24 55.13 C0.05 43.24, 0.63 29.22, -1.82 1.69 M0.16 55.67 C0.33 41.63, -0.36 29.03, 0.22 0.09" stroke="#1e1e1e" stroke-width="4" fill="none"></path></g><g transform="translate(446.4960021972656 380.20001220703125) rotate(0 5.903999328613281 22.5)"><text x="5.903999328613281" y="0" font-family="Virgil, Segoe UI Emoji" font-size="36px" fill="#1e1e1e" text-anchor="middle" style="white-space: pre;" direction="ltr" dominant-baseline="text-before-edge">j</text></g><g stroke-linecap="round" transform="translate(492.0000305175781 265.99998474121094) rotate(0 43.199989318847656 27.5)"><path d="M-1.18 0.64 C33 -1.65, 66.29 0.87, 87.47 1.58 M0.49 -0.48 C27.92 1.29, 56.59 1.67, 87.16 -0.72 M85.52 -1.25 C86.25 13.98, 85.58 28.61, 85.47 55.54 M85.45 0.24 C86.42 18.7, 87.33 38.09, 86.16 55.54 M86.16 56.91 C61.7 54.84, 40.52 56.32, 1.02 54.03 M87.08 54.51 C68.49 55.06, 50.71 53.51, -0.75 54.42 M-0.27 55.6 C-0.03 35.39, -2.17 19.57, -1.13 1.95 M0.87 55.02 C0.09 40.97, 0.14 25.43, 0.62 -0.52" stroke="#1e1e1e" stroke-width="4" fill="none"></path></g><g transform="translate(510.46800994873047 270.99998474121094) rotate(0 24.732009887695312 22.5)"><text x="24.732009887695312" y="0" font-family="Virgil, Segoe UI Emoji" font-size="36px" fill="#1e1e1e" text-anchor="middle" style="white-space: pre;" direction="ltr" dominant-baseline="text-before-edge">98</text></g><g stroke-linecap="round" transform="translate(494.0000305175781 320.8000030517578) rotate(0 43.199989318847656 27.5)"><path d="M-0.32 -1.63 C25.71 0.61, 53.17 1.31, 86.98 0.46 M-0.52 0.57 C18.44 1.36, 38.21 -0.31, 86.08 0.72 M85.85 -0.74 C84.94 12.55, 85.23 27.32, 87.36 56.72 M85.95 -0.44 C86.34 18.9, 85.64 38.72, 86.14 55.04 M85.41 55.35 C67.1 57.66, 45.74 54.86, -1.79 53.46 M86.69 55.88 C69.35 53.91, 50.15 54, 0.37 55.62 M0.31 53.94 C-1.75 39.82, -1.06 23.22, -0.61 0.32 M0.18 55.81 C-0.25 34.89, 0.14 14.08, 0.9 -0.31" stroke="#1e1e1e" stroke-width="4" fill="none"></path></g><g transform="translate(519.5060195922852 325.8000030517578) rotate(0 17.694000244140625 22.5)"><text x="17.694000244140625" y="0" font-family="Virgil, Segoe UI Emoji" font-size="36px" fill="#1e1e1e" text-anchor="middle" style="white-space: pre;" direction="ltr" dominant-baseline="text-before-edge">21</text></g><g stroke-linecap="round" transform="translate(493.6000061035156 376.40000915527344) rotate(0 43.199989318847656 27.5)"><path d="M-0.34 0.88 C29.75 2.29, 57.96 1.16, 84.73 0.98 M-0.29 0.95 C22.53 -1.21, 43.22 0.23, 85.83 -0.44 M85.19 -0.84 C85.32 13.6, 87.21 27.83, 87.34 53.11 M86.86 -0.19 C85.92 18.35, 85.9 35.66, 85.81 54.88 M87.94 56.83 C53.24 54.18, 16.26 53.61, -1.89 56.36 M87.1 54.33 C63.93 55.18, 43.34 56.38, 0.07 54.87 M-1.82 56.69 C-1.22 38.8, -0.69 19.03, 1.35 1.73 M0.22 55.09 C0.52 37.89, 0.8 21.49, 0.97 -0.92" stroke="#1e1e1e" stroke-width="4" fill="none"></path></g><g transform="translate(511.59999084472656 381.40000915527344) rotate(0 25.20000457763672 22.5)"><text x="25.20000457763672" y="0" font-family="Virgil, Segoe UI Emoji" font-size="36px" fill="#1e1e1e" text-anchor="middle" style="white-space: pre;" direction="ltr" dominant-baseline="text-before-edge">20</text></g><g transform="translate(38.80000305175781 20.600006103515625) rotate(0 16.884002685546875 22.5)"><text x="0" y="0" font-family="Virgil, Segoe UI Emoji" font-size="36px" fill="#1e1e1e" text-anchor="start" style="white-space: pre;" direction="ltr" dominant-baseline="text-before-edge">a1</text></g><g transform="translate(109.60002136230469 17.800018310546875) rotate(0 24.822006225585938 22.5)"><text x="0" y="0" font-family="Virgil, Segoe UI Emoji" font-size="36px" fill="#1e1e1e" text-anchor="start" style="white-space: pre;" direction="ltr" dominant-baseline="text-before-edge">a2</text></g><g stroke-linecap="round"><g transform="translate(222.92067623138428 201.60000610351562) rotate(0 60.58526916615665 -0.054746382869780064)"><path d="M1.8 -0.79 C43.71 1.81, 86.78 -0.04, 120.3 0.06 M0.84 0.38 C40.35 -1.41, 80.15 -0.72, 120.33 0.68" stroke="#1e1e1e" stroke-width="4" fill="none"></path></g><g transform="translate(222.92067623138428 201.60000610351562) rotate(0 60.58526916615665 -0.054746382869780064)"><path d="M93.66 9.35 C102.45 7.85, 112.43 2.58, 120.63 0.73 M92.7 10.52 C101.54 6.25, 110.58 3.77, 120.65 1.35" stroke="#1e1e1e" stroke-width="4" fill="none"></path></g><g transform="translate(222.92067623138428 201.60000610351562) rotate(0 60.58526916615665 -0.054746382869780064)"><path d="M94.24 -11.16 C102.83 -5.25, 112.59 -3.1, 120.63 0.73 M93.28 -9.99 C101.75 -7.37, 110.6 -2.96, 120.65 1.35" stroke="#1e1e1e" stroke-width="4" fill="none"></path></g></g><mask></mask></svg>