<svg version="1.1" xmlns="http://www.w3.org/2000/svg" viewBox="0 0 1244.8000030517578 446.6000213623047" width="1244.8000030517578" height="446.6000213623047">
  <!-- svg-source:excalidraw -->
  
  <defs>
    <style class="style-fonts">
      @font-face {
        font-family: "Virgil";
        src: url("https://excalidraw.com/Virgil.woff2");
      }
      @font-face {
        font-family: "Cascadia";
        src: url("https://excalidraw.com/Cascadia.woff2");
      }
    </style>
    
  </defs>
  <g stroke-linecap="round" transform="translate(358 42.00006103515625) rotate(0 43.199989318847656 27.5)"><path d="M1.72 -0.57 C27.01 -0.15, 51.67 -1.35, 84.45 1.66 M-0.27 -0.07 C23.17 0.93, 46.64 -0.1, 85.54 0.9 M85.63 -0.56 C84.72 14.94, 87.07 28.78, 84.82 55.82 M86.63 0.8 C85.42 15.1, 86.27 31.62, 87.37 54.8 M85.67 56.11 C67.87 54.99, 44.8 56.58, 0.14 56.5 M85.71 54.67 C68.53 55.41, 50.2 55.82, -0.39 54.64 M1 53.36 C-0.23 33.69, -1.11 14.92, -0.4 -0.18 M-0.7 54.55 C-0.07 33.92, 0.2 13.43, -0.8 0.42" stroke="#1e1e1e" stroke-width="4" fill="none"></path></g><g transform="translate(389.19398498535156 47.00006103515625) rotate(0 12.006004333496094 22.5)"><text x="12.006004333496094" y="0" font-family="Virgil, Segoe UI Emoji" font-size="36px" fill="#1e1e1e" text-anchor="middle" style="white-space: pre;" direction="ltr" dominant-baseline="text-before-edge">a</text></g><g stroke-linecap="round" transform="translate(360 96.80007934570312) rotate(0 43.199989318847656 27.5)"><path d="M1.22 1.28 C27.49 -1.2, 54.42 -2.1, 88.01 0.46 M-0.63 0.84 C21.16 0.72, 41.91 0.6, 87 -0.39 M87.38 0.85 C84.48 17.85, 87.95 39.84, 84.66 53.42 M85.67 0.04 C86.13 14.39, 85.43 29.75, 86.82 55.79 M85.05 56.77 C57.73 53.71, 33.46 54.34, 0.46 55.58 M86.32 54.83 C56.04 54.89, 23.96 54.56, 0.29 55.01 M1.91 55.74 C0.93 35.02, 0.81 18.19, 0.27 0.69 M0.13 55.59 C0.54 37.59, 0.32 19.42, 0.22 0.26" stroke="#1e1e1e" stroke-width="4" fill="none"></path></g><g transform="translate(394.1639862060547 101.80007934570312) rotate(0 9.036003112792969 22.5)"><text x="9.036003112792969" y="0" font-family="Virgil, Segoe UI Emoji" font-size="36px" fill="#1e1e1e" text-anchor="middle" style="white-space: pre;" direction="ltr" dominant-baseline="text-before-edge">c</text></g><g stroke-linecap="round" transform="translate(359.5999755859375 152.40008544921875) rotate(0 43.199989318847656 27.5)"><path d="M0.42 1.02 C19.67 2.47, 35.23 1.81, 87.14 -0.73 M0.36 0.51 C33.09 0.66, 66.56 0.68, 85.95 -0.66 M88 -1.56 C85.6 12.93, 85.71 26.56, 87.87 53.13 M86.97 -0.03 C86.99 16.15, 86.56 31.69, 87.02 54.46 M85.23 53.94 C62.04 55.21, 39.04 54.23, -1.46 55.33 M87.02 55.42 C59.56 53.88, 32.79 54.82, -0.8 54.37 M-0.1 55.14 C0.8 34.9, -1.3 12.06, 0.17 -1.38 M0.05 55.99 C1.22 32.98, -0.36 12.11, 0.69 0.05" stroke="#1e1e1e" stroke-width="4" fill="none"></path></g><g transform="translate(392.5579605102539 157.40008544921875) rotate(0 10.24200439453125 22.5)"><text x="10.24200439453125" y="0" font-family="Virgil, Segoe UI Emoji" font-size="36px" fill="#1e1e1e" text-anchor="middle" style="white-space: pre;" direction="ltr" dominant-baseline="text-before-edge">d</text></g><g stroke-linecap="round" transform="translate(442.3999938964844 43.20005798339844) rotate(0 43.199989318847656 27.5)"><path d="M-1.83 -1.47 C29.11 -0.15, 60.28 1.79, 87.92 -1.88 M-0.36 0.61 C19.76 -1.1, 40.2 -0.31, 86.11 0.09 M85.58 -0.76 C85.27 22.81, 86.63 42.47, 85.42 54.92 M86.48 -0.02 C86.38 13.02, 85.81 26.86, 86.85 54.45 M87.71 56.11 C60.33 52.98, 29.02 54.71, -0.34 54.17 M86.73 54.35 C60.61 54.88, 34.03 54.75, -0.56 54.97 M0.7 56.17 C1.13 32.32, 1.48 11.35, 1.51 -1.51 M0.38 54.54 C0.44 41.97, 1.01 27.46, -0.25 -0.92" stroke="#1e1e1e" stroke-width="4" fill="none"></path></g><g transform="translate(468.3379821777344 48.20005798339844) rotate(0 17.262001037597656 22.5)"><text x="17.262001037597656" y="0" font-family="Virgil, Segoe UI Emoji" font-size="36px" fill="#1e1e1e" text-anchor="middle" style="white-space: pre;" direction="ltr" dominant-baseline="text-before-edge">10</text></g><g stroke-linecap="round" transform="translate(444.3999938964844 98.00007629394531) rotate(0 43.199989318847656 27.5)"><path d="M0.31 -1.02 C27.79 -2.48, 57.04 -0.09, 85.18 -1.72 M0.54 0.39 C23.32 -0.45, 45.95 -1.11, 86.97 -0.7 M84.87 -1.78 C88.61 19.72, 84.93 36.69, 85.79 53.05 M86.66 -0.43 C85.56 15.21, 86.41 31.01, 86.56 55.68 M85.02 53.12 C56.17 54.51, 23.12 56.34, 1.26 53.03 M87.4 54.54 C57.2 54.05, 27.73 54.86, 0.47 54.27 M0.53 54.09 C-0.11 41.88, -0.26 26.81, 0.65 1.56 M0.97 55.88 C0.68 36.51, 0.16 16.28, -0.13 0.26" stroke="#1e1e1e" stroke-width="4" fill="none"></path></g><g transform="translate(462.8679733276367 103.00007629394531) rotate(0 24.732009887695312 22.5)"><text x="24.732009887695312" y="0" font-family="Virgil, Segoe UI Emoji" font-size="36px" fill="#1e1e1e" text-anchor="middle" style="white-space: pre;" direction="ltr" dominant-baseline="text-before-edge">98</text></g><g stroke-linecap="round" transform="translate(443.9999694824219 153.60008239746094) rotate(0 43.199989318847656 27.5)"><path d="M1.28 1.91 C18.7 0.81, 41.27 -1.17, 88.01 1.67 M0.21 0.64 C26.53 0.22, 51 -1.11, 85.79 0.36 M85.4 -0.22 C85.95 13.31, 88.31 24.2, 86.24 56.41 M86.6 0.1 C86.49 13.49, 87.33 27.26, 86.2 55.43 M86.24 54.62 C55.67 53.18, 21.38 54.88, 0.29 54.24 M86.75 54.33 C65.71 55.62, 42.69 54.74, 0.91 54.37 M0.45 56.37 C-1.61 40.7, 0.2 24.99, 1.93 -1.64 M0.77 54.79 C-0.83 33.72, 0.66 11.05, 0.76 -0.6" stroke="#1e1e1e" stroke-width="4" fill="none"></path></g><g transform="translate(476.0759582519531 158.60008239746094) rotate(0 11.124000549316406 22.5)"><text x="11.124000549316406" y="0" font-family="Virgil, Segoe UI Emoji" font-size="36px" fill="#1e1e1e" text-anchor="middle" style="white-space: pre;" direction="ltr" dominant-baseline="text-before-edge">5</text></g><g stroke-linecap="round" transform="translate(361.6000061035156 207.2000732421875) rotate(0 43.199989318847656 27.5)"><path d="M-1.23 -1.55 C31.07 1.82, 62.42 0.41, 88.02 0.52 M0.91 0.23 C27.55 0.65, 54.49 0.95, 86.68 -0.18 M86.16 -0.81 C84.75 11.43, 87.3 20.8, 84.77 56.35 M87.05 -0.44 C86.29 13.91, 86.37 25.77, 86.72 55.33 M86.29 56.5 C58.92 54.69, 32.08 53.44, -0.07 56.07 M86.55 55.62 C65.39 54.1, 43.75 54.67, -0.87 55.07 M-0.37 56.78 C1.44 37.08, -1.32 21.35, 0.15 0.15 M0.56 54.2 C-0.05 43.64, 1.32 31.94, 0.61 -0.12" stroke="#1e1e1e" stroke-width="4" fill="none"></path></g><g transform="translate(395.78199005126953 212.2000732421875) rotate(0 9.01800537109375 22.5)"><text x="9.01800537109375" y="0" font-family="Virgil, Segoe UI Emoji" font-size="36px" fill="#1e1e1e" text-anchor="middle" style="white-space: pre;" direction="ltr" dominant-baseline="text-before-edge">g</text></g><g stroke-linecap="round" transform="translate(363.6000061035156 262.0000915527344) rotate(0 43.199989318847656 27.5)"><path d="M-0.08 0.97 C17.52 0.22, 36.39 1.19, 86.73 -0.61 M0.2 0.23 C21.53 0.33, 43.76 -0.38, 85.45 -0.97 M85.29 0.15 C87.77 18.71, 84.7 42.29, 85.13 55.22 M86.23 0.91 C86.66 12.91, 87.08 26.61, 86.51 54.19 M85.83 54.35 C56.56 53.74, 27.63 56.72, -1.01 55.09 M86.94 54.72 C67.16 55.83, 46.13 55.6, 0.21 54.4 M1.11 54.72 C-1.55 39.08, 0.26 20.07, -1.83 -1.93 M-0.58 55.12 C0.49 38.34, 0.31 21.77, 0.07 0.24" stroke="#1e1e1e" stroke-width="4" fill="none"></path></g><g stroke-linecap="round" transform="translate(363.1999816894531 317.60009765625) rotate(0 43.199989318847656 27.5)"><path d="M0.13 -0.45 C20.83 0.1, 38.74 -1.02, 85.43 1.82 M-0.2 0.53 C28.21 -0.38, 54.9 -1.17, 87.12 -0.12 M87.84 -1.76 C84.46 15.61, 84.82 28.74, 85.18 56.31 M86.3 -0.22 C86.62 14.42, 86.42 27.36, 86.8 54.94 M85.91 53.1 C53.95 55.79, 20.63 54.81, -1.44 55.3 M86.86 55.29 C54.27 54.83, 24.09 54.16, 0.19 54.81 M-1.65 56.62 C-0.15 33.75, -2.13 10.27, 0.02 1.11 M0.79 54.89 C0.93 42.78, 0.38 31.05, 0.02 0.49" stroke="#1e1e1e" stroke-width="4" fill="none"></path></g><g stroke-linecap="round" transform="translate(446 208.4000701904297) rotate(0 43.199989318847656 27.5)"><path d="M1.62 0.52 C30.42 -0.41, 59.22 2.02, 86.86 0.4 M0.28 -0.18 C26.94 -1.42, 56.5 -0.58, 85.99 -0.56 M84.77 1.35 C85.52 17.12, 85.57 35.11, 85.52 54.66 M86.72 0.33 C86.46 20.72, 86.74 42.99, 87.15 54.72 M86.33 56.07 C62.28 54.27, 38.74 54.48, 1.24 56.09 M85.53 55.07 C63.09 54.65, 39.55 55.07, 0.89 55.56 M0.15 55.15 C-1.37 37.35, 0.47 24.67, -1.6 -1.15 M0.61 54.88 C-0.37 38.1, -0.42 21.22, -0.57 0.07" stroke="#1e1e1e" stroke-width="4" fill="none"></path></g><g transform="translate(466.5559844970703 213.4000701904297) rotate(0 22.644004821777344 22.5)"><text x="22.644004821777344" y="0" font-family="Virgil, Segoe UI Emoji" font-size="36px" fill="#1e1e1e" text-anchor="middle" style="white-space: pre;" direction="ltr" dominant-baseline="text-before-edge">54</text></g><g stroke-linecap="round" transform="translate(448 263.20008850097656) rotate(0 43.199989318847656 27.5)"><path d="M0.33 -0.61 C23.02 1.6, 48.43 0.18, 86.86 -0.41 M-0.95 -0.97 C31.19 0.04, 60.53 -0.4, 86.47 0.72 M85.13 0.22 C84.73 12.96, 85.07 22.97, 88.23 54.81 M86.51 -0.81 C86.97 15.21, 87.32 30.25, 86.07 54.75 M85.39 55.09 C67.26 55.76, 52.24 56.55, -0.56 55.93 M86.61 54.4 C58.15 54.87, 30.42 55.61, -0.14 54.17 M-1.83 53.07 C-0.02 35.16, -1.64 11.94, 0.23 1.59 M0.07 55.24 C-0.32 39.61, -0.9 23.31, -0.17 0.88" stroke="#1e1e1e" stroke-width="4" fill="none"></path></g><g stroke-linecap="round" transform="translate(447.5999755859375 318.8000946044922) rotate(0 43.199989318847656 27.5)"><path d="M-0.97 1.82 C28.61 0.66, 56.76 -0.15, 87.45 0.57 M0.72 -0.12 C23.95 0.28, 48.79 1.56, 85.52 -0.82 M85.18 1.31 C85.17 19.88, 87.88 40.25, 85.95 55.63 M86.8 -0.06 C87.21 18.05, 86.14 36.43, 85.45 54.96 M84.96 55.3 C57.08 56.12, 24.73 55.96, 0.58 53.27 M86.59 54.81 C60.79 55.04, 33.25 53.66, 0.81 55.08 M0.02 56.11 C-1.1 36.93, 0.73 22.75, -0.23 1.22 M0.02 55.49 C-0.6 39.25, -0.2 24.24, -0.27 -0.11" stroke="#1e1e1e" stroke-width="4" fill="none"></path></g><g stroke-linecap="round" transform="translate(1058.4000244140625 47.2000732421875) rotate(0 43.199989318847656 27.5)"><path d="M1.26 0.81 C31.77 1.06, 63.07 -1.33, 87.47 -1.98 M0.05 -0.5 C28.11 -0.26, 57.7 0.42, 86.95 0.28 M85.45 1.91 C87.08 20.3, 85.85 43.02, 85.48 54.02 M85.45 -0.13 C87.52 20.76, 85.92 41.17, 86.12 55.99 M86.67 53.34 C56.53 55.37, 27.7 54.26, 1.03 56.65 M86.43 54.02 C62.32 55.23, 37.37 54.33, -0.05 54.5 M-0.04 54.28 C2.44 40.09, -0.83 25.41, -1.55 -1.98 M-0.42 54.13 C0.15 37.76, 0.08 19.16, 0 0.64" stroke="#1e1e1e" stroke-width="4" fill="none"></path></g><g transform="translate(1089.594009399414 52.2000732421875) rotate(0 12.006004333496094 22.5)"><text x="12.006004333496094" y="0" font-family="Virgil, Segoe UI Emoji" font-size="36px" fill="#1e1e1e" text-anchor="middle" style="white-space: pre;" direction="ltr" dominant-baseline="text-before-edge">a</text></g><g stroke-linecap="round" transform="translate(1060.4000244140625 102.00009155273438) rotate(0 43.199989318847656 27.5)"><path d="M-0.12 1.01 C24.66 -1.73, 51.82 -2.33, 87.08 -1.3 M-0.74 -0.04 C28.05 1.06, 56.67 0.7, 87.38 -0.06 M87.11 -1.58 C85.62 13.04, 85.21 26.57, 87.8 56 M87.25 0.4 C85.12 16.18, 85.6 32.43, 86.69 54.39 M84.98 55.4 C58.96 53.57, 36.19 55.94, -0.35 55.5 M86.72 55.97 C67.65 54.22, 49.31 53.65, -0.2 54.11 M1.95 55.48 C-1.31 39.49, -1.54 19.6, 0.52 -0.46 M0.02 55.7 C0.19 37.81, 0.23 21.17, 0.93 0.84" stroke="#1e1e1e" stroke-width="4" fill="none"></path></g><g transform="translate(1094.5640106201172 107.00009155273438) rotate(0 9.036003112792969 22.5)"><text x="9.036003112792969" y="0" font-family="Virgil, Segoe UI Emoji" font-size="36px" fill="#1e1e1e" text-anchor="middle" style="white-space: pre;" direction="ltr" dominant-baseline="text-before-edge">c</text></g><g stroke-linecap="round" transform="translate(1060 157.60009765625) rotate(0 43.199989318847656 27.5)"><path d="M1.01 -0.72 C29.99 1.13, 60.77 0.73, 85.1 0.5 M-0.04 -0.01 C26.98 1.19, 52.97 1.62, 86.34 -0.5 M84.82 -0.51 C86.19 12.95, 85.95 29.15, 87.4 54.72 M86.8 -0.75 C86.8 11.01, 87.32 22.86, 85.79 54.97 M86.8 53.18 C58.61 55.41, 33.9 54.03, 0.5 53.29 M87.37 54.77 C60.3 55.23, 33.56 55.08, -0.89 55.04 M0.48 53.68 C1.4 37.07, -1.78 22.77, -0.46 0.27 M0.7 54.96 C0.52 40.81, 1.12 27.56, 0.84 0.15" stroke="#1e1e1e" stroke-width="4" fill="none"></path></g><g transform="translate(1092.9579849243164 162.60009765625) rotate(0 10.24200439453125 22.5)"><text x="10.24200439453125" y="0" font-family="Virgil, Segoe UI Emoji" font-size="36px" fill="#1e1e1e" text-anchor="middle" style="white-space: pre;" direction="ltr" dominant-baseline="text-before-edge">d</text></g><g stroke-linecap="round" transform="translate(1142.8000183105469 48.40007019042969) rotate(0 43.199989318847656 27.5)"><path d="M-0.72 -1.38 C30.5 -2.41, 59.53 -1.74, 86.9 0.1 M-0.01 0.63 C22.18 0.31, 44.25 -0.03, 85.9 -0.48 M85.89 -0.74 C85.67 20.77, 88 44.51, 86.12 53.1 M85.65 0.46 C86.59 16.79, 87.16 31, 86.37 55.13 M84.58 54.29 C68.67 56.83, 48.54 55.68, -1.71 55.06 M86.17 55.07 C68.93 55.34, 51.35 54.95, 0.04 54.98 M-1.32 56.2 C-2.09 38.51, -0.01 25.51, 0.27 -0.84 M-0.04 55.05 C-0.01 43.94, 0.92 32.43, 0.15 0.39" stroke="#1e1e1e" stroke-width="4" fill="none"></path></g><g transform="translate(1168.7380065917969 53.40007019042969) rotate(0 17.262001037597656 22.5)"><text x="17.262001037597656" y="0" font-family="Virgil, Segoe UI Emoji" font-size="36px" fill="#1e1e1e" text-anchor="middle" style="white-space: pre;" direction="ltr" dominant-baseline="text-before-edge">10</text></g><g stroke-linecap="round" transform="translate(1144.8000183105469 103.20008850097656) rotate(0 43.199989318847656 27.5)"><path d="M1.07 -1.98 C30.95 -0.7, 61.04 0.7, 85.41 -1.48 M0.55 0.28 C26.54 -0.61, 50.63 -1.02, 87.35 0.36 M85.48 -0.98 C87.66 13.15, 85.98 22.39, 86.15 56.69 M86.12 0.99 C86.28 18.12, 85.95 37.59, 85.57 54.29 M87.43 56.65 C58.4 55.2, 29.39 54.75, -1.97 55.64 M86.35 54.5 C51.9 54.17, 17.85 55.04, -0.36 55.98 M-1.55 53.02 C0.89 36.71, 0.63 18.5, -1.74 0.04 M0 55.64 C0.96 35.48, 0.17 14.67, 0.09 -0.95" stroke="#1e1e1e" stroke-width="4" fill="none"></path></g><g transform="translate(1163.2679977416992 108.20008850097656) rotate(0 24.732009887695312 22.5)"><text x="24.732009887695312" y="0" font-family="Virgil, Segoe UI Emoji" font-size="36px" fill="#1e1e1e" text-anchor="middle" style="white-space: pre;" direction="ltr" dominant-baseline="text-before-edge">98</text></g><g stroke-linecap="round" transform="translate(1144.3999938964844 158.8000946044922) rotate(0 43.199989318847656 27.5)"><path d="M-1.98 0.68 C21.52 0.03, 45.74 -1.45, 84.92 -0.08 M0.28 0.98 C25.75 -0.97, 51.15 0.48, 86.76 -0.79 M85.42 1.4 C87.2 14.8, 84.3 29.93, 88.09 55.81 M87.39 0.29 C86.05 12.32, 86.79 23.87, 85.69 55.2 M88.05 54.65 C68.84 53.73, 50.32 53.48, 0.64 56.94 M85.9 54.8 C61.57 55, 38.49 54.6, 0.98 55.24 M-1.98 55.52 C-0.79 42.39, -1.17 27.5, 0.04 1.4 M0.64 55.93 C0.81 38.89, 0.37 22.57, -0.95 0.67" stroke="#1e1e1e" stroke-width="4" fill="none"></path></g><g transform="translate(1176.4759826660156 163.8000946044922) rotate(0 11.124000549316406 22.5)"><text x="11.124000549316406" y="0" font-family="Virgil, Segoe UI Emoji" font-size="36px" fill="#1e1e1e" text-anchor="middle" style="white-space: pre;" direction="ltr" dominant-baseline="text-before-edge">5</text></g><g stroke-linecap="round" transform="translate(1062.0000305175781 212.40008544921875) rotate(0 43.199989318847656 27.5)"><path d="M0.1 -0.99 C27.37 -0.3, 57.68 1.05, 87.49 0.55 M-0.48 0.95 C34.73 -0.36, 68.49 0.06, 85.94 -0.49 M84.5 -0.25 C88.37 21.16, 85.17 41.63, 85.84 56.97 M86.53 -0.83 C85.35 18.31, 85.16 35.86, 86.91 55.83 M86.46 53.03 C62.64 56.2, 37.15 54.4, -0.09 54.01 M86.38 54.64 C63.19 55.27, 37.37 55.63, -0.78 54.01 M-0.84 53.26 C0.16 38.46, 0.04 19.21, 0 1.29 M0.39 55.09 C-1.41 34.04, -1.36 11.5, -0.06 -0.42" stroke="#1e1e1e" stroke-width="4" fill="none"></path></g><g transform="translate(1096.182014465332 217.40008544921875) rotate(0 9.01800537109375 22.5)"><text x="9.01800537109375" y="0" font-family="Virgil, Segoe UI Emoji" font-size="36px" fill="#1e1e1e" text-anchor="middle" style="white-space: pre;" direction="ltr" dominant-baseline="text-before-edge">g</text></g><g stroke-linecap="round" transform="translate(1064.0000305175781 267.2001037597656) rotate(0 43.199989318847656 27.5)"><path d="M-0.99 -1.48 C20.22 -0.07, 41.87 1.05, 86.95 1.96 M0.95 0.36 C24.59 0.16, 50.39 -0.05, 85.91 0.7 M86.15 1.69 C87.13 17.75, 87.25 37.97, 88.37 55.58 M85.57 -0.71 C86.58 12.24, 86.02 26.81, 87.23 54.82 M84.43 55.64 C60.24 54.57, 30.35 54.93, -0.99 54.6 M86.04 55.98 C68.39 54.32, 50.5 54.21, -0.99 55.26 M-1.74 55.04 C1.33 39.69, 0.02 24.55, 1.29 1.87 M0.09 54.05 C0.59 32.99, -0.31 12.72, -0.42 0.64" stroke="#1e1e1e" stroke-width="4" fill="none"></path></g><g stroke-linecap="round" transform="translate(1063.6000061035156 322.80010986328125) rotate(0 43.199989318847656 27.5)"><path d="M-1.48 -0.08 C28.04 1.69, 57.22 0.98, 88.36 -0.12 M0.36 -0.79 C21.38 -1.19, 42.81 -1.31, 87.1 0.5 M88.09 0.81 C84.37 16.65, 85.32 33.41, 86.98 53.78 M85.69 0.2 C85.56 15.95, 86.99 33.44, 86.22 55.25 M87.04 56.94 C67.42 54.29, 49.27 53.16, -0.4 53.22 M87.38 55.24 C59.49 55.29, 33.12 53.7, 0.26 54.77 M0.04 56.4 C0.14 37.85, 0.23 21.81, 1.87 1.68 M-0.95 55.67 C-1.11 37.45, -0.27 19.95, 0.64 -0.89" stroke="#1e1e1e" stroke-width="4" fill="none"></path></g><g stroke-linecap="round" transform="translate(1146.4000244140625 213.60008239746094) rotate(0 43.199989318847656 27.5)"><path d="M-0.08 -0.02 C27.61 1.73, 53.24 2.6, 86.28 -0.99 M-0.79 -0.26 C21.43 -0.77, 43.1 0.39, 86.9 -0.14 M87.21 -1.51 C87.26 10.73, 88.31 23.16, 85.18 54.93 M86.6 -0.91 C85.59 17.75, 86.77 34.3, 86.65 54.14 M88.34 54.54 C60.37 55.18, 33.06 54.87, -1.78 55.08 M86.64 54.34 C61.27 55.07, 33.96 56.11, -0.23 55.13 M1.4 54.91 C0.57 40.81, 1.77 28.49, 1.68 0.3 M0.67 54.1 C-0.28 36.29, -0.47 18.33, -0.89 0.5" stroke="#1e1e1e" stroke-width="4" fill="none"></path></g><g transform="translate(1166.9560089111328 218.60008239746094) rotate(0 22.644004821777344 22.5)"><text x="22.644004821777344" y="0" font-family="Virgil, Segoe UI Emoji" font-size="36px" fill="#1e1e1e" text-anchor="middle" style="white-space: pre;" direction="ltr" dominant-baseline="text-before-edge">54</text></g><g stroke-linecap="round" transform="translate(1148.4000244140625 268.4001007080078) rotate(0 43.199989318847656 27.5)"><path d="M-0.02 1.26 C22.73 0.59, 45.23 -0.09, 85.41 -0.95 M-0.26 -0.37 C33.71 0.2, 69.04 1.19, 86.26 -0.95 M84.89 0.93 C86.31 17.78, 87.45 30.39, 86.33 55.27 M85.49 -0.36 C86.52 12.77, 85.83 24.13, 85.54 55.03 M85.94 55.14 C68.88 54.84, 51.15 54.06, 0.08 54.96 M85.74 55.6 C62.83 54.22, 41.07 54.98, 0.13 54.58 M-0.09 55.09 C-0.01 44.58, 1.86 33.26, 0.3 0.78 M-0.9 54.77 C0.47 37.61, 1.17 20.18, 0.5 0.63" stroke="#1e1e1e" stroke-width="4" fill="none"></path></g><g stroke-linecap="round" transform="translate(1148 324.00010681152344) rotate(0 43.199989318847656 27.5)"><path d="M1.26 1.09 C20.06 1.97, 38.9 -0.98, 85.45 1.91 M-0.37 -0.46 C28.5 0.92, 58.49 0.08, 85.45 -0.13 M87.33 -0.56 C88.6 21.74, 85.4 42.24, 86.67 53.34 M86.04 0.51 C87.34 12.41, 86.76 24.31, 86.43 54.02 M86.54 54.91 C56.72 54.4, 27.25 54.88, -0.04 54.28 M87 54.22 C51.06 54.69, 17.46 54.57, -0.42 54.13 M0.09 55 C0.9 40.27, 1.29 22.09, 0.78 0.17 M-0.23 54.94 C-0.79 44.37, -1.26 32.95, 0.63 -0.39" stroke="#1e1e1e" stroke-width="4" fill="none"></path></g><g stroke-linecap="round" transform="translate(10 10) rotate(0 43.199989318847656 27.5)"><path d="M0.12 0.3 L88.05 -1.97 L85.93 54.89 L0.97 56.07" stroke="none" stroke-width="0" fill="#b2f2bb"></path><path d="M0.89 -0.08 C25.28 1.45, 51.52 1.37, 87.04 -0.58 M-0.9 -0.42 C20.72 -0.22, 40.87 -0.64, 85.66 0.4 M84.93 1.6 C85.68 18.55, 85.61 34.1, 87.07 54.02 M85.96 -0.02 C86.35 15.72, 86.55 31.82, 85.74 55.1 M84.46 55.85 C62.23 56.08, 36.09 56.33, -0.03 54.61 M86.44 54.26 C63.04 55.43, 38.93 56.23, -0.91 55.15 M0.37 53.96 C-1.78 35.51, -1.57 13.09, -0.06 1.43 M-0.78 55.54 C0.42 37.26, -0.31 18.46, -0.67 0.29" stroke="#1e1e1e" stroke-width="4" fill="none"></path></g><g stroke-linecap="round" transform="translate(12 64.80001831054688) rotate(0 43.199989318847656 27.5)"><path d="M1.65 -1.97 L85.93 -0.11 L87.37 56.07 L1.07 54" stroke="none" stroke-width="0" fill="#b2f2bb"></path><path d="M-1.1 1.28 C22.91 1.23, 48.97 -0.55, 85.05 -1.18 M0.63 0.55 C34.32 0.5, 66.55 0.76, 86.5 -0.3 M85.84 1.48 C85.37 11.57, 86.67 22.22, 86.27 56.31 M85.99 -0.42 C85.95 18.38, 85.49 37.79, 86.32 55.01 M87.48 55.87 C58.55 56.48, 30.28 54.98, -0.44 55.73 M87.08 54.64 C53.13 54.8, 17.73 54.51, 0.74 54.94 M-1.81 56.1 C-1.7 37.82, -0.16 23.54, 0.71 -0.44 M0.3 55.72 C0 42.46, -0.24 29.49, 0.06 0.15" stroke="#1e1e1e" stroke-width="4" fill="none"></path></g><g stroke-linecap="round" transform="translate(11.5999755859375 120.4000244140625) rotate(0 43.199989318847656 27.5)"><path d="M-0.47 -0.11 L87.37 1.07 L87.47 54 L-0.37 53.44" stroke="none" stroke-width="0" fill="#b2f2bb"></path><path d="M-1.25 1.19 C26.23 -1.13, 49.82 -1.74, 88.19 -1.8 M0.68 0.14 C21.56 -0.08, 44.7 -0.77, 85.51 -0.74 M85.78 -0.03 C86.92 19.92, 86.12 43.1, 87.25 54.11 M86.19 -0.46 C85.51 16.52, 86.1 32.84, 86.65 54.03 M86.6 56.12 C56.79 54.99, 26.79 56.11, 1.84 55.08 M87 55.44 C65.96 54.84, 48.08 54.62, -0.01 55.19 M-1.6 54.26 C0.44 42.78, 1.21 27.25, -1.31 -1.56 M-0.43 55.37 C-0.83 35.81, -0.1 16.19, 0.83 -0.98" stroke="#1e1e1e" stroke-width="4" fill="none"></path></g><g transform="translate(45.781959533691406 125.4000244140625) rotate(0 9.01800537109375 22.5)"><text x="9.01800537109375" y="0" font-family="Virgil, Segoe UI Emoji" font-size="36px" fill="#1e1e1e" text-anchor="middle" style="white-space: pre;" direction="ltr" dominant-baseline="text-before-edge">g</text></g><g stroke-linecap="round" transform="translate(94.39999389648438 11.199996948242188) rotate(0 43.199989318847656 27.5)"><path d="M0.97 1.07 L87.47 -1 L86.03 53.44 L-1.97 55.61" stroke="none" stroke-width="0" fill="#b2f2bb"></path><path d="M0.64 -0.58 C30.09 -1.7, 64.66 -2.31, 85.56 1.25 M-0.74 0.4 C30.78 -0.41, 60.47 -0.85, 87.2 -0.28 M87.07 -0.98 C86.1 21.88, 87.08 40.25, 86.37 54.17 M85.74 0.1 C86.21 14.19, 86.53 27.4, 86.82 55.54 M86.37 54.61 C56.28 56.22, 28.88 55.56, -1.48 56.35 M85.49 55.15 C64.35 55.31, 40.8 55.56, -0.52 54.09 M-0.06 56.43 C1.15 35.03, -0.87 14.39, 1.08 0.59 M-0.67 55.29 C0.3 34.72, 1.06 13.15, -0.24 -0.06" stroke="#1e1e1e" stroke-width="4" fill="none"></path></g><g stroke-linecap="round" transform="translate(96.39999389648438 66.00001525878906) rotate(0 43.199989318847656 27.5)"><path d="M1.07 -1 L86.03 -1.56 L84.43 55.61 L0.16 55.33" stroke="none" stroke-width="0" fill="#b2f2bb"></path><path d="M-1.35 -1.18 C32.86 -1.55, 61.3 1.5, 87.5 1.36 M0.1 -0.3 C26.2 -1.08, 54.97 -0.63, 87.14 -0.31 M86.27 1.31 C87.44 15.53, 86.55 32, 85.56 54.59 M86.32 0.01 C86.28 12.98, 86.46 28.44, 86.84 55.1 M85.96 55.73 C57.5 54.91, 23.44 56.18, -0.72 56.21 M87.14 54.94 C56.69 55.32, 26.48 54.22, 0.55 54.2 M0.71 54.56 C-1.29 38.97, 1.1 26.65, 1.43 -0.86 M0.06 55.15 C1.19 35.5, 0.13 17.91, 0.49 0.53" stroke="#1e1e1e" stroke-width="4" fill="none"></path></g><g stroke-linecap="round" transform="translate(95.99996948242188 121.60002136230469) rotate(0 43.199989318847656 27.5)"><path d="M-0.37 -1.56 L84.43 0.61 L86.56 55.33 L1.23 54.12" stroke="none" stroke-width="0" fill="#b2f2bb"></path><path d="M1.79 -1.8 C22.58 1.76, 47.93 1.87, 86.67 -1.48 M-0.89 -0.74 C30.17 -0.02, 59.48 -0.05, 86.38 0.34 M87.25 -0.89 C86.33 12.98, 85.52 27.2, 85.47 53.67 M86.65 -0.97 C86.78 17.61, 86.79 34.24, 86.96 54.99 M88.24 55.08 C60.68 56.67, 37.19 56.53, 0.88 53.17 M86.39 55.19 C58.67 54.04, 32.52 54.14, -0.37 54.97 M-1.31 53.44 C0.89 35.15, 1.23 13.26, 0.73 -1.33 M0.83 54.02 C-0.27 36.83, 0.45 19.3, 0.54 -0.5" stroke="#1e1e1e" stroke-width="4" fill="none"></path></g><g transform="translate(116.55595397949219 126.60002136230469) rotate(0 22.644004821777344 22.5)"><text x="22.644004821777344" y="0" font-family="Virgil, Segoe UI Emoji" font-size="36px" fill="#1e1e1e" text-anchor="middle" style="white-space: pre;" direction="ltr" dominant-baseline="text-before-edge">54</text></g><g stroke-linecap="round" transform="translate(710.4000244140625 15.20001220703125) rotate(0 43.199989318847656 27.5)"><path d="M-0.54 -1.61 L85.83 -1.53 L84.64 55.5 L1.29 53.6" stroke="none" stroke-width="0" fill="#b2f2bb"></path><path d="M-1.58 -0.51 C21.06 -1.23, 42.61 1.09, 87.4 -0.28 M0.4 -0.75 C18.19 -1.01, 36.44 -0.44, 85.79 -0.03 M86.8 -1.82 C85.23 18.27, 87.6 34.12, 86.9 53.29 M87.37 -0.23 C85.93 16.62, 85.36 33.12, 85.51 55.04 M86.88 53.68 C61.87 54.29, 32.97 56.37, -0.46 55.27 M87.1 54.96 C64.16 55.02, 42.47 55.95, 0.84 55.15 M1.35 53.2 C-0.51 36.23, -0.89 18.97, -1.77 1 M-0.58 54.39 C-0.48 34.29, -0.67 14.27, -0.24 0.24" stroke="#1e1e1e" stroke-width="4" fill="none"></path></g><g stroke-linecap="round" transform="translate(712.4000244140625 70.00003051757812) rotate(0 43.199989318847656 27.5)"><path d="M-0.57 -1.53 L84.64 0.5 L87.69 53.6 L1.71 53.12" stroke="none" stroke-width="0" fill="#b2f2bb"></path><path d="M-0.74 -0.92 C28.02 1.62, 58.99 -0.06, 84.5 -0.25 M0.46 -0.28 C34.22 0.94, 65.86 0.62, 86.53 -0.83 M85.69 1.03 C88.16 12.23, 87.01 23.46, 86.46 53.03 M86.47 -0.05 C86.44 18.06, 86.05 36.56, 86.38 54.64 M87.6 53.45 C50.07 54.96, 17.22 54.7, -0.84 53.26 M86.45 55 C60.97 55.9, 35.08 55.11, 0.39 55.09 M-0.47 54.89 C-1.22 45.01, -2.14 33.45, 1.26 -0.79 M-0.7 54.26 C-0.56 37.45, 0.08 21.73, -0.27 -0.81" stroke="#1e1e1e" stroke-width="4" fill="none"></path></g><g stroke-linecap="round" transform="translate(712 125.60003662109375) rotate(0 43.199989318847656 27.5)"><path d="M-1.76 0.5 L87.69 -1.4 L88.11 53.12 L1.46 55.51" stroke="none" stroke-width="0" fill="#b2f2bb"></path><path d="M-0.98 1.4 C24.71 0.11, 45.51 0.15, 88.09 0.81 M0.99 0.29 C18.79 0.21, 38.94 -0.59, 85.69 0.2 M88.05 -0.35 C86.71 9.79, 86.26 21.04, 87.04 56.94 M85.9 -0.2 C85.55 15.28, 86.42 30.13, 87.38 55.24 M84.42 55.52 C65.71 54.6, 45.1 52.59, 0.04 56.4 M87.04 55.93 C61.7 55.15, 35.71 55.09, -0.95 55.67 M-0.85 56.29 C-1.64 44.44, 1.39 31.1, 0.09 -1.17 M-0.89 54.21 C0.14 42.06, 0.11 27.85, -0.28 -0.77" stroke="#1e1e1e" stroke-width="4" fill="none"></path></g><g stroke-linecap="round" transform="translate(794.8000183105469 16.400009155273438) rotate(0 43.199989318847656 27.5)"><path d="M1.29 -1.4 L88.11 -1.88 L87.86 55.51 L0.47 55.18" stroke="none" stroke-width="0" fill="#b2f2bb"></path><path d="M1 -0.28 C20.04 -0.86, 45.56 0.2, 84.89 0.93 M-0.61 -0.03 C23.64 -1.08, 46.31 -0.05, 85.49 -0.36 M86.9 -1.71 C86.91 17.36, 87.5 40.6, 85.94 55.14 M85.51 0.04 C86.1 15.88, 87.1 32.73, 85.74 55.6 M85.94 55.27 C66.34 53.48, 48 56.63, -0.09 55.09 M87.24 55.15 C60.87 55.89, 33.6 56.48, -0.9 54.77 M-1.77 56 C1.49 38.02, 0.33 21.46, -1.21 -1.4 M-0.24 55.24 C0.22 41.76, 0.2 29.38, -0.88 0.25" stroke="#1e1e1e" stroke-width="4" fill="none"></path></g><g stroke-linecap="round" transform="translate(796.8000183105469 71.20002746582031) rotate(0 43.199989318847656 27.5)"><path d="M1.71 -1.88 L87.86 0.51 L86.87 55.18 L1.75 56.4" stroke="none" stroke-width="0" fill="#b2f2bb"></path><path d="M-1.9 -0.25 C33.66 0.93, 62.43 1.05, 85.84 1.97 M0.13 -0.83 C27.73 0.23, 55.98 -0.33, 86.91 0.83 M86.46 -1.97 C87.18 17.47, 86.08 31.21, 86.31 54.01 M86.38 -0.36 C86.89 15.64, 85.25 31.39, 85.62 54.01 M85.56 53.26 C58.25 56.52, 29.94 55.21, 0 56.29 M86.79 55.09 C51.47 55.8, 17.53 54.89, -0.06 54.58 M1.26 54.21 C0.58 33.8, -0.72 13.53, -1.48 -1.77 M-0.27 54.19 C-0.15 42.09, -0.75 30.95, 0.65 -0.7" stroke="#1e1e1e" stroke-width="4" fill="none"></path></g><g stroke-linecap="round" transform="translate(796.3999938964844 126.80003356933594) rotate(0 43.199989318847656 27.5)"><path d="M1.46 0.51 L86.87 0.18 L88.15 56.4 L0.54 54.17" stroke="none" stroke-width="0" fill="#b2f2bb"></path><path d="M1.69 0.81 C23.19 1.04, 48.83 2.08, 86.98 -1.22 M-0.71 0.2 C24.71 0.36, 51.75 1.54, 86.22 0.25 M87.04 1.94 C85.96 11.93, 86.32 22.59, 86 53.22 M87.38 0.24 C85.73 17.31, 85.61 32.43, 86.66 54.77 M86.44 56.4 C59.23 54.34, 32.24 55.53, 1.87 56.68 M85.45 55.67 C58.31 54.84, 31.95 54.65, 0.64 54.11 M0.09 53.83 C-1.56 34.36, -1.83 14.74, -1.58 -0.49 M-0.28 54.23 C-0.73 37.46, 0.79 18.71, 0.86 -0.94" stroke="#1e1e1e" stroke-width="4" fill="none"></path></g><g stroke-linecap="round" transform="translate(14.399993896484375 264.79998779296875) rotate(0 43.199989318847656 27.5)"><path d="M-1.97 0.61 L86.56 0.33 L87.63 54.12 L0.69 53.35" stroke="none" stroke-width="0" fill="#b2f2bb"></path><path d="M-0.84 1.25 C21.9 2.14, 41.87 -0.7, 87.2 0.21 M0.8 -0.28 C24.09 0.32, 46.69 0.97, 85.91 -0.06 M86.37 -0.83 C85.79 19.69, 85.71 38.87, 86.61 54.85 M86.82 0.54 C86.97 16.65, 87.09 33.09, 86.21 54.78 M84.92 56.35 C56.58 56.25, 29.09 53.21, 0.3 56.49 M85.88 54.09 C61.59 54.36, 35.31 55.13, 0.72 55.36 M1.08 55.59 C1.79 38.85, 1.09 23.1, 0.59 0.12 M-0.24 54.94 C0.03 38.2, 0.08 19.83, -0.19 -0.78" stroke="#1e1e1e" stroke-width="4" fill="none"></path></g><g stroke-linecap="round" transform="translate(16.399993896484375 319.6000061035156) rotate(0 43.199989318847656 27.5)"><path d="M1.1 1.36 C18.42 -2.02, 37.1 -0.34, 85.81 -1.78 M0.74 -0.31 C19.55 0.58, 38.63 0.18, 87.05 0.43 M85.56 -0.41 C85.46 12.73, 86.6 27.95, 86.42 55.49 M86.84 0.1 C87.19 11.14, 86.44 22.09, 86.77 55.92 M85.68 56.21 C61 53.76, 34.15 57.07, -0.13 54.98 M86.95 54.2 C58.5 54.19, 32.05 54.57, -0.22 54.35 M1.43 54.14 C0.43 41.46, 0.29 30.71, 0.3 1.65 M0.49 55.53 C0.67 43.41, -0.06 32.05, -0.99 0.31" stroke="#1e1e1e" stroke-width="4" fill="none"></path></g><g transform="translate(50.707977294921875 324.6000061035156) rotate(0 8.892005920410156 22.5)"><text x="8.892005920410156" y="0" font-family="Virgil, Segoe UI Emoji" font-size="36px" fill="#1e1e1e" text-anchor="middle" style="white-space: pre;" direction="ltr" dominant-baseline="text-before-edge">h</text></g><g stroke-linecap="round" transform="translate(15.999969482421875 375.20001220703125) rotate(0 43.199989318847656 27.5)"><path d="M0.27 -1.48 C32.13 -0.38, 62.06 -2.37, 84.93 1.6 M-0.02 0.34 C23 0.2, 47.64 0.7, 85.96 -0.02 M85.47 -1.33 C86.38 14.07, 86.19 28.94, 84.46 55.85 M86.96 -0.01 C86.45 19.26, 87.01 39.87, 86.44 54.26 M87.28 53.17 C54.94 57.01, 22.76 55.5, 0.37 53.96 M86.03 54.97 C69.03 54.66, 50.01 53.65, -0.78 55.54 M0.73 53.67 C0.19 36.99, -0.09 20.4, -1.97 -0.47 M0.54 54.5 C-0.46 38.04, -1.25 22.94, 0.08 0.17" stroke="#1e1e1e" stroke-width="4" fill="none"></path></g><g transform="translate(53.29595947265625 380.20001220703125) rotate(0 5.903999328613281 22.5)"><text x="5.903999328613281" y="0" font-family="Virgil, Segoe UI Emoji" font-size="36px" fill="#1e1e1e" text-anchor="middle" style="white-space: pre;" direction="ltr" dominant-baseline="text-before-edge">j</text></g><g stroke-linecap="round" transform="translate(98.79998779296875 265.99998474121094) rotate(0 43.199989318847656 27.5)"><path d="M0.69 -1.65 L85.47 0.36 L85.3 56.57 L1.52 56.61" stroke="none" stroke-width="0" fill="#b2f2bb"></path><path d="M0.8 0.21 C31.21 -1.14, 62.14 2.24, 85.84 1.48 M-0.49 -0.06 C23.88 0.14, 46.01 -0.31, 85.99 -0.42 M86.61 -0.15 C86.16 15.86, 84.2 31.57, 87.48 55.87 M86.21 -0.22 C87.07 17.97, 86.75 33.35, 87.08 54.64 M86.7 56.49 C55.12 54.19, 24.48 53.18, -1.81 56.1 M87.12 55.36 C67.18 54.32, 47.62 55.52, 0.3 55.72 M0.59 55.12 C0.1 42.52, -2.17 26.27, -0.11 0.97 M-0.19 54.22 C-1.28 35.87, -0.22 16.29, 0.62 -0.44" stroke="#1e1e1e" stroke-width="4" fill="none"></path></g><g stroke-linecap="round" transform="translate(100.79998779296875 320.8000030517578) rotate(0 43.199989318847656 27.5)"><path d="M-0.59 -1.78 C18.07 1.51, 38.53 1.39, 85.78 -0.03 M0.65 0.43 C28.38 0.04, 57.24 -0.36, 86.19 -0.46 M86.42 0.49 C84.51 13.7, 87.54 26.57, 86.6 56.12 M86.77 0.92 C86.33 15.69, 86.97 32.49, 87 55.44 M86.27 54.98 C68.74 54.61, 48.51 56.74, -1.6 54.26 M86.18 54.35 C59.95 55.85, 35.36 56.02, -0.43 55.37 M0.3 56.65 C-2.13 41.69, -0.28 30.3, 1.07 1.07 M-0.99 55.31 C0.18 41.41, 0.72 27.05, 0.34 -0.82" stroke="#1e1e1e" stroke-width="4" fill="none"></path></g><g transform="translate(126.30597686767578 325.8000030517578) rotate(0 17.694000244140625 22.5)"><text x="17.694000244140625" y="0" font-family="Virgil, Segoe UI Emoji" font-size="36px" fill="#1e1e1e" text-anchor="middle" style="white-space: pre;" direction="ltr" dominant-baseline="text-before-edge">21</text></g><g stroke-linecap="round" transform="translate(100.39996337890625 376.40000915527344) rotate(0 43.199989318847656 27.5)"><path d="M-1.47 1.6 C26.25 2.25, 52.99 0.74, 87.07 -0.98 M-0.44 -0.02 C24.94 -0.79, 50.51 -0.83, 85.74 0.1 M84.46 0.85 C87.49 16.95, 86.6 33.27, 86.37 54.61 M86.44 -0.74 C87.28 14.94, 87.21 31.04, 85.49 55.15 M86.77 53.96 C52.25 56.09, 20.12 54.25, -0.06 56.43 M85.62 55.54 C57.71 55.15, 27.99 54.8, -0.67 55.29 M-1.97 54.53 C-0.2 39.15, 0.99 22.42, -1 -0.37 M0.08 55.17 C1.16 42.35, 0.89 29.75, -0.46 0.18" stroke="#1e1e1e" stroke-width="4" fill="none"></path></g><g transform="translate(118.39994812011719 381.40000915527344) rotate(0 25.20000457763672 22.5)"><text x="25.20000457763672" y="0" font-family="Virgil, Segoe UI Emoji" font-size="36px" fill="#1e1e1e" text-anchor="middle" style="white-space: pre;" direction="ltr" dominant-baseline="text-before-edge">20</text></g><g stroke-linecap="round" transform="translate(714.8000183105469 270) rotate(0 43.199989318847656 27.5)"><path d="M1.88 -0.28 L85.33 1.57 L86.79 55.07 L-1.51 56.77" stroke="none" stroke-width="0" fill="#b2f2bb"></path><path d="M-0.71 1.03 C21.42 0.43, 40.04 -0.93, 86.46 -1.97 M0.07 -0.05 C28.19 0, 56.49 0.24, 86.38 -0.36 M87.6 -1.55 C84.56 22.4, 86.07 44.01, 85.56 53.26 M86.45 0 C87.43 17.53, 87.62 33.35, 86.79 55.09 M85.93 54.89 C67.84 55.51, 49.2 55.22, 1.26 54.21 M85.7 54.26 C59.2 53.69, 33.52 54.71, -0.27 54.19 M0.5 56.29 C-0.98 41.78, -1.46 26.6, 0.51 0.47 M0.27 54.59 C0.22 38.04, -0.79 20.59, 0.54 0.41" stroke="#1e1e1e" stroke-width="4" fill="none"></path></g><g stroke-linecap="round" transform="translate(716.8000183105469 324.8000183105469) rotate(0 43.199989318847656 27.5)"><path d="M-1.07 1.57 L86.79 0.07 L84.89 56.77 L-1.31 53.95" stroke="none" stroke-width="0" fill="#b2f2bb"></path><path d="M1.65 -0.35 C18.57 -2.16, 36.19 -2.41, 87.04 1.94 M-0.5 -0.2 C23.06 0.08, 47.87 -0.32, 87.38 0.24 M84.42 0.52 C86.27 13.14, 85.89 24.01, 86.44 56.4 M87.04 0.93 C87.26 16.41, 86.82 32.6, 85.45 55.67 M85.55 56.29 C66.47 55.95, 51.35 54.16, 0.09 53.83 M85.51 54.21 C65.46 54.6, 44.74 53.55, -0.28 54.23 M-1.4 56.71 C-2.02 44.81, 0.37 32.16, 0.18 1.75 M0.7 55.03 C-0.46 34.21, 0.4 14.69, 0.94 -0.14" stroke="#1e1e1e" stroke-width="4" fill="none"></path></g><g transform="translate(751.1080017089844 329.8000183105469) rotate(0 8.892005920410156 22.5)"><text x="8.892005920410156" y="0" font-family="Virgil, Segoe UI Emoji" font-size="36px" fill="#1e1e1e" text-anchor="middle" style="white-space: pre;" direction="ltr" dominant-baseline="text-before-edge">h</text></g><g stroke-linecap="round" transform="translate(716.3999938964844 380.4000244140625) rotate(0 43.199989318847656 27.5)"><path d="M0.5 -1.71 C30.42 -1.81, 61.37 2.09, 85.94 0.14 M-0.89 0.04 C25.5 -0.19, 52.02 0.42, 85.74 0.6 M85.94 0.27 C85.02 10.49, 85.89 25.87, 86.31 55.09 M87.24 0.15 C87.15 16.59, 85.8 33.68, 85.5 54.77 M84.63 56 C62.23 54.77, 35.63 54.39, -1.21 53.6 M86.16 55.24 C66.61 53.51, 47.07 53.55, -0.88 55.25 M-1.88 56.46 C0.89 35.42, 0.57 16.65, 1.4 0.54 M-0.31 54.57 C0.16 41.19, 0.56 26.42, -0.53 0.79" stroke="#1e1e1e" stroke-width="4" fill="none"></path></g><g transform="translate(753.6959838867188 385.4000244140625) rotate(0 5.903999328613281 22.5)"><text x="5.903999328613281" y="0" font-family="Virgil, Segoe UI Emoji" font-size="36px" fill="#1e1e1e" text-anchor="middle" style="white-space: pre;" direction="ltr" dominant-baseline="text-before-edge">j</text></g><g stroke-linecap="round" transform="translate(799.2000122070312 271.1999969482422) rotate(0 43.199989318847656 27.5)"><path d="M-1.51 1.77 L85.09 -1.05 L87.16 53.45 L-0.03 53.64" stroke="none" stroke-width="0" fill="#b2f2bb"></path><path d="M0.06 -1.97 C25.04 2.68, 48.34 0.88, 86.31 -0.99 M-0.02 -0.36 C25.16 0.21, 47.71 0.57, 85.62 -0.99 M85.56 -1.74 C86.31 19.35, 86.18 35.98, 86.4 56.29 M86.79 0.09 C85.91 22.31, 85.96 43.03, 86.34 54.58 M87.66 54.21 C55.02 54.26, 22.24 54.03, -1.48 53.23 M86.13 54.19 C67.03 54.44, 47.35 55.45, 0.65 54.3 M0.51 55.47 C0.7 35.54, 1.92 13.11, -0.83 1.4 M0.54 55.41 C1.11 38.18, -0.36 22.43, 0.2 0.04" stroke="#1e1e1e" stroke-width="4" fill="none"></path></g><g stroke-linecap="round" transform="translate(801.2000122070312 326.00001525878906) rotate(0 43.199989318847656 27.5)"><path d="M-1.31 -1.05 L87.16 -1.55 L86.37 53.64 L0.16 53.2" stroke="none" stroke-width="0" fill="#b2f2bb"></path><path d="M0.64 1.94 C18.06 0.99, 36.95 -0.14, 86 -1.78 M0.98 0.24 C25.59 0.91, 51.73 -0.68, 86.66 -0.23 M86.44 1.4 C86.08 17.33, 86.17 35.76, 88.27 56.68 M85.45 0.67 C85.72 17.08, 86.56 34.2, 87.04 54.11 M86.49 53.83 C54.96 53.26, 24.46 52.89, -1.58 54.51 M86.12 54.23 C57.57 54.55, 31.14 53.6, 0.86 54.06 M0.18 56.75 C1.27 35.01, -0.97 15.35, 0.06 -0.62 M0.94 54.86 C-0.83 41.64, -0.1 26.74, -0.75 0.89" stroke="#1e1e1e" stroke-width="4" fill="none"></path></g><g transform="translate(826.7060012817383 331.00001525878906) rotate(0 17.694000244140625 22.5)"><text x="17.694000244140625" y="0" font-family="Virgil, Segoe UI Emoji" font-size="36px" fill="#1e1e1e" text-anchor="middle" style="white-space: pre;" direction="ltr" dominant-baseline="text-before-edge">21</text></g><g stroke-linecap="round" transform="translate(800.7999877929688 381.6000213623047) rotate(0 43.199989318847656 27.5)"><path d="M-0.46 0.14 C17.33 -1.83, 34.45 -2.61, 86.48 -0.04 M-0.66 0.6 C22.02 -1.2, 45.86 -0.44, 86.53 -0.42 M86.31 0.09 C86.41 12.99, 88.28 25.09, 86.7 55.78 M85.5 -0.23 C85.82 16.55, 86.52 33.05, 86.9 55.63 M85.19 53.6 C62.4 52.72, 39.78 54.01, 0.47 54.46 M85.52 55.25 C68.1 53.64, 49.37 53.4, 0.73 55.25 M1.4 55.54 C-0.88 38.6, 0.01 18.78, -0.86 1.09 M-0.53 55.79 C-0.32 36.28, -1.27 18.38, -0.66 -0.53" stroke="#1e1e1e" stroke-width="4" fill="none"></path></g><g transform="translate(818.7999725341797 386.6000213623047) rotate(0 25.20000457763672 22.5)"><text x="25.20000457763672" y="0" font-family="Virgil, Segoe UI Emoji" font-size="36px" fill="#1e1e1e" text-anchor="middle" style="white-space: pre;" direction="ltr" dominant-baseline="text-before-edge">20</text></g><g stroke-linecap="round"><g transform="translate(196.73987078666687 147.0309352874756) rotate(0 75.32593683060259 41.31090358272195)"><path d="M-0.06 -1.61 C51 28.5, 98.81 55.72, 150.39 84.23 M0.78 -0.5 C38.82 19.26, 75.54 40.12, 150.72 82.61" stroke="#1e1e1e" stroke-width="4" fill="none"></path></g><g transform="translate(196.73987078666687 147.0309352874756) rotate(0 75.32593683060259 41.31090358272195)"><path d="M121.06 76.07 C131.73 80.81, 139.87 82.58, 150.71 84.44 M121.9 77.18 C129.21 77.87, 135.46 79.19, 151.03 82.81" stroke="#1e1e1e" stroke-width="4" fill="none"></path></g><g transform="translate(196.73987078666687 147.0309352874756) rotate(0 75.32593683060259 41.31090358272195)"><path d="M131.15 58.2 C138.67 68.81, 143.49 76.46, 150.71 84.44 M132 59.31 C136.82 64.55, 140.53 70.37, 151.03 82.81" stroke="#1e1e1e" stroke-width="4" fill="none"></path></g></g><mask></mask><g stroke-linecap="round"><g transform="translate(563.6099011898041 192.6309413909912) rotate(0 57.27762546762824 0.9196539651602507)"><path d="M0.04 1.55 C28.16 2.57, 60.7 0.73, 114.51 2 M0.32 -0.38 C39.43 0.51, 78.79 1.13, 113.47 2.22" stroke="#1e1e1e" stroke-width="4" fill="none"></path></g><g transform="translate(563.6099011898041 192.6309413909912) rotate(0 57.27762546762824 0.9196539651602507)"><path d="M85.06 13.26 C90.9 10.4, 101.13 5.44, 114.38 1.82 M85.34 11.33 C95.02 8.25, 104.85 4.74, 113.34 2.04" stroke="#1e1e1e" stroke-width="4" fill="none"></path></g><g transform="translate(563.6099011898041 192.6309413909912) rotate(0 57.27762546762824 0.9196539651602507)"><path d="M85.61 -7.25 C91.22 -4.74, 101.31 -4.32, 114.38 1.82 M85.89 -9.18 C95.19 -5.14, 104.83 -1.54, 113.34 2.04" stroke="#1e1e1e" stroke-width="4" fill="none"></path></g></g><mask></mask></svg>