<svg version="1.1" xmlns="http://www.w3.org/2000/svg" viewBox="0 0 1411.4902036235044 966.3801876505734" width="1411.4902036235044" height="966.3801876505734">
  <!-- svg-source:excalidraw -->
  
  <defs>
    <style class="style-fonts">
      @font-face {
        font-family: "Virgil";
        src: url("https://excalidraw.com/Virgil.woff2");
      }
      @font-face {
        font-family: "Cascadia";
        src: url("https://excalidraw.com/Cascadia.woff2");
      }
    </style>
    
  </defs>
  <g stroke-linecap="round" transform="translate(10 78.00003051757807) rotate(0 87.00000762939453 32.99999237060544)"><path d="M16.5 0 M16.5 0 C62.67 0.51, 113.63 1.41, 157.5 0 M16.5 0 C60.34 -0.43, 105.77 -0.12, 157.5 0 M157.5 0 C168.22 1.21, 173 6.25, 174 16.5 M157.5 0 C166.21 -2.03, 172.92 6.65, 174 16.5 M174 16.5 C175.37 29.35, 175.13 39.36, 174 49.5 M174 16.5 C173.88 27.29, 173.45 37.83, 174 49.5 M174 49.5 C174.6 59.68, 168.05 67.81, 157.5 66 M174 49.5 C174.25 61.69, 169.71 65.7, 157.5 66 M157.5 66 C108.63 63.52, 58.22 63.47, 16.5 66 M157.5 66 C121.99 64.15, 84.98 65.07, 16.5 66 M16.5 66 C3.51 64.38, 0.15 60.88, 0 49.5 M16.5 66 C4.19 65.21, 0.73 60.19, 0 49.5 M0 49.5 C0.73 40.08, 1.61 31.06, 0 16.5 M0 49.5 C-0.25 41.9, -0.23 34.21, 0 16.5 M0 16.5 C-1.69 6.64, 7.43 -1.8, 16.5 0 M0 16.5 C0.59 7.31, 5.95 -0.43, 16.5 0" stroke="#1e1e1e" stroke-width="1" fill="none"></path></g><g transform="translate(50.91999053955078 88.50002288818351) rotate(0 46.08001708984375 22.5)"><text x="46.08001708984375" y="0" font-family="Virgil, Segoe UI Emoji" font-size="36px" fill="#1e1e1e" text-anchor="middle" style="white-space: pre;" direction="ltr" dominant-baseline="text-before-edge">query</text></g><g stroke-linecap="round" transform="translate(910.0000762939452 434.0000534057616) rotate(0 108 50)"><path d="M25 0 M25 0 C67.68 -0.4, 109.46 -0.79, 191 0 M25 0 C63.21 -0.24, 99.77 0.15, 191 0 M191 0 C206.55 -1.65, 215.8 6.52, 216 25 M191 0 C208.3 1.95, 217.63 6.88, 216 25 M216 25 C215.03 35.3, 217.27 46.49, 216 75 M216 25 C217.17 41.32, 215.83 56.87, 216 75 M216 75 C217.82 91.01, 207.38 99.54, 191 100 M216 75 C217.81 93.1, 207.49 99.38, 191 100 M191 100 C131.59 99.23, 69.67 98.56, 25 100 M191 100 C130.98 98.48, 71.72 98.81, 25 100 M25 100 C7.6 100.9, 1.08 89.92, 0 75 M25 100 C7.8 98.66, 1.62 90.09, 0 75 M0 75 C-1.62 65.81, -2.16 52.7, 0 25 M0 75 C0.99 58.13, -0.17 39.49, 0 25 M0 25 C0.92 8.79, 8.95 -0.44, 25 0 M0 25 C1.82 6.14, 7.18 1.09, 25 0" stroke="#1e1e1e" stroke-width="1" fill="none"></path></g><g transform="translate(935.9200592041014 439.0000534057616) rotate(0 82.08001708984375 45)"><text x="82.08001708984375" y="0" font-family="Virgil, Segoe UI Emoji" font-size="36px" fill="#1e1e1e" text-anchor="middle" style="white-space: pre;" direction="ltr" dominant-baseline="text-before-edge">plano de </text><text x="82.08001708984375" y="45" font-family="Virgil, Segoe UI Emoji" font-size="36px" fill="#1e1e1e" text-anchor="middle" style="white-space: pre;" direction="ltr" dominant-baseline="text-before-edge">execução</text></g><g stroke-linecap="round" transform="translate(844.0000152587894 43.99997711181635) rotate(0 164 55)"><path d="M27.5 0 M27.5 0 C107.63 -1.47, 186.17 -3.2, 300.5 0 M27.5 0 C86.99 2.03, 147.91 1.73, 300.5 0 M300.5 0 C320.58 -0.51, 326 8.45, 328 27.5 M300.5 0 C318.01 2.12, 326.71 9.33, 328 27.5 M328 27.5 C326.17 42.11, 327.22 60.18, 328 82.5 M328 27.5 C328.29 47.77, 327.27 66.88, 328 82.5 M328 82.5 C327.34 102.12, 319.84 109.98, 300.5 110 M328 82.5 C327.62 101.94, 320.01 110.59, 300.5 110 M300.5 110 C216.88 108.75, 136.28 110.16, 27.5 110 M300.5 110 C220.4 108.43, 140.82 108.61, 27.5 110 M27.5 110 C8.55 111.43, 1.63 100.09, 0 82.5 M27.5 110 C9.72 112.11, 2.18 99.54, 0 82.5 M0 82.5 C1.54 63.88, 1.35 45.83, 0 27.5 M0 82.5 C-0.99 70.13, -0.69 57.41, 0 27.5 M0 27.5 C-0.24 7.73, 7.97 0.92, 27.5 0 M0 27.5 C0.37 10.08, 7.33 -0.62, 27.5 0" stroke="#1e1e1e" stroke-width="1" fill="none"></path></g><g transform="translate(853.685958862305 53.99997711181635) rotate(0 154.31405639648438 45)"><text x="154.31405639648438" y="0" font-family="Virgil, Segoe UI Emoji" font-size="36px" fill="#1e1e1e" text-anchor="middle" style="white-space: pre;" direction="ltr" dominant-baseline="text-before-edge">expressão </text><text x="154.31405639648438" y="45" font-family="Virgil, Segoe UI Emoji" font-size="36px" fill="#1e1e1e" text-anchor="middle" style="white-space: pre;" direction="ltr" dominant-baseline="text-before-edge">relacional-algebra</text></g><g stroke-linecap="round" transform="translate(11.999969482421875 440.0000762939452) rotate(0 87.00000762939453 50)"><path d="M25 0 M25 0 C59.77 2.31, 95.66 1.54, 149 0 M25 0 C69.39 -1.34, 112.89 -1.42, 149 0 M149 0 C165.9 -1.56, 173.12 8.72, 174 25 M149 0 C163.71 1.31, 172.51 7.49, 174 25 M174 25 C173.65 41.71, 172.37 56.97, 174 75 M174 25 C174.48 41.02, 174.39 58.46, 174 75 M174 75 C175.79 93.29, 164.33 101.95, 149 100 M174 75 C176.13 91.84, 165.89 100.21, 149 100 M149 100 C112.48 98.91, 72.6 102.28, 25 100 M149 100 C110.36 99.49, 69.08 100.59, 25 100 M25 100 C7.68 101.04, 0.13 91.61, 0 75 M25 100 C7.22 98.19, -1.19 93.63, 0 75 M0 75 C-1.72 63.94, 0.82 52.25, 0 25 M0 75 C-0.28 59.35, -0.12 41.71, 0 25 M0 25 C-0.03 7.25, 7.65 -1.35, 25 0 M0 25 C2.07 9.39, 6.6 0.09, 25 0" stroke="#1e1e1e" stroke-width="1" fill="none"></path></g><g transform="translate(39.36595153808594 445.0000762939452) rotate(0 59.63402557373047 45)"><text x="59.63402557373047" y="0" font-family="Virgil, Segoe UI Emoji" font-size="36px" fill="#1e1e1e" text-anchor="middle" style="white-space: pre;" direction="ltr" dominant-baseline="text-before-edge">query</text><text x="59.63402557373047" y="45" font-family="Virgil, Segoe UI Emoji" font-size="36px" fill="#1e1e1e" text-anchor="middle" style="white-space: pre;" direction="ltr" dominant-baseline="text-before-edge">output</text></g><g stroke-linecap="round" transform="translate(359.9999999999998 10) rotate(0 177.00000762939453 100)"><path d="M222.5 25.25 M222.5 25.25 C250.75 43.6, 280.87 59.66, 309.5 75.75 M222.5 25.25 C245.57 39.1, 268.45 53.17, 309.5 75.75 M309.5 75.75 C354.14 101.94, 353.12 101.04, 309.5 126.25 M309.5 75.75 C353.34 103, 352.09 99.31, 309.5 126.25 M309.5 126.25 C284.76 141.36, 260.4 153.74, 222.5 174.75 M309.5 126.25 C288.8 137.31, 269.89 148.68, 222.5 174.75 M222.5 174.75 C179.73 198.28, 178.84 199.6, 133.5 174.75 M222.5 174.75 C177.91 198.7, 177.57 201.06, 133.5 174.75 M133.5 174.75 C112.94 164.28, 89.74 149.98, 44.5 126.25 M133.5 174.75 C108.21 160.06, 80.15 145.31, 44.5 126.25 M44.5 126.25 C0.87 99.86, 1.51 100.91, 44.5 75.75 M44.5 126.25 C1.6 101.26, 0.49 99.91, 44.5 75.75 M44.5 75.75 C71.03 60.99, 100.61 44.87, 133.5 25.25 M44.5 75.75 C62.79 65.87, 81.92 54.22, 133.5 25.25 M133.5 25.25 C176.88 0.42, 176.49 0.88, 222.5 25.25 M133.5 25.25 C177.84 -0.9, 175.74 -0.88, 222.5 25.25" stroke="#1e1e1e" stroke-width="1" fill="none"></path></g><g transform="translate(458.73596572875954 65) rotate(0 78.2640380859375 45)"><text x="78.2640380859375" y="0" font-family="Virgil, Segoe UI Emoji" font-size="36px" fill="#1e1e1e" text-anchor="middle" style="white-space: pre;" direction="ltr" dominant-baseline="text-before-edge">parser e</text><text x="78.2640380859375" y="45" font-family="Virgil, Segoe UI Emoji" font-size="36px" fill="#1e1e1e" text-anchor="middle" style="white-space: pre;" direction="ltr" dominant-baseline="text-before-edge">tradutor</text></g><g stroke-linecap="round" transform="translate(805.999908447265 245.99998474121088) rotate(0 197.5 55)"><path d="M247.5 14 M247.5 14 C273.65 21.42, 295.69 29.09, 345.5 42 M247.5 14 C283.86 25.28, 321.87 36.09, 345.5 42 M345.5 42 C396.91 57.39, 395.8 55.93, 345.5 70 M345.5 42 C392.97 58.28, 393.89 55.56, 345.5 70 M345.5 70 C322.79 75.18, 301.74 80.93, 247.5 96 M345.5 70 C313.01 78.06, 280.7 87.28, 247.5 96 M247.5 96 C196.45 111.73, 196.62 109.52, 148.5 96 M247.5 96 C199.11 111.6, 200.3 111.2, 148.5 96 M148.5 96 C123.58 88.61, 98.18 83.59, 49.5 70 M148.5 96 C119.45 87.58, 90.05 80.32, 49.5 70 M49.5 70 C-0.4 55.25, -0.84 54.66, 49.5 42 M49.5 70 C-0.46 56.11, -0.9 54.57, 49.5 42 M49.5 42 C76.19 33.86, 106.46 25.75, 148.5 14 M49.5 42 C85.07 31.54, 121.01 20.64, 148.5 14 M148.5 14 C197.49 -0.77, 197.07 -1.07, 247.5 14 M148.5 14 C198.76 -1.62, 196.28 -1.35, 247.5 14" stroke="#e03131" stroke-width="1" fill="none"></path></g><g transform="translate(914.0738754272455 278.4999847412109) rotate(0 89.67603302001953 22.5)"><text x="89.67603302001953" y="0" font-family="Virgil, Segoe UI Emoji" font-size="36px" fill="#e03131" text-anchor="middle" style="white-space: pre;" direction="ltr" dominant-baseline="text-before-edge">otimizador</text></g><g stroke-linecap="round" transform="translate(350.0000762939451 349.99999999999994) rotate(0 213 145)"><path d="M267.5 36.5 M267.5 36.5 C291.67 51.08, 316.12 69.3, 372.5 109.5 M267.5 36.5 C291 53.58, 316.23 69.29, 372.5 109.5 M372.5 109.5 C427.53 147.61, 424.2 147.86, 372.5 182.5 M372.5 109.5 C426.65 144, 426.09 145.16, 372.5 182.5 M372.5 182.5 C331.55 209.14, 292.74 234.17, 267.5 253.5 M372.5 182.5 C330.73 210.74, 290.49 236.84, 267.5 253.5 M267.5 253.5 C212.19 291.37, 213.39 291.62, 160.5 253.5 M267.5 253.5 C215.51 288.72, 212.54 291.88, 160.5 253.5 M160.5 253.5 C139.76 238.38, 115.35 225.11, 53.5 182.5 M160.5 253.5 C135.37 234.22, 108.26 217.68, 53.5 182.5 M53.5 182.5 C-0.27 144.95, 0.21 145.5, 53.5 109.5 M53.5 182.5 C-0.72 147.66, 1.63 147.29, 53.5 109.5 M53.5 109.5 C90.81 86.51, 125.99 59.59, 160.5 36.5 M53.5 109.5 C92.22 82.15, 132.76 56.42, 160.5 36.5 M160.5 36.5 C214.31 1.8, 213.97 -1.38, 267.5 36.5 M160.5 36.5 C212.35 -0.77, 213.85 0.06, 267.5 36.5" stroke="#1e1e1e" stroke-width="1" fill="none"></path></g><g transform="translate(468.23004913330055 427.49999999999994) rotate(0 94.77002716064453 67.5)"><text x="94.77002716064453" y="0" font-family="Virgil, Segoe UI Emoji" font-size="36px" fill="#1e1e1e" text-anchor="middle" style="white-space: pre;" direction="ltr" dominant-baseline="text-before-edge">mecanismo </text><text x="94.77002716064453" y="45" font-family="Virgil, Segoe UI Emoji" font-size="36px" fill="#1e1e1e" text-anchor="middle" style="white-space: pre;" direction="ltr" dominant-baseline="text-before-edge">de </text><text x="94.77002716064453" y="90" font-family="Virgil, Segoe UI Emoji" font-size="36px" fill="#1e1e1e" text-anchor="middle" style="white-space: pre;" direction="ltr" dominant-baseline="text-before-edge">avaliação</text></g><g stroke-linecap="round"><g transform="translate(500.5866588154031 784.9499151952755) rotate(0 62.99591465439991 59.09946344258677)" fill-rule="evenodd"><path d="M-0.76 0.5 L0.2 115.13 L1.56 117.52 L7.63 124.31 L29.16 126.63 L41.29 129.16 L65.6 133 L84.16 132.05 L104.27 126.56 L113.71 124.72 L122.79 117.9 L126.8 115.55 L125.51 0.95 L115.58 -2.91 L91.99 -12.68 L61.28 -14.39 L23.46 -10.24 L-1.94 -1.61" stroke="none" stroke-width="0" fill="#ced4da" fill-rule="evenodd"></path><path d="M0.81 0.38 C0.72 16.95, -1.01 80.92, -0.71 100.54 C-0.4 120.17, -0.55 113.76, 2.63 118.13 C5.81 122.49, 11.97 124.43, 18.35 126.73 C24.73 129.04, 33.29 130.83, 40.91 131.93 C48.53 133.04, 56.84 133.53, 64.06 133.35 C71.28 133.18, 77.62 131.91, 84.23 130.89 C90.84 129.88, 97.07 129.34, 103.72 127.24 C110.37 125.14, 120.55 122.58, 124.12 118.3 C127.7 114.01, 124.86 118.83, 125.15 101.54 C125.45 84.25, 126.14 31.53, 125.89 14.56 C125.64 -2.4, 126.44 3.58, 123.65 -0.25 C120.86 -4.09, 114.56 -6.39, 109.15 -8.44 C103.73 -10.49, 97.87 -11.88, 91.15 -12.55 C84.43 -13.23, 75.05 -12.42, 68.84 -12.5 C62.64 -12.58, 61.74 -13.43, 53.92 -13.02 C46.11 -12.61, 31.13 -12.22, 21.97 -10.03 C12.81 -7.83, 2.63 -1.4, -1.06 0.14 M-0.22 -0.46 C0.09 16.81, 1.25 82.09, 1.63 102.01 C2.02 121.92, -0.83 115.25, 2.09 119.04 C5.01 122.84, 12.83 123.09, 19.14 124.78 C25.45 126.48, 32.22 127.87, 39.94 129.22 C47.65 130.58, 58 132.84, 65.45 132.9 C72.9 132.95, 78.44 130.58, 84.61 129.56 C90.79 128.54, 96.14 128.85, 102.51 126.76 C108.89 124.66, 118.92 121.18, 122.86 116.98 C126.81 112.77, 125.61 118.97, 126.18 101.53 C126.75 84.09, 126.39 29.35, 126.3 12.34 C126.21 -4.68, 128.42 3.06, 125.65 -0.58 C122.89 -4.22, 115.57 -7.45, 109.72 -9.5 C103.87 -11.55, 97.25 -12.39, 90.55 -12.9 C83.85 -13.4, 75.44 -12.14, 69.53 -12.52 C63.62 -12.9, 62.69 -15.18, 55.08 -15.19 C47.48 -15.19, 32.95 -15.18, 23.9 -12.55 C14.85 -9.92, 5.01 -1.36, 0.76 0.58" stroke="#495057" stroke-width="1" fill="none"></path></g></g><mask></mask><g stroke-linecap="round" transform="translate(500.1238356729275 769.6760093185057) rotate(0 62.7402272366304 17.058746489779878)"><path d="M60.78 -0.96 C71.41 -1.43, 84.34 0.09, 93.97 1.91 C103.59 3.74, 113.34 7.19, 118.55 9.98 C123.77 12.76, 126.49 15.49, 125.26 18.6 C124.03 21.71, 118.39 26.27, 111.16 28.65 C103.94 31.03, 92.45 31.95, 81.89 32.89 C71.34 33.83, 58.69 35.1, 47.83 34.3 C36.97 33.5, 24.41 30.27, 16.73 28.07 C9.05 25.86, 3.88 23.95, 1.74 21.07 C-0.4 18.2, -0.16 13.66, 3.89 10.82 C7.95 7.97, 15.37 5.63, 26.07 4 C36.77 2.36, 60.01 1.57, 68.09 1.03 C76.16 0.49, 74.75 0.76, 74.53 0.77 M38.02 0.37 C47.27 -1.31, 60.6 -1.26, 71.44 -0.53 C82.27 0.2, 94.36 2.41, 103.03 4.76 C111.7 7.1, 119.91 10.77, 123.45 13.56 C127 16.34, 127.85 18.48, 124.28 21.47 C120.72 24.47, 110.71 29.53, 102.08 31.53 C93.45 33.53, 83.27 33.07, 72.52 33.48 C61.77 33.88, 48.26 35.17, 37.6 33.97 C26.93 32.76, 14.56 29.18, 8.53 26.27 C2.5 23.36, 1.22 19.66, 1.4 16.5 C1.58 13.34, 3.5 9.67, 9.62 7.3 C15.74 4.92, 33.22 2.97, 38.12 2.24 C43.02 1.51, 38.78 2.56, 39.02 2.9" stroke="none" stroke-width="0" fill="#ffffff"></path><path d="M74.83 1.06 C85.81 1.19, 98.1 2.64, 106.37 4.53 C114.64 6.43, 121.81 9.49, 124.46 12.43 C127.11 15.37, 126.05 19.07, 122.29 22.16 C118.53 25.26, 110.68 28.95, 101.89 30.99 C93.1 33.04, 80.64 34.19, 69.56 34.43 C58.47 34.68, 45.38 33.98, 35.37 32.47 C25.36 30.96, 15.36 27.96, 9.5 25.38 C3.63 22.8, -0.03 19.98, 0.2 17 C0.42 14.02, 4.44 10.02, 10.82 7.49 C17.2 4.97, 27 2.99, 38.48 1.87 C49.97 0.75, 72.19 0.99, 79.74 0.77 C87.28 0.55, 84.06 0.46, 83.75 0.55 M65.81 0.41 C76.62 0.43, 90.55 1.29, 99.7 2.87 C108.86 4.44, 116.76 6.76, 120.74 9.85 C124.72 12.94, 125.62 18.46, 123.58 21.41 C121.54 24.35, 116.12 25.68, 108.5 27.51 C100.89 29.34, 88.86 31.36, 77.89 32.39 C66.93 33.42, 53.6 34.37, 42.72 33.69 C31.84 33.02, 19.66 30.99, 12.6 28.34 C5.55 25.69, 1.41 20.88, 0.39 17.79 C-0.64 14.71, 1.26 12.46, 6.45 9.83 C11.64 7.2, 21.33 3.47, 31.53 1.99 C41.72 0.52, 61.83 1.25, 67.62 0.98 C73.41 0.71, 66.75 0.02, 66.27 0.38" stroke="#495057" stroke-width="1" fill="none"></path></g><g transform="translate(507.0585940626262 911.3801876505734) rotate(0 56.034019470214844 22.5)"><text x="56.034019470214844" y="0" font-family="Virgil, Segoe UI Emoji" font-size="36px" fill="#000000" text-anchor="middle" style="white-space: pre;" direction="ltr" dominant-baseline="text-before-edge">Dados</text></g><g stroke-linecap="round"><g transform="translate(1202.7156179246208 582.7240673474457) rotate(0 62.76351206523236 60.00320380298902)" fill-rule="evenodd"><path d="M1.1 1.37 L0.44 117.17 L0.46 119.49 L6.77 121.12 L27.63 127.93 L40.23 129.73 L64.89 130.9 L83.46 130.48 L104.23 127.52 L113.48 122.37 L121.74 119.7 L126.53 115.13 L124.1 2.78 L118.07 -3.16 L89.11 -12.03 L60.48 -14.64 L24.09 -10.32 L-1.07 1.75" stroke="none" stroke-width="0" fill="#ffc9c9" fill-rule="evenodd"></path><path d="M0.13 0.7 C0.13 17.65, -1.17 81.92, -1.01 101.47 C-0.85 121.02, -1.83 114, 1.08 117.99 C3.99 121.98, 10.07 123.33, 16.45 125.41 C22.83 127.5, 31.56 129.55, 39.36 130.51 C47.15 131.47, 55.76 131.3, 63.21 131.16 C70.67 131.03, 77.27 130.22, 84.09 129.68 C90.9 129.14, 97.68 129.94, 104.08 127.92 C110.47 125.91, 119.1 122.17, 122.47 117.6 C125.85 113.02, 123.89 117.61, 124.31 100.47 C124.74 83.33, 125.1 31.56, 125.01 14.75 C124.92 -2.06, 126.39 3.41, 123.76 -0.39 C121.13 -4.18, 114.59 -6.03, 109.24 -8.05 C103.89 -10.06, 98.52 -11.76, 91.64 -12.48 C84.76 -13.2, 74.25 -12.24, 67.95 -12.36 C61.65 -12.48, 61.31 -13.35, 53.83 -13.21 C46.36 -13.06, 32.21 -13.82, 23.11 -11.49 C14.01 -9.16, 3.27 -1.14, -0.76 0.77 M-1.25 0.02 C-0.81 16.65, 0.4 79.96, 1.17 99.76 C1.94 119.56, 0.87 114.38, 3.38 118.83 C5.9 123.27, 9.93 124.45, 16.24 126.43 C22.55 128.41, 33.24 129.58, 41.23 130.71 C49.21 131.84, 56.96 133.11, 64.15 133.22 C71.35 133.33, 77.91 132.28, 84.4 131.37 C90.88 130.47, 96.46 129.77, 103.06 127.8 C109.66 125.83, 120.37 124.22, 124.01 119.57 C127.65 114.92, 124.74 117.73, 124.9 99.9 C125.06 82.08, 124.81 29.4, 124.97 12.62 C125.12 -4.16, 128.34 2.81, 125.82 -0.78 C123.31 -4.37, 115.62 -6.9, 109.86 -8.9 C104.11 -10.9, 98.25 -12.22, 91.3 -12.78 C84.35 -13.35, 74.23 -12.47, 68.17 -12.3 C62.11 -12.14, 62.64 -12.01, 54.94 -11.81 C47.24 -11.61, 30.93 -13.35, 21.98 -11.12 C13.02 -8.9, 4.77 -0.35, 1.21 1.54" stroke="#e03131" stroke-width="1" fill="none"></path></g></g><mask></mask><g stroke-linecap="round" transform="translate(1202.2527947821454 567.450161470676) rotate(0 62.7402272366304 17.058746489779878)"><path d="M66.98 0.25 C77.74 0.4, 90.23 2.46, 99.12 4.14 C108.01 5.82, 116.14 7.53, 120.29 10.3 C124.43 13.08, 125.94 17.67, 123.99 20.81 C122.04 23.95, 116.39 26.84, 108.58 29.13 C100.77 31.41, 88.34 33.98, 77.13 34.52 C65.92 35.05, 51.86 33.43, 41.31 32.33 C30.77 31.23, 20.65 30.31, 13.87 27.93 C7.08 25.55, 1.74 21.09, 0.61 18.06 C-0.52 15.02, 2.05 12.28, 7.1 9.72 C12.16 7.16, 20.73 4.3, 30.94 2.7 C41.16 1.1, 61.57 0.55, 68.39 0.12 C75.21 -0.31, 71.72 -0.25, 71.84 0.13 M79.18 0.18 C89.61 0.51, 102.36 3.08, 109.9 5.28 C117.44 7.48, 122.67 10.37, 124.43 13.38 C126.2 16.39, 124.83 20.46, 120.5 23.34 C116.17 26.21, 108.04 28.91, 98.45 30.66 C88.86 32.41, 74.55 33.71, 62.94 33.83 C51.34 33.95, 38.5 32.93, 28.82 31.37 C19.13 29.81, 9.4 27.02, 4.84 24.48 C0.27 21.94, -0.35 19.09, 1.42 16.12 C3.18 13.15, 8.36 9.14, 15.4 6.65 C22.45 4.16, 32.79 1.94, 43.68 1.17 C54.58 0.4, 74.95 2.24, 80.77 2.02 C86.59 1.79, 79.03 -0.26, 78.59 -0.19" stroke="none" stroke-width="0" fill="#ffc9c9"></path><path d="M82.12 0.76 C92.65 1.54, 104.23 3.84, 111.28 6.12 C118.33 8.4, 123.26 11.48, 124.41 14.42 C125.56 17.37, 123.16 20.83, 118.18 23.78 C113.19 26.73, 104.29 30.48, 94.51 32.12 C84.72 33.76, 70.82 33.84, 59.47 33.62 C48.13 33.41, 35.65 32.38, 26.42 30.84 C17.19 29.3, 8.36 27.18, 4.08 24.37 C-0.2 21.57, -1.51 17.17, 0.76 13.99 C3.02 10.82, 9.77 7.6, 17.66 5.33 C25.54 3.05, 36.81 0.86, 48.09 0.33 C59.38 -0.2, 78.76 1.86, 85.38 2.14 C92 2.42, 88.14 2.01, 87.82 2.01 M43.13 1.67 C53.08 0.8, 68.4 0.34, 79.53 0.76 C90.67 1.18, 102.39 2.17, 109.96 4.18 C117.54 6.18, 123.45 9.62, 124.98 12.81 C126.51 16, 123.69 20.23, 119.16 23.32 C114.64 26.4, 107.06 29.41, 97.84 31.31 C88.63 33.21, 75.26 34.79, 63.87 34.7 C52.48 34.61, 39.11 32.41, 29.51 30.75 C19.9 29.1, 11.08 27.53, 6.23 24.77 C1.38 22, -0.74 17.44, 0.4 14.16 C1.53 10.88, 5.71 7.14, 13.03 5.1 C20.35 3.05, 39.12 2.73, 44.31 1.9 C49.51 1.06, 43.83 -0.11, 44.2 0.08" stroke="#e03131" stroke-width="1" fill="none"></path></g><g transform="translate(1132.9530332133481 709.1543398027436) rotate(0 134.26858520507812 45.420495597196236)"><text x="134.26858520507812" y="0" font-family="Virgil, Segoe UI Emoji" font-size="36.33639647775698px" fill="#e03131" text-anchor="middle" style="white-space: pre;" direction="ltr" dominant-baseline="text-before-edge">análises sobre </text><text x="134.26858520507812" y="45.42049559719622" font-family="Virgil, Segoe UI Emoji" font-size="36.33639647775698px" fill="#e03131" text-anchor="middle" style="white-space: pre;" direction="ltr" dominant-baseline="text-before-edge">os dados</text></g><g stroke-linecap="round"><g transform="translate(190 114.000015258789) rotate(0 88.41957739058411 -3.4936634503305015)"><path d="M-0.38 0.92 C28.72 -0.58, 145.6 -6.34, 175.02 -7.91 M1.61 0.36 C31.05 -0.41, 148.25 -5.02, 177.22 -6.33" stroke="#1e1e1e" stroke-width="1" fill="none"></path></g><g transform="translate(190 114.000015258789) rotate(0 88.41957739058411 -3.4936634503305015)"><path d="M151.02 3.47 C158.78 1.62, 167.04 -0.75, 178.18 -5.92 M149 4.23 C158.62 0.75, 166.15 -1.63, 177.48 -5.37" stroke="#1e1e1e" stroke-width="1" fill="none"></path></g><g transform="translate(190 114.000015258789) rotate(0 88.41957739058411 -3.4936634503305015)"><path d="M150.17 -17.04 C158.4 -12.04, 166.95 -7.57, 178.18 -5.92 M148.15 -16.28 C157.82 -13.63, 165.61 -9.88, 177.48 -5.37" stroke="#1e1e1e" stroke-width="1" fill="none"></path></g></g><mask></mask><g stroke-linecap="round"><g transform="translate(707.9999542236326 108.00003051757807) rotate(0 65.49220269578979 -0.8780136810995742)"><path d="M0.96 0.85 C22.6 0.47, 109.47 -2.23, 130.98 -2.61 M0 0.25 C21.47 0.11, 109.01 -0.49, 130.55 -1.06" stroke="#1e1e1e" stroke-width="1" fill="none"></path></g><g transform="translate(707.9999542236326 108.00003051757807) rotate(0 65.49220269578979 -0.8780136810995742)"><path d="M103.94 11.26 C113.65 5.17, 126.69 -0.6, 129.88 0.34 M103.09 9.83 C112.58 5.12, 121.17 2.57, 130.27 -1.54" stroke="#1e1e1e" stroke-width="1" fill="none"></path></g><g transform="translate(707.9999542236326 108.00003051757807) rotate(0 65.49220269578979 -0.8780136810995742)"><path d="M103.63 -9.26 C113.4 -7.25, 126.56 -4.92, 129.88 0.34 M102.78 -10.69 C112.25 -8.8, 120.95 -4.74, 130.27 -1.54" stroke="#1e1e1e" stroke-width="1" fill="none"></path></g></g><mask></mask><g stroke-linecap="round"><g transform="translate(362.0542973959572 493.8210082041072) rotate(0 -84.40803107553792 -4.594979650052579)"><path d="M-1.08 -0.06 C-29.15 -1.47, -140.58 -7.5, -168.3 -9.13 M0.56 -1.14 C-27.71 -2.29, -141.31 -6.37, -169.38 -7.67" stroke="#1e1e1e" stroke-width="1" fill="none"></path></g><g transform="translate(362.0542973959572 493.8210082041072) rotate(0 -84.40803107553792 -4.594979650052579)"><path d="M-140.9 -17.19 C-150.04 -13.13, -160.11 -9.66, -167.97 -5.88 M-140.02 -15.88 C-151.34 -13.73, -161.14 -9.83, -169.84 -7.15" stroke="#1e1e1e" stroke-width="1" fill="none"></path></g><g transform="translate(362.0542973959572 493.8210082041072) rotate(0 -84.40803107553792 -4.594979650052579)"><path d="M-141.73 3.31 C-150.49 0.97, -160.3 -1.97, -167.97 -5.88 M-140.85 4.63 C-152.08 -0.21, -161.59 -3.29, -169.84 -7.15" stroke="#1e1e1e" stroke-width="1" fill="none"></path></g></g><mask></mask><g stroke-linecap="round"><g transform="translate(907.9999542236326 494.2017452010303) rotate(0 -64.0448080846678 -0.9316645746032179)"><path d="M1.07 0.73 C-20.42 0.29, -107.82 -2.11, -129.16 -2.59 M0.17 0.06 C-20.94 -0.23, -105.78 -1.27, -126.98 -1.44" stroke="#1e1e1e" stroke-width="1" fill="none"></path></g><g transform="translate(907.9999542236326 494.2017452010303) rotate(0 -64.0448080846678 -0.9316645746032179)"><path d="M-97.48 -13.12 C-107.88 -6.36, -115.08 -5.9, -128.59 -2.44 M-97.79 -10.76 C-109.77 -8.59, -118.97 -3.49, -127.49 -2.43" stroke="#1e1e1e" stroke-width="1" fill="none"></path></g><g transform="translate(907.9999542236326 494.2017452010303) rotate(0 -64.0448080846678 -0.9316645746032179)"><path d="M-97.69 7.4 C-108.04 8.39, -115.17 3.07, -128.59 -2.44 M-98 9.76 C-109.91 4.61, -119.03 2.38, -127.49 -2.43" stroke="#1e1e1e" stroke-width="1" fill="none"></path></g></g><mask></mask><g stroke-linecap="round"><g transform="translate(555.9280105082428 639.4105224239086) rotate(0 2.3596119099668726 60.76109970080893)"><path d="M-1.04 -0.91 C0.1 19.43, 4.52 100.84, 5.76 121.48 M0.61 1.23 C1.67 21.73, 3.79 102.51, 4.65 122.43" stroke="#1e1e1e" stroke-width="1" fill="none"></path></g></g><mask></mask><g stroke-linecap="round"><g transform="translate(1006.6497774131794 156.00002288818345) rotate(0 0.654318304141043 40.39260558068608)"><path d="M-0.43 -0.73 C-0.67 12.61, -0.62 66.66, -0.44 79.99 M1.55 1.5 C1.59 15.04, 2.09 68.4, 1.82 81.51" stroke="#1e1e1e" stroke-width="1" fill="none"></path></g><g transform="translate(1006.6497774131794 156.00002288818345) rotate(0 0.654318304141043 40.39260558068608)"><path d="M-9.56 51.88 C-4.46 64.58, -1.72 74.67, 2 82.04 M-8.73 52.7 C-3.99 63.11, -1.35 73.99, 2.79 80.77" stroke="#1e1e1e" stroke-width="1" fill="none"></path></g><g transform="translate(1006.6497774131794 156.00002288818345) rotate(0 0.654318304141043 40.39260558068608)"><path d="M10.96 51.95 C8.13 64.55, 2.94 74.61, 2 82.04 M11.79 52.77 C8.67 63.17, 3.44 74.02, 2.79 80.77" stroke="#1e1e1e" stroke-width="1" fill="none"></path></g></g><mask></mask><g stroke-linecap="round"><g transform="translate(1019.6652504845227 361.86543943640174) rotate(0 -1.127634152712858 31.476979469101074)"><path d="M0.31 0.5 C0.16 11.03, -1.3 53.08, -2.01 63.24 M-0.99 -0.28 C-1.13 9.93, -2.44 51.25, -2.56 61.69" stroke="#1e1e1e" stroke-width="1" fill="none"></path></g><g transform="translate(1019.6652504845227 361.86543943640174) rotate(0 -1.127634152712858 31.476979469101074)"><path d="M-11.34 34.54 C-8.35 37.08, -9.38 45.91, -1.75 62.02 M-11.29 34.24 C-9.22 43.02, -4.86 52.62, -2.64 62.65" stroke="#1e1e1e" stroke-width="1" fill="none"></path></g><g transform="translate(1019.6652504845227 361.86543943640174) rotate(0 -1.127634152712858 31.476979469101074)"><path d="M9.17 35.01 C7.96 37.51, 2.73 46.23, -1.75 62.02 M9.23 34.71 C4.23 43.24, 1.52 52.69, -2.64 62.65" stroke="#1e1e1e" stroke-width="1" fill="none"></path></g></g><mask></mask><g stroke-linecap="round"><g transform="translate(1266.8451133074363 554.4784215741392) rotate(0 -37.595976046562555 -124.82723937758985)"><path d="M-1.16 -1.11 C-1.26 -60.69, -0.37 -120.81, -3.08 -247.35 M-0.17 0.09 C-1.02 -67.42, -2.67 -136.62, -4.33 -247.43 M-5.07 -246.13 C-30.06 -247.36, -53.03 -249.53, -73.77 -249.75 M-3.32 -248.26 C-25.77 -246.69, -48.53 -246.83, -75.02 -249.06" stroke="#e03131" stroke-width="1" fill="none"></path></g><g transform="translate(1266.8451133074363 554.4784215741392) rotate(0 -37.595976046562555 -124.82723937758985)"><path d="M-47.65 -258.87 C-54.35 -255.1, -59.25 -252.07, -74.29 -249.17 M-46.44 -257.4 C-53.53 -254.38, -62.22 -253.51, -75.81 -249.26" stroke="#e03131" stroke-width="1" fill="none"></path></g><g transform="translate(1266.8451133074363 554.4784215741392) rotate(0 -37.595976046562555 -124.82723937758985)"><path d="M-48.95 -238.39 C-55.29 -239.66, -59.86 -241.68, -74.29 -249.17 M-47.74 -236.92 C-54.53 -239.54, -62.86 -244.3, -75.81 -249.26" stroke="#e03131" stroke-width="1" fill="none"></path></g></g><mask></mask></svg>