<svg version="1.1" xmlns="http://www.w3.org/2000/svg" viewBox="0 0 1631.507322056667 507.47706339905176" width="1631.507322056667" height="507.47706339905176">
  <!-- svg-source:excalidraw -->
  
  <defs>
    <style class="style-fonts">
      @font-face {
        font-family: "Virgil";
        src: url("https://excalidraw.com/Virgil.woff2");
      }
      @font-face {
        font-family: "Cascadia";
        src: url("https://excalidraw.com/Cascadia.woff2");
      }
    </style>
    
  </defs>
  <g stroke-linecap="round" transform="translate(10 154.06523965545546) rotate(0 43.199989318847656 27.5)"><path d="M1.26 0.81 C31.77 1.06, 63.07 -1.33, 87.47 -1.98 M0.05 -0.5 C28.11 -0.26, 57.7 0.42, 86.95 0.28 M85.45 1.91 C87.08 20.3, 85.85 43.02, 85.48 54.02 M85.45 -0.13 C87.52 20.76, 85.92 41.17, 86.12 55.99 M86.67 53.34 C56.53 55.37, 27.7 54.26, 1.03 56.65 M86.43 54.02 C62.32 55.23, 37.37 54.33, -0.05 54.5 M-0.04 54.28 C2.44 40.09, -0.83 25.41, -1.55 -1.98 M-0.42 54.13 C0.15 37.76, 0.08 19.16, 0 0.64" stroke="#1e1e1e" stroke-width="4" fill="none"></path></g><g transform="translate(40.113983154296875 159.06523965545546) rotate(0 13.086006164550781 22.5)"><text x="13.086006164550781" y="0" font-family="Virgil, Segoe UI Emoji" font-size="36px" fill="#1e1e1e" text-anchor="middle" style="white-space: pre;" direction="ltr" dominant-baseline="text-before-edge">B</text></g><g stroke-linecap="round" transform="translate(597.0360922228131 63.02461390511871) rotate(0 43.199989318847656 27.5)"><path d="M0.97 0.61 C17.75 -0.61, 36.59 -0.47, 85.93 -0.41 M-0.62 -0.47 C32.47 -1.54, 66.8 -1.07, 85.97 0.43 M86.3 0.63 C86.52 21.25, 87.87 39.46, 87.79 56.52 M87.37 -0.62 C87.08 19.76, 86.04 38.98, 86.73 55.15 M87.18 56.61 C54.65 55.18, 22.85 55.85, -0.86 54.29 M87.01 55.05 C60.66 55.29, 36.85 56.09, -0.65 55.81 M-0.58 54.42 C-0.28 36.24, -1.41 14.64, -0.5 1.37 M0.19 54.2 C-0.27 42.26, -0.29 28.81, -0.84 -0.84" stroke="#1e1e1e" stroke-width="4" fill="none"></path></g><g transform="translate(627.1500753771099 68.02461390511871) rotate(0 13.086006164550781 22.5)"><text x="13.086006164550781" y="0" font-family="Virgil, Segoe UI Emoji" font-size="36px" fill="#1e1e1e" text-anchor="middle" style="white-space: pre;" direction="ltr" dominant-baseline="text-before-edge">B</text></g><g stroke-linecap="round" transform="translate(1244.5456805424592 71.88008985552551) rotate(0 43.199989318847656 27.5)"><path d="M1.03 1.21 C28.57 0.63, 58.61 -1.25, 85.64 1.83 M-0.26 0.37 C33.94 -0.93, 67.77 -1.31, 87.24 -0.71 M86.56 1.87 C85.6 12.54, 86.84 25.7, 85.14 55.94 M87.14 -0.53 C87.29 18.18, 86.83 34.96, 86.12 54.04 M87.4 55.43 C51.2 55.35, 19.19 55.35, 1.48 55.31 M86.45 55.52 C53.49 55.25, 22.33 54.15, -0.51 54.93 M-0.36 53.56 C-1.01 41.66, 0.25 31.96, -0.21 0.99 M0.07 55.59 C-1.28 34.86, -0.17 15.11, 0.57 0.74" stroke="#1e1e1e" stroke-width="4" fill="none"></path></g><g transform="translate(1274.659663696756 76.88008985552551) rotate(0 13.086006164550781 22.5)"><text x="13.086006164550781" y="0" font-family="Virgil, Segoe UI Emoji" font-size="36px" fill="#1e1e1e" text-anchor="middle" style="white-space: pre;" direction="ltr" dominant-baseline="text-before-edge">B</text></g><g stroke-linecap="round" transform="translate(12 208.86525796600233) rotate(0 43.199989318847656 27.5)"><path d="M-0.12 1.01 C24.66 -1.73, 51.82 -2.33, 87.08 -1.3 M-0.74 -0.04 C28.05 1.06, 56.67 0.7, 87.38 -0.06 M87.11 -1.58 C85.62 13.04, 85.21 26.57, 87.8 56 M87.25 0.4 C85.12 16.18, 85.6 32.43, 86.69 54.39 M84.98 55.4 C58.96 53.57, 36.19 55.94, -0.35 55.5 M86.72 55.97 C67.65 54.22, 49.31 53.65, -0.2 54.11 M1.95 55.48 C-1.31 39.49, -1.54 19.6, 0.52 -0.46 M0.02 55.7 C0.19 37.81, 0.23 21.17, 0.93 0.84" stroke="#1e1e1e" stroke-width="4" fill="none"></path></g><g transform="translate(43.39198303222656 213.86525796600233) rotate(0 11.808006286621094 22.5)"><text x="11.808006286621094" y="0" font-family="Virgil, Segoe UI Emoji" font-size="36px" fill="#1e1e1e" text-anchor="middle" style="white-space: pre;" direction="ltr" dominant-baseline="text-before-edge">A</text></g><g stroke-linecap="round" transform="translate(599.0360922228131 117.82463221566559) rotate(0 43.199989318847656 27.5)"><path d="M-0.04 1.1 C30.23 -0.47, 59.84 1.65, 86.33 1.77 M-0.78 0.73 C20.24 0.05, 41.52 1.05, 85.49 -0.82 M88.05 1.97 C86.84 17.61, 88.09 33.5, 88.19 55.78 M86.71 -0.86 C86.14 22.15, 86.21 44.35, 87.36 55.33 M86.29 55.59 C57.68 54.27, 27.11 54.96, -0.56 56.75 M85.94 55.74 C55.55 53.84, 24.84 55.15, -0.87 54.3 M1.37 53.11 C0.05 39.58, 1.53 24.03, 0.3 0.49 M0.62 54.79 C0.97 36.63, -0.4 19.77, -0.66 -0.88" stroke="#1e1e1e" stroke-width="4" fill="none"></path></g><g transform="translate(630.4280752550396 122.82463221566559) rotate(0 11.808006286621094 22.5)"><text x="11.808006286621094" y="0" font-family="Virgil, Segoe UI Emoji" font-size="36px" fill="#1e1e1e" text-anchor="middle" style="white-space: pre;" direction="ltr" dominant-baseline="text-before-edge">A</text></g><g stroke-linecap="round" transform="translate(1246.5456805424592 126.68010816607239) rotate(0 43.199989318847656 27.5)"><path d="M-1.04 -0.11 C17.86 -2.52, 36.16 1.31, 88.15 1.38 M0.47 -0.33 C32.75 -1.03, 64.72 -1.03, 85.67 -0.48 M85.86 0.07 C87.15 17.52, 85.18 34.47, 86.78 56.74 M86.81 0.62 C86.76 19.98, 86.52 39.31, 87.33 55.74 M85.15 55.16 C59.24 55.34, 32.2 55.5, 1.42 55.98 M85.55 55.57 C63.8 54.93, 40.57 55.38, -0.78 55.05 M-0.98 53.89 C0.38 36.41, -0.11 15.99, 1.15 1.34 M-0.91 54.51 C0.16 37.78, 0.53 22.45, 0.6 0.11" stroke="#1e1e1e" stroke-width="4" fill="none"></path></g><g transform="translate(1277.9376635746858 131.6801081660724) rotate(0 11.808006286621094 22.5)"><text x="11.808006286621094" y="0" font-family="Virgil, Segoe UI Emoji" font-size="36px" fill="#1e1e1e" text-anchor="middle" style="white-space: pre;" direction="ltr" dominant-baseline="text-before-edge">A</text></g><g stroke-linecap="round" transform="translate(11.5999755859375 264.46526406951796) rotate(0 43.199989318847656 27.5)"><path d="M1.01 -0.72 C29.99 1.13, 60.77 0.73, 85.1 0.5 M-0.04 -0.01 C26.98 1.19, 52.97 1.62, 86.34 -0.5 M84.82 -0.51 C86.19 12.95, 85.95 29.15, 87.4 54.72 M86.8 -0.75 C86.8 11.01, 87.32 22.86, 85.79 54.97 M86.8 53.18 C58.61 55.41, 33.9 54.03, 0.5 53.29 M87.37 54.77 C60.3 55.23, 33.56 55.08, -0.89 55.04 M0.48 53.68 C1.4 37.07, -1.78 22.77, -0.46 0.27 M0.7 54.96 C0.52 40.81, 1.12 27.56, 0.84 0.15" stroke="#1e1e1e" stroke-width="4" fill="none"></path></g><g transform="translate(42.66796112060547 269.46526406951796) rotate(0 12.132003784179688 22.5)"><text x="12.132003784179688" y="0" font-family="Virgil, Segoe UI Emoji" font-size="36px" fill="#1e1e1e" text-anchor="middle" style="white-space: pre;" direction="ltr" dominant-baseline="text-before-edge">E</text></g><g stroke-linecap="round" transform="translate(598.6360678087506 173.4246383191812) rotate(0 43.199989318847656 27.5)"><path d="M-0.47 -0.41 C27.4 -0.11, 53.28 -1.29, 85.47 -1.13 M-0.43 0.43 C19.75 -0.64, 37.56 0.21, 86.71 0.31 M87.79 1.52 C88.01 22.84, 87.72 44.03, 85.16 55.38 M86.73 0.15 C86.64 19.15, 86.26 36.77, 87.21 55.16 M85.54 54.29 C60.76 54.68, 37.22 56.46, 0.11 53.81 M85.75 55.81 C65.13 54.42, 41.84 55, -0.29 54.62 M-0.5 56.37 C-0.62 35.03, 1.01 14.82, -1.59 -0.37 M-0.84 54.16 C-0.06 34.45, -0.77 16.17, 0.34 -0.65" stroke="#1e1e1e" stroke-width="4" fill="none"></path></g><g transform="translate(629.7040533434185 178.4246383191812) rotate(0 12.132003784179688 22.5)"><text x="12.132003784179688" y="0" font-family="Virgil, Segoe UI Emoji" font-size="36px" fill="#1e1e1e" text-anchor="middle" style="white-space: pre;" direction="ltr" dominant-baseline="text-before-edge">E</text></g><g stroke-linecap="round" transform="translate(1246.1456561283967 182.280114269588) rotate(0 43.199989318847656 27.5)"><path d="M-0.61 -2 C30.38 1.88, 64.03 1.43, 87.79 -0.52 M0.82 -0.71 C29.97 -0.43, 57.52 -0.19, 86.45 0.08 M87.11 0.75 C84.99 22.58, 86.64 45.02, 87.72 56.48 M86.35 -0.16 C86.34 12.64, 87.56 27.93, 86.62 55.5 M87.08 55.15 C60.09 55.38, 32.23 56.05, -0.75 55.09 M86.46 54.48 C55.45 55.43, 24.74 55.55, 0.64 54.82 M0.28 56.41 C0.06 43.43, 1.42 31.24, 0.05 0.15 M0.2 54.42 C1.07 36.01, 1.1 15.66, 0.47 0.87" stroke="#1e1e1e" stroke-width="4" fill="none"></path></g><g transform="translate(1277.2136416630647 187.280114269588) rotate(0 12.132003784179688 22.5)"><text x="12.132003784179688" y="0" font-family="Virgil, Segoe UI Emoji" font-size="36px" fill="#1e1e1e" text-anchor="middle" style="white-space: pre;" direction="ltr" dominant-baseline="text-before-edge">E</text></g><g stroke-linecap="round" transform="translate(224.00003051757812 152.8652274484242) rotate(0 43.199989318847656 27.5)"><path d="M-0.72 -1.38 C30.5 -2.41, 59.53 -1.74, 86.9 0.1 M-0.01 0.63 C22.18 0.31, 44.25 -0.03, 85.9 -0.48 M85.89 -0.74 C85.67 20.77, 88 44.51, 86.12 53.1 M85.65 0.46 C86.59 16.79, 87.16 31, 86.37 55.13 M84.58 54.29 C68.67 56.83, 48.54 55.68, -1.71 55.06 M86.17 55.07 C68.93 55.34, 51.35 54.95, 0.04 54.98 M-1.32 56.2 C-2.09 38.51, -0.01 25.51, 0.27 -0.84 M-0.04 55.05 C-0.01 43.94, 0.92 32.43, 0.15 0.39" stroke="#1e1e1e" stroke-width="4" fill="none"></path></g><g transform="translate(255.3920135498047 157.8652274484242) rotate(0 11.808006286621094 22.5)"><text x="11.808006286621094" y="0" font-family="Virgil, Segoe UI Emoji" font-size="36px" fill="#1e1e1e" text-anchor="middle" style="white-space: pre;" direction="ltr" dominant-baseline="text-before-edge">A</text></g><g stroke-linecap="round" transform="translate(879.7086135750355 62.969125747680664) rotate(0 43.199989318847656 27.5)"><path d="M-0.07 1.77 C22.66 -1.64, 46.69 -2.27, 87.86 -0.61 M-0.91 -0.82 C22.13 -0.17, 44.68 0.34, 87.38 0.13 M88.19 0.78 C88.75 19.09, 87.2 41.28, 84.69 55.15 M87.36 0.33 C86.87 19.1, 86.64 36.53, 86.7 55.28 M85.84 56.75 C65.43 55.03, 40.83 54, 1.48 55.67 M85.53 54.3 C65.77 55.28, 45.33 56.26, -0.94 54.95 M0.3 55.49 C0 38.29, -0.74 25.99, -0.41 1.06 M-0.66 54.12 C1.41 43.45, -0.18 30.56, -0.16 -0.92" stroke="#1e1e1e" stroke-width="4" fill="none"></path></g><g transform="translate(911.1005966072621 67.96912574768066) rotate(0 11.808006286621094 22.5)"><text x="11.808006286621094" y="0" font-family="Virgil, Segoe UI Emoji" font-size="36px" fill="#1e1e1e" text-anchor="middle" style="white-space: pre;" direction="ltr" dominant-baseline="text-before-edge">A</text></g><g stroke-linecap="round" transform="translate(1527.218201894682 71.82460169808746) rotate(0 43.199989318847656 27.5)"><path d="M-0.76 1.83 C27.18 2.24, 52.25 0.34, 87.14 0.93 M0.84 -0.71 C22.35 0.13, 46.21 0.69, 87.33 -0.27 M85.14 0.94 C86.98 18.43, 87.92 34.86, 85.34 55.82 M86.12 -0.96 C87.3 20.66, 86.6 40.33, 86.62 54.37 M87.88 55.31 C61.23 56.05, 32.46 55.16, 1.05 53.31 M85.89 54.93 C54.75 54.6, 25.3 54.37, -0.72 54.51 M-0.21 55.99 C1.07 42.89, -0.02 28.25, 1.17 -1.83 M0.57 55.74 C0.49 41.29, 0.36 28.23, 0.72 -0.54" stroke="#1e1e1e" stroke-width="4" fill="none"></path></g><g transform="translate(1558.6101849269085 76.82460169808746) rotate(0 11.808006286621094 22.5)"><text x="11.808006286621094" y="0" font-family="Virgil, Segoe UI Emoji" font-size="36px" fill="#1e1e1e" text-anchor="middle" style="white-space: pre;" direction="ltr" dominant-baseline="text-before-edge">A</text></g><g stroke-linecap="round" transform="translate(226.00003051757812 207.66524575897108) rotate(0 43.199989318847656 27.5)"><path d="M1.07 -1.98 C30.95 -0.7, 61.04 0.7, 85.41 -1.48 M0.55 0.28 C26.54 -0.61, 50.63 -1.02, 87.35 0.36 M85.48 -0.98 C87.66 13.15, 85.98 22.39, 86.15 56.69 M86.12 0.99 C86.28 18.12, 85.95 37.59, 85.57 54.29 M87.43 56.65 C58.4 55.2, 29.39 54.75, -1.97 55.64 M86.35 54.5 C51.9 54.17, 17.85 55.04, -0.36 55.98 M-1.55 53.02 C0.89 36.71, 0.63 18.5, -1.74 0.04 M0 55.64 C0.96 35.48, 0.17 14.67, 0.09 -0.95" stroke="#1e1e1e" stroke-width="4" fill="none"></path></g><g transform="translate(256.114013671875 212.66524575897108) rotate(0 13.086006164550781 22.5)"><text x="13.086006164550781" y="0" font-family="Virgil, Segoe UI Emoji" font-size="36px" fill="#1e1e1e" text-anchor="middle" style="white-space: pre;" direction="ltr" dominant-baseline="text-before-edge">B</text></g><g stroke-linecap="round" transform="translate(881.7086135750355 117.76914405822754) rotate(0 43.199989318847656 27.5)"><path d="M-0.93 -1.13 C24.08 2, 50.66 -0.33, 87.26 1.13 M0.31 0.31 C18.92 1.03, 36.31 0.74, 87.16 0.54 M85.16 0.38 C87.23 19.72, 86.77 43.52, 86.69 56.42 M87.21 0.16 C86.53 22.09, 86.86 43.16, 86.05 54.91 M86.51 53.81 C61.98 57.01, 40.08 54.24, 1.62 56.32 M86.11 54.62 C68.66 53.81, 49.49 54.5, 0.69 54.43 M-1.59 54.63 C1.1 37.26, 0.93 18.67, -1.68 -0.34 M0.34 54.35 C-0.17 41.96, -0.43 29.3, 0.2 0.47" stroke="#1e1e1e" stroke-width="4" fill="none"></path></g><g transform="translate(911.8225967293324 122.76914405822754) rotate(0 13.086006164550781 22.5)"><text x="13.086006164550781" y="0" font-family="Virgil, Segoe UI Emoji" font-size="36px" fill="#1e1e1e" text-anchor="middle" style="white-space: pre;" direction="ltr" dominant-baseline="text-before-edge">B</text></g><g stroke-linecap="round" transform="translate(1529.218201894682 126.62462000863434) rotate(0 43.199989318847656 27.5)"><path d="M1.75 1.38 C18.67 -1.31, 35.3 0.14, 85.74 1.63 M-0.73 -0.48 C19.85 0.69, 40.54 0.35, 86.43 0.35 M86.78 1.74 C87.37 20.05, 85 37.96, 87.64 54.9 M87.33 0.74 C86.47 16.13, 86.46 30.64, 86.48 55.34 M87.82 55.98 C59.06 55.23, 34.28 53.44, 1.15 55.12 M85.62 55.05 C65.63 54.76, 42.87 54.45, -0.56 55.14 M1.15 56.34 C0.11 34.78, 1.23 12.44, -0.97 0.4 M0.6 55.11 C0.15 42.54, 0.41 27.79, 0.83 -0.14" stroke="#1e1e1e" stroke-width="4" fill="none"></path></g><g transform="translate(1559.3321850489788 131.62462000863434) rotate(0 13.086006164550781 22.5)"><text x="13.086006164550781" y="0" font-family="Virgil, Segoe UI Emoji" font-size="36px" fill="#1e1e1e" text-anchor="middle" style="white-space: pre;" direction="ltr" dominant-baseline="text-before-edge">B</text></g><g stroke-linecap="round" transform="translate(225.60000610351562 263.2652518624867) rotate(0 43.199989318847656 27.5)"><path d="M-1.98 0.68 C21.52 0.03, 45.74 -1.45, 84.92 -0.08 M0.28 0.98 C25.75 -0.97, 51.15 0.48, 86.76 -0.79 M85.42 1.4 C87.2 14.8, 84.3 29.93, 88.09 55.81 M87.39 0.29 C86.05 12.32, 86.79 23.87, 85.69 55.2 M88.05 54.65 C68.84 53.73, 50.32 53.48, 0.64 56.94 M85.9 54.8 C61.57 55, 38.49 54.6, 0.98 55.24 M-1.98 55.52 C-0.79 42.39, -1.17 27.5, 0.04 1.4 M0.64 55.93 C0.81 38.89, 0.37 22.57, -0.95 0.67" stroke="#1e1e1e" stroke-width="4" fill="none"></path></g><g transform="translate(256.6679916381836 268.2652518624867) rotate(0 12.132003784179688 22.5)"><text x="12.132003784179688" y="0" font-family="Virgil, Segoe UI Emoji" font-size="36px" fill="#1e1e1e" text-anchor="middle" style="white-space: pre;" direction="ltr" dominant-baseline="text-before-edge">E</text></g><g stroke-linecap="round" transform="translate(881.308589160973 173.36915016174316) rotate(0 43.199989318847656 27.5)"><path d="M1.46 -0.61 C21.02 1.54, 44.91 -1.14, 84.77 -0.1 M0.98 0.13 C29.33 0.05, 57.8 0.18, 86.79 0.97 M84.69 0.15 C87.16 13.39, 87.93 28.12, 87.06 55.78 M86.7 0.28 C86.06 20.58, 86.4 41.59, 87.27 55.61 M87.88 55.67 C58.72 56.22, 34.95 52.87, -1.4 54.42 M85.46 54.95 C62.74 56.28, 39.02 55.74, 0.24 55.19 M-0.41 56.06 C-1.58 41.21, -0.24 29.45, -1.76 1.9 M-0.16 54.08 C0.42 36.84, 0.82 17.82, 0.74 0.78" stroke="#1e1e1e" stroke-width="4" fill="none"></path></g><g transform="translate(912.376574695641 178.36915016174316) rotate(0 12.132003784179688 22.5)"><text x="12.132003784179688" y="0" font-family="Virgil, Segoe UI Emoji" font-size="36px" fill="#1e1e1e" text-anchor="middle" style="white-space: pre;" direction="ltr" dominant-baseline="text-before-edge">E</text></g><g stroke-linecap="round" transform="translate(1528.8181774806194 182.22462611214996) rotate(0 43.199989318847656 27.5)"><path d="M1.39 -0.52 C34.58 0.34, 67.01 1.04, 84.98 1.68 M0.05 0.08 C20.73 0.14, 39.62 0.76, 86.78 -0.63 M87.72 1.48 C85.45 19.9, 87.75 38.06, 86.09 54.44 M86.62 0.5 C87.13 10.61, 86.99 22.81, 86.48 55.74 M85.65 55.09 C60.18 53.73, 33.01 55.54, -1.05 53.98 M87.04 54.82 C60.35 54.56, 35.19 55.19, 0.7 54.89 M0.05 55.15 C0.86 33.96, -1.29 16.98, -1.15 1.14 M0.47 55.87 C0.39 33.89, 0.5 13.73, -0.26 0.06" stroke="#1e1e1e" stroke-width="4" fill="none"></path></g><g transform="translate(1559.8861630152874 187.22462611214996) rotate(0 12.132003784179688 22.5)"><text x="12.132003784179688" y="0" font-family="Virgil, Segoe UI Emoji" font-size="36px" fill="#1e1e1e" text-anchor="middle" style="white-space: pre;" direction="ltr" dominant-baseline="text-before-edge">E</text></g><g stroke-linecap="round" transform="translate(13.600006103515625 319.2652518624867) rotate(0 43.199989318847656 27.5)"><path d="M0.1 -0.99 C27.37 -0.3, 57.68 1.05, 87.49 0.55 M-0.48 0.95 C34.73 -0.36, 68.49 0.06, 85.94 -0.49 M84.5 -0.25 C88.37 21.16, 85.17 41.63, 85.84 56.97 M86.53 -0.83 C85.35 18.31, 85.16 35.86, 86.91 55.83 M86.46 53.03 C62.64 56.2, 37.15 54.4, -0.09 54.01 M86.38 54.64 C63.19 55.27, 37.37 55.63, -0.78 54.01 M-0.84 53.26 C0.16 38.46, 0.04 19.21, 0 1.29 M0.39 55.09 C-1.41 34.04, -1.36 11.5, -0.06 -0.42" stroke="#1e1e1e" stroke-width="4" fill="none"></path></g><g transform="translate(46.467994689941406 324.2652518624867) rotate(0 10.332000732421875 22.5)"><text x="10.332000732421875" y="0" font-family="Virgil, Segoe UI Emoji" font-size="36px" fill="#1e1e1e" text-anchor="middle" style="white-space: pre;" direction="ltr" dominant-baseline="text-before-edge">F</text></g><g stroke-linecap="round" transform="translate(602.9252337471028 323.22156303458246) rotate(0 43.199989318847656 27.5)"><path d="M0.86 1.13 C30.41 -1.26, 64.33 1, 87.02 1.65 M0.76 0.54 C35.32 -0.21, 69.81 -1.22, 86.59 0.31 M86.69 1.42 C88.37 12.45, 87.22 25.21, 86.72 54.89 M86.05 -0.09 C86.27 19.01, 87.17 36.32, 85.81 54.54 M88.02 56.32 C52.35 53.04, 21.2 53.86, -0.76 56.37 M87.09 54.43 C68.79 55.03, 51.07 53.99, -0.18 55.62 M-1.68 54.66 C-1.61 37.88, 1.61 24.96, -1.29 -1.32 M0.2 55.47 C0.05 40.12, 1.29 24, 0.93 0.45" stroke="#1e1e1e" stroke-width="4" fill="none"></path></g><g transform="translate(635.7932223335285 328.22156303458246) rotate(0 10.332000732421875 22.5)"><text x="10.332000732421875" y="0" font-family="Virgil, Segoe UI Emoji" font-size="36px" fill="#1e1e1e" text-anchor="middle" style="white-space: pre;" direction="ltr" dominant-baseline="text-before-edge">F</text></g><g stroke-linecap="round" transform="translate(1250.434822066749 332.07703898498926) rotate(0 43.199989318847656 27.5)"><path d="M0.74 0.93 C31.22 1.86, 62.34 1.91, 84.98 -1.46 M0.93 -0.27 C21.84 0.28, 43.98 -0.7, 86.87 0.19 M85.34 0.82 C88.01 21.18, 86.45 42, 84.48 56.86 M86.62 -0.63 C86.6 20.9, 86.6 41.87, 86.56 55.71 M87.45 53.31 C57.4 55.16, 25.06 54.02, -0.14 53.45 M85.68 54.51 C59.47 54.98, 34.35 54.74, 0.49 55.57 M1.17 53.17 C-0.99 35.21, -1.17 15.77, 1.48 1.2 M0.72 54.46 C0.58 37.74, -0.51 20.81, 0.45 0.44" stroke="#1e1e1e" stroke-width="4" fill="none"></path></g><g transform="translate(1283.3028106531747 337.07703898498926) rotate(0 10.332000732421875 22.5)"><text x="10.332000732421875" y="0" font-family="Virgil, Segoe UI Emoji" font-size="36px" fill="#1e1e1e" text-anchor="middle" style="white-space: pre;" direction="ltr" dominant-baseline="text-before-edge">F</text></g><g stroke-linecap="round" transform="translate(15.600006103515625 374.0652701730336) rotate(0 43.199989318847656 27.5)"><path d="M-0.99 -1.48 C20.22 -0.07, 41.87 1.05, 86.95 1.96 M0.95 0.36 C24.59 0.16, 50.39 -0.05, 85.91 0.7 M86.15 1.69 C87.13 17.75, 87.25 37.97, 88.37 55.58 M85.57 -0.71 C86.58 12.24, 86.02 26.81, 87.23 54.82 M84.43 55.64 C60.24 54.57, 30.35 54.93, -0.99 54.6 M86.04 55.98 C68.39 54.32, 50.5 54.21, -0.99 55.26 M-1.74 55.04 C1.33 39.69, 0.02 24.55, 1.29 1.87 M0.09 54.05 C0.59 32.99, -0.31 12.72, -0.42 0.64" stroke="#1e1e1e" stroke-width="4" fill="none"></path></g><g transform="translate(44.759986877441406 379.0652701730336) rotate(0 14.040008544921875 22.5)"><text x="14.040008544921875" y="0" font-family="Virgil, Segoe UI Emoji" font-size="36px" fill="#1e1e1e" text-anchor="middle" style="white-space: pre;" direction="ltr" dominant-baseline="text-before-edge">D</text></g><g stroke-linecap="round" transform="translate(604.9252337471028 378.02158134512933) rotate(0 43.199989318847656 27.5)"><path d="M-1.63 -0.1 C30.28 1.4, 60.95 2.75, 86.67 1.39 M0.39 0.97 C31.88 -0.58, 65.3 -1.63, 86.48 0.33 M87.06 0.78 C88.4 17.63, 86.69 35.21, 86.97 54.14 M87.27 0.61 C86.4 13.96, 85.89 29.84, 86.73 54.35 M85 54.42 C52.91 53.5, 21.96 52.36, -0.11 54.5 M86.64 55.19 C53.75 54.95, 23.31 54.92, 0.53 54.16 M-1.76 56.9 C0.77 41.82, -1.22 30.91, -1.83 0.12 M0.74 55.78 C-0.01 38.33, 0.2 20.71, -0.62 0.14" stroke="#1e1e1e" stroke-width="4" fill="none"></path></g><g transform="translate(634.0852145210285 383.02158134512933) rotate(0 14.040008544921875 22.5)"><text x="14.040008544921875" y="0" font-family="Virgil, Segoe UI Emoji" font-size="36px" fill="#1e1e1e" text-anchor="middle" style="white-space: pre;" direction="ltr" dominant-baseline="text-before-edge">D</text></g><g stroke-linecap="round" transform="translate(1252.434822066749 386.87705729553613) rotate(0 43.199989318847656 27.5)"><path d="M-0.66 1.63 C22.25 1.28, 45.92 -1.87, 85.45 0.1 M0.03 0.35 C27 -0.4, 53.72 0.42, 87.27 0.66 M87.64 -0.1 C85.8 20, 84.19 42.99, 87.88 55.44 M86.48 0.34 C86.6 19.98, 86.68 39.18, 86.89 54.62 M87.55 55.12 C59.03 53.25, 33.61 52.72, 0.11 56.27 M85.84 55.14 C62.74 54.47, 38.16 55.15, 0.67 55.03 M-0.97 55.4 C-1.47 39.24, 1.16 22.39, 0.23 0.93 M0.83 54.86 C-0.65 33.75, 0.05 12.83, 0.54 0.27" stroke="#1e1e1e" stroke-width="4" fill="none"></path></g><g transform="translate(1281.5948028406747 391.87705729553613) rotate(0 14.040008544921875 22.5)"><text x="14.040008544921875" y="0" font-family="Virgil, Segoe UI Emoji" font-size="36px" fill="#1e1e1e" text-anchor="middle" style="white-space: pre;" direction="ltr" dominant-baseline="text-before-edge">D</text></g><g stroke-linecap="round" transform="translate(15.199981689453125 429.6652762765492) rotate(0 43.199989318847656 27.5)"><path d="M-1.48 -0.08 C28.04 1.69, 57.22 0.98, 88.36 -0.12 M0.36 -0.79 C21.38 -1.19, 42.81 -1.31, 87.1 0.5 M88.09 0.81 C84.37 16.65, 85.32 33.41, 86.98 53.78 M85.69 0.2 C85.56 15.95, 86.99 33.44, 86.22 55.25 M87.04 56.94 C67.42 54.29, 49.27 53.16, -0.4 53.22 M87.38 55.24 C59.49 55.29, 33.12 53.7, 0.26 54.77 M0.04 56.4 C0.14 37.85, 0.23 21.81, 1.87 1.68 M-0.95 55.67 C-1.11 37.45, -0.27 19.95, 0.64 -0.89" stroke="#1e1e1e" stroke-width="4" fill="none"></path></g><g transform="translate(44.197967529296875 434.6652762765492) rotate(0 14.202003479003906 22.5)"><text x="14.202003479003906" y="0" font-family="Virgil, Segoe UI Emoji" font-size="36px" fill="#1e1e1e" text-anchor="middle" style="white-space: pre;" direction="ltr" dominant-baseline="text-before-edge">G</text></g><g stroke-linecap="round" transform="translate(604.5252093330403 433.62158744864496) rotate(0 43.199989318847656 27.5)"><path d="M0.62 1.65 C20.83 0, 39.11 1.25, 87.47 1.79 M0.19 0.31 C28.43 0.61, 58.9 0.68, 87.11 0.96 M86.72 -0.11 C87.21 18.87, 85.75 35.91, 86.22 54.44 M85.81 -0.46 C87.47 21.63, 86.09 43.41, 87.06 54.13 M85.64 56.37 C64.65 54.64, 46.18 56.12, -1.14 55.3 M86.22 55.62 C58.17 54.84, 29.52 53.47, -0.17 54.34 M-1.29 53.68 C-0.84 41.52, -0.4 32.09, 0.93 -0.91 M0.93 55.45 C0.47 33.8, -0.29 13.87, -0.91 0.84" stroke="#1e1e1e" stroke-width="4" fill="none"></path></g><g transform="translate(633.523195172884 438.6215874486451) rotate(0 14.202003479003906 22.5)"><text x="14.202003479003906" y="0" font-family="Virgil, Segoe UI Emoji" font-size="36px" fill="#1e1e1e" text-anchor="middle" style="white-space: pre;" direction="ltr" dominant-baseline="text-before-edge">G</text></g><g stroke-linecap="round" transform="translate(1252.0347976526864 442.47706339905176) rotate(0 43.199989318847656 27.5)"><path d="M-1.42 1.68 C28.53 -2.17, 58.94 -0.61, 86.56 1.87 M0.38 -0.63 C24.08 -0.11, 48.09 0.36, 87.14 -0.53 M86.09 -0.56 C84.83 20.62, 88.22 37.97, 87.4 55.43 M86.48 0.74 C86.6 13.76, 86.93 25.73, 86.45 55.52 M85.35 53.98 C67.65 53.5, 49.27 56.32, -0.36 53.56 M87.1 54.89 C65.2 55.69, 43.68 55.15, 0.07 55.59 M-1.15 56.14 C1.75 44.73, 0.49 33, 1.75 1.45 M-0.26 55.06 C-0.01 41.9, 0.09 28.2, 0.8 0.12" stroke="#1e1e1e" stroke-width="4" fill="none"></path></g><g transform="translate(1281.0327834925301 447.4770633990519) rotate(0 14.202003479003906 22.5)"><text x="14.202003479003906" y="0" font-family="Virgil, Segoe UI Emoji" font-size="36px" fill="#1e1e1e" text-anchor="middle" style="white-space: pre;" direction="ltr" dominant-baseline="text-before-edge">G</text></g><g stroke-linecap="round" transform="translate(227.60003662109375 318.06523965545546) rotate(0 43.199989318847656 27.5)"><path d="M-0.08 -0.02 C27.61 1.73, 53.24 2.6, 86.28 -0.99 M-0.79 -0.26 C21.43 -0.77, 43.1 0.39, 86.9 -0.14 M87.21 -1.51 C87.26 10.73, 88.31 23.16, 85.18 54.93 M86.6 -0.91 C85.59 17.75, 86.77 34.3, 86.65 54.14 M88.34 54.54 C60.37 55.18, 33.06 54.87, -1.78 55.08 M86.64 54.34 C61.27 55.07, 33.96 56.11, -0.23 55.13 M1.4 54.91 C0.57 40.81, 1.77 28.49, 1.68 0.3 M0.67 54.1 C-0.28 36.29, -0.47 18.33, -0.89 0.5" stroke="#1e1e1e" stroke-width="4" fill="none"></path></g><g transform="translate(257.7140197753906 323.06523965545546) rotate(0 13.086006164550781 22.5)"><text x="13.086006164550781" y="0" font-family="Virgil, Segoe UI Emoji" font-size="36px" fill="#1e1e1e" text-anchor="middle" style="white-space: pre;" direction="ltr" dominant-baseline="text-before-edge">B</text></g><g stroke-linecap="round" transform="translate(885.5977550993252 323.1660748771444) rotate(0 43.199989318847656 27.5)"><path d="M0.27 1.39 C30.12 0.22, 58.99 -0.07, 88.33 -1.24 M0.08 0.33 C27.72 1.45, 56.1 1.07, 86.79 0.81 M86.97 -0.86 C85.66 17.2, 85.81 36.5, 87.62 55.11 M86.73 -0.65 C86.95 13.89, 85.28 25.75, 86.11 54.71 M86.29 54.5 C65.12 53.04, 41.39 54.67, 0.37 53.41 M86.93 54.16 C61.22 54.65, 37.07 53.94, 0.95 55.34 M-1.83 55.12 C0.76 42.99, -0.54 30.59, 1.57 0.49 M-0.62 55.14 C-0.22 32.5, 0.59 11.63, 0.1 0.59" stroke="#1e1e1e" stroke-width="4" fill="none"></path></g><g transform="translate(915.7117382536221 328.1660748771444) rotate(0 13.086006164550781 22.5)"><text x="13.086006164550781" y="0" font-family="Virgil, Segoe UI Emoji" font-size="36px" fill="#1e1e1e" text-anchor="middle" style="white-space: pre;" direction="ltr" dominant-baseline="text-before-edge">B</text></g><g stroke-linecap="round" transform="translate(1533.1073434189716 332.0215508275512) rotate(0 43.199989318847656 27.5)"><path d="M-1.42 -1.46 C32.02 -0.63, 66.11 1.14, 85.86 0.07 M0.47 0.19 C29.84 1.21, 58.67 0.02, 86.81 0.62 M84.48 1.86 C87.79 16.68, 87.31 32.9, 85.15 55.16 M86.56 0.71 C86.93 18, 86.49 37.28, 85.55 55.57 M86.26 53.45 C60.07 55.83, 33.16 53.12, -0.98 53.89 M86.89 55.57 C59.94 54.94, 32.22 55.5, -0.91 54.51 M1.48 56.2 C0.54 38.35, 2.06 21.27, -1.08 1.67 M0.45 55.44 C0.68 39.52, 0.95 23.61, -0.27 0.26" stroke="#1e1e1e" stroke-width="4" fill="none"></path></g><g transform="translate(1563.2213265732685 337.0215508275512) rotate(0 13.086006164550781 22.5)"><text x="13.086006164550781" y="0" font-family="Virgil, Segoe UI Emoji" font-size="36px" fill="#1e1e1e" text-anchor="middle" style="white-space: pre;" direction="ltr" dominant-baseline="text-before-edge">B</text></g><g stroke-linecap="round" transform="translate(229.60003662109375 372.86525796600233) rotate(0 43.199989318847656 27.5)"><path d="M-0.02 1.26 C22.73 0.59, 45.23 -0.09, 85.41 -0.95 M-0.26 -0.37 C33.71 0.2, 69.04 1.19, 86.26 -0.95 M84.89 0.93 C86.31 17.78, 87.45 30.39, 86.33 55.27 M85.49 -0.36 C86.52 12.77, 85.83 24.13, 85.54 55.03 M85.94 55.14 C68.88 54.84, 51.15 54.06, 0.08 54.96 M85.74 55.6 C62.83 54.22, 41.07 54.98, 0.13 54.58 M-0.09 55.09 C-0.01 44.58, 1.86 33.26, 0.3 0.78 M-0.9 54.77 C0.47 37.61, 1.17 20.18, 0.5 0.63" stroke="#1e1e1e" stroke-width="4" fill="none"></path></g><g transform="translate(261.20802307128906 377.86525796600233) rotate(0 11.592002868652344 22.5)"><text x="11.592002868652344" y="0" font-family="Virgil, Segoe UI Emoji" font-size="36px" fill="#1e1e1e" text-anchor="middle" style="white-space: pre;" direction="ltr" dominant-baseline="text-before-edge">C</text></g><g stroke-linecap="round" transform="translate(887.5977550993252 377.9660931876913) rotate(0 43.199989318847656 27.5)"><path d="M1.07 1.79 C27.87 1.28, 52.93 -0.28, 87.01 -1.71 M0.71 0.96 C26.91 0.26, 53.97 0.03, 86.35 0.3 M86.22 -0.56 C87.91 19.28, 86.27 34.93, 85.48 56.48 M87.06 -0.87 C85.34 18.04, 85.75 36.28, 87.09 54.06 M85.26 55.3 C61.43 55.97, 33.89 55.23, 1.23 54.59 M86.23 54.34 C55.02 55.23, 25.75 53.63, -0.66 54.84 M0.93 54.09 C1.45 45.11, 0.46 33.93, 0.9 1.81 M-0.91 55.84 C-0.25 42.02, 0.51 29.24, 0.34 -0.93" stroke="#1e1e1e" stroke-width="4" fill="none"></path></g><g transform="translate(919.2057415495206 382.9660931876913) rotate(0 11.592002868652344 22.5)"><text x="11.592002868652344" y="0" font-family="Virgil, Segoe UI Emoji" font-size="36px" fill="#1e1e1e" text-anchor="middle" style="white-space: pre;" direction="ltr" dominant-baseline="text-before-edge">C</text></g><g stroke-linecap="round" transform="translate(1535.1073434189716 386.8215691380981) rotate(0 43.199989318847656 27.5)"><path d="M-0.95 0.1 C33.36 2.5, 65.86 0.7, 87.11 0.75 M0.87 0.66 C21.2 -0.69, 41.34 0.46, 86.35 -0.16 M87.88 0.44 C86.87 15.38, 84.62 30.05, 87.08 55.15 M86.89 -0.38 C86.53 21.11, 85.64 41.74, 86.46 54.48 M86.51 56.27 C64.52 52.89, 42.37 53.22, 0.28 56.41 M87.07 55.03 C61.47 56.08, 35.47 55.01, 0.2 54.42 M0.23 55.93 C1.34 36.81, -1.48 17.39, -0.27 -0.51 M0.54 55.27 C0.56 38.3, -0.51 21.62, 0.12 -0.82" stroke="#1e1e1e" stroke-width="4" fill="none"></path></g><g transform="translate(1566.715329869167 391.8215691380981) rotate(0 11.592002868652344 22.5)"><text x="11.592002868652344" y="0" font-family="Virgil, Segoe UI Emoji" font-size="36px" fill="#1e1e1e" text-anchor="middle" style="white-space: pre;" direction="ltr" dominant-baseline="text-before-edge">C</text></g><g stroke-linecap="round" transform="translate(229.20001220703125 428.46526406951796) rotate(0 43.199989318847656 27.5)"><path d="M1.26 1.09 C20.06 1.97, 38.9 -0.98, 85.45 1.91 M-0.37 -0.46 C28.5 0.92, 58.49 0.08, 85.45 -0.13 M87.33 -0.56 C88.6 21.74, 85.4 42.24, 86.67 53.34 M86.04 0.51 C87.34 12.41, 86.76 24.31, 86.43 54.02 M86.54 54.91 C56.72 54.4, 27.25 54.88, -0.04 54.28 M87 54.22 C51.06 54.69, 17.46 54.57, -0.42 54.13 M0.09 55 C0.9 40.27, 1.29 22.09, 0.78 0.17 M-0.23 54.94 C-0.79 44.37, -1.26 32.95, 0.63 -0.39" stroke="#1e1e1e" stroke-width="4" fill="none"></path></g><g transform="translate(260.5919952392578 433.46526406951796) rotate(0 11.808006286621094 22.5)"><text x="11.808006286621094" y="0" font-family="Virgil, Segoe UI Emoji" font-size="36px" fill="#1e1e1e" text-anchor="middle" style="white-space: pre;" direction="ltr" dominant-baseline="text-before-edge">A</text></g><g stroke-linecap="round" transform="translate(887.1977306852627 433.5660992912069) rotate(0 43.199989318847656 27.5)"><path d="M1.93 -1.24 C30.93 0.28, 59.4 -0.18, 87.05 0.29 M0.39 0.81 C32.23 -0.34, 64.44 0, 85.97 -0.35 M87.62 0.11 C85.06 15.08, 87.73 32.68, 85.11 56.62 M86.11 -0.29 C85.55 20.82, 84.98 40.2, 86.15 55.69 M86.77 53.41 C65.05 56.44, 44.02 56.27, -1.68 53.32 M87.35 55.34 C61.31 53.58, 37.36 53.32, 0.06 55.2 M1.57 55.49 C2.1 36.84, 2.06 15.62, 0.28 0.06 M0.1 55.59 C-0.06 43.84, -1.4 31.34, 0.6 -0.24" stroke="#1e1e1e" stroke-width="4" fill="none"></path></g><g transform="translate(918.5897137174893 438.5660992912069) rotate(0 11.808006286621094 22.5)"><text x="11.808006286621094" y="0" font-family="Virgil, Segoe UI Emoji" font-size="36px" fill="#1e1e1e" text-anchor="middle" style="white-space: pre;" direction="ltr" dominant-baseline="text-before-edge">A</text></g><g stroke-linecap="round" transform="translate(1534.707319004909 442.4215752416137) rotate(0 43.199989318847656 27.5)"><path d="M0.16 1.87 C19.06 0.03, 39.89 0.71, 85.14 0.94 M0.74 -0.53 C27.99 0.05, 55.12 -0.73, 86.12 -0.96 M87.4 0.43 C85.55 21.77, 87.49 43.38, 87.88 55.31 M86.45 0.52 C85.82 20.98, 86.73 40.3, 85.89 54.93 M86.04 53.56 C66.22 54.44, 48.27 56.96, -0.21 55.99 M86.47 55.59 C54.61 54.54, 24.84 54.45, 0.57 55.74 M1.75 56.45 C-1.14 36.88, -0.33 14.91, 0.12 0.89 M0.8 55.12 C-0.57 36.33, -0.18 16.33, -0.37 -0.05" stroke="#1e1e1e" stroke-width="4" fill="none"></path></g><g transform="translate(1566.0993020371357 447.4215752416137) rotate(0 11.808006286621094 22.5)"><text x="11.808006286621094" y="0" font-family="Virgil, Segoe UI Emoji" font-size="36px" fill="#1e1e1e" text-anchor="middle" style="white-space: pre;" direction="ltr" dominant-baseline="text-before-edge">A</text></g><g transform="translate(37.9027783870697 109.09609864898573) rotate(0 12.204002380371094 22.5)"><text x="0" y="0" font-family="Virgil, Segoe UI Emoji" font-size="36px" fill="#1e1e1e" text-anchor="start" style="white-space: pre;" direction="ltr" dominant-baseline="text-before-edge">R</text></g><g transform="translate(624.9388706098828 18.055472898648986) rotate(0 12.204002380371094 22.5)"><text x="0" y="0" font-family="Virgil, Segoe UI Emoji" font-size="36px" fill="#1e1e1e" text-anchor="start" style="white-space: pre;" direction="ltr" dominant-baseline="text-before-edge">R</text></g><g transform="translate(1272.448458929529 26.910948849055785) rotate(0 12.204002380371094 22.5)"><text x="0" y="0" font-family="Virgil, Segoe UI Emoji" font-size="36px" fill="#1e1e1e" text-anchor="start" style="white-space: pre;" direction="ltr" dominant-baseline="text-before-edge">R</text></g><g transform="translate(247.10276007652283 99.89610170074354) rotate(0 10.944007873535156 22.5)"><text x="0" y="0" font-family="Virgil, Segoe UI Emoji" font-size="36px" fill="#1e1e1e" text-anchor="start" style="white-space: pre;" direction="ltr" dominant-baseline="text-before-edge">S</text></g><g transform="translate(902.8113431339802 10) rotate(0 10.944007873535156 22.5)"><text x="0" y="0" font-family="Virgil, Segoe UI Emoji" font-size="36px" fill="#1e1e1e" text-anchor="start" style="white-space: pre;" direction="ltr" dominant-baseline="text-before-edge">S</text></g><g transform="translate(1550.3209314536266 18.8554759504068) rotate(0 10.944007873535156 22.5)"><text x="0" y="0" font-family="Virgil, Segoe UI Emoji" font-size="36px" fill="#1e1e1e" text-anchor="start" style="white-space: pre;" direction="ltr" dominant-baseline="text-before-edge">S</text></g><g stroke-linecap="round"><g transform="translate(383.47228066600746 292.70588090428066) rotate(0 83.22611337898411 -0.16478342033087756)"><path d="M1.09 1.66 C41.53 -2.21, 82.04 -0.75, 165.79 -1.99 M0.66 -0.09 C35.44 -0.79, 71.32 -1.57, 164.94 -0.68" stroke="#1e1e1e" stroke-width="4" fill="none"></path></g><g transform="translate(383.47228066600746 292.70588090428066) rotate(0 83.22611337898411 -0.16478342033087756)"><path d="M137.78 11.08 C144.18 5.85, 150.64 5.07, 165.92 -1.52 M137.35 9.33 C142.39 7.14, 148.54 4.41, 165.06 -0.21" stroke="#1e1e1e" stroke-width="4" fill="none"></path></g><g transform="translate(383.47228066600746 292.70588090428066) rotate(0 83.22611337898411 -0.16478342033087756)"><path d="M137.89 -9.44 C144.27 -9.55, 150.7 -5.22, 165.92 -1.52 M137.47 -11.19 C142.51 -8.92, 148.64 -7.17, 165.06 -0.21" stroke="#1e1e1e" stroke-width="4" fill="none"></path></g></g><mask></mask><g stroke-linecap="round"><g transform="translate(1030.9818689856538 301.56135685468746) rotate(0 83.04360482281186 -0.2741236793660278)"><path d="M0.71 0.75 C63.59 0.43, 130.09 0.78, 166.14 0.33 M-0.05 -0.16 C40.45 -2.26, 82.41 -0.85, 165.04 -0.65" stroke="#1e1e1e" stroke-width="4" fill="none"></path></g><g transform="translate(1030.9818689856538 301.56135685468746) rotate(0 83.04360482281186 -0.2741236793660278)"><path d="M137.49 10.2 C146.66 6.4, 159.43 3.23, 166.36 0.83 M136.74 9.29 C143.44 5.82, 151.64 5.02, 165.26 -0.15" stroke="#1e1e1e" stroke-width="4" fill="none"></path></g><g transform="translate(1030.9818689856538 301.56135685468746) rotate(0 83.04360482281186 -0.2741236793660278)"><path d="M137.61 -10.32 C146.68 -6.04, 159.4 -1.14, 166.36 0.83 M136.86 -11.23 C143.62 -9.63, 151.79 -5.36, 165.26 -0.15" stroke="#1e1e1e" stroke-width="4" fill="none"></path></g></g><mask></mask><g stroke-linecap="round"><g transform="translate(1371.4447498066943 139.33732240632105) rotate(0 56.51188005647805 -0.19692787598717132)"><path d="M1.15 1.21 C42.38 1.46, 86.77 2.12, 113.28 -1.81 M-0.81 0.69 C31.82 -1.01, 63.69 -0.69, 113.84 0.89" stroke="#1e1e1e" stroke-width="4" fill="none"></path></g><g transform="translate(1371.4447498066943 139.33732240632105) rotate(0 56.51188005647805 -0.19692787598717132)"><path d="M86.54 11.63 C94.83 7.59, 106.26 4.6, 112.66 -0.92 M84.57 11.1 C93.17 7.47, 101.08 5.13, 113.22 1.78" stroke="#1e1e1e" stroke-width="4" fill="none"></path></g><g transform="translate(1371.4447498066943 139.33732240632105) rotate(0 56.51188005647805 -0.19692787598717132)"><path d="M87.07 -8.89 C95.09 -5.07, 106.31 -0.19, 112.66 -0.92 M85.11 -9.41 C93.73 -7.32, 101.49 -3.95, 113.22 1.78" stroke="#1e1e1e" stroke-width="4" fill="none"></path></g></g><mask></mask><g stroke-linecap="round"><g transform="translate(1374.8784092770616 415.1718316248884) rotate(0 62.75869442286262 0.4896495025756451)"><path d="M1.08 1.83 C45.71 -1.42, 90.9 0.12, 125.05 -0.26 M-0.39 -0.84 C29.13 -0.88, 58.51 -0.75, 125.91 -0.4" stroke="#1e1e1e" stroke-width="4" fill="none"></path></g><g transform="translate(1374.8784092770616 415.1718316248884) rotate(0 62.75869442286262 0.4896495025756451)"><path d="M98.75 11.55 C108.04 4.72, 117.85 3.02, 125.06 0.48 M97.28 8.88 C104.49 6.58, 111.55 4.67, 125.92 0.34" stroke="#1e1e1e" stroke-width="4" fill="none"></path></g><g transform="translate(1374.8784092770616 415.1718316248884) rotate(0 62.75869442286262 0.4896495025756451)"><path d="M98.85 -8.97 C108.02 -8.36, 117.79 -2.64, 125.06 0.48 M97.38 -11.64 C104.58 -9.25, 111.62 -6.48, 125.92 0.34" stroke="#1e1e1e" stroke-width="4" fill="none"></path></g></g><mask></mask><g stroke-linecap="round"><g transform="translate(1365.7220422371406 384.2692020171398) rotate(0 63.12049736907966 -97.88726284196994)"><path d="M0.2 -0.87 C42.96 -67.58, 87.27 -132.81, 126.72 -196.15 M-0.48 0.37 C30.18 -48.93, 60.6 -97.18, 125.36 -195.68" stroke="#1e1e1e" stroke-width="4" fill="none"></path></g><g transform="translate(1365.7220422371406 384.2692020171398) rotate(0 63.12049736907966 -97.88726284196994)"><path d="M118.77 -167.49 C120.04 -176.93, 124.37 -185.64, 126.33 -196.19 M117.96 -166.03 C120.7 -173.91, 121.72 -181.21, 124.72 -195.64" stroke="#1e1e1e" stroke-width="4" fill="none"></path></g><g transform="translate(1365.7220422371406 384.2692020171398) rotate(0 63.12049736907966 -97.88726284196994)"><path d="M101.59 -178.71 C108.59 -184.5, 118.74 -189.41, 126.33 -196.19 M100.78 -177.25 C107.84 -182.47, 113.09 -187.01, 124.72 -195.64" stroke="#1e1e1e" stroke-width="4" fill="none"></path></g></g><mask></mask><g stroke-linecap="round"><g transform="translate(1368.0112649795024 181.68536715317714) rotate(0 62.35720636820156 99.66265497047911)"><path d="M0.65 -1.42 C45.5 72.93, 89.06 145.32, 123.4 200.74 M-0.57 -0.47 C40.98 64.51, 81.87 130.92, 125.28 198.56" stroke="#1e1e1e" stroke-width="4" fill="none"></path></g><g transform="translate(1368.0112649795024 181.68536715317714) rotate(0 62.35720636820156 99.66265497047911)"><path d="M102.28 178.59 C111.57 187.16, 118.13 193.88, 123.67 200.45 M100.83 179.71 C108.52 185.32, 116.33 192.68, 125.9 197.86" stroke="#1e1e1e" stroke-width="4" fill="none"></path></g><g transform="translate(1368.0112649795024 181.68536715317714) rotate(0 62.35720636820156 99.66265497047911)"><path d="M119.6 167.58 C122.52 180.06, 122.8 190.78, 123.67 200.45 M118.15 168.71 C120.22 177.91, 122.36 188.88, 125.9 197.86" stroke="#1e1e1e" stroke-width="4" fill="none"></path></g></g><mask></mask></svg>