{
  "project_info": {
    "project_number": "421329545361",
    "firebase_url": "https://iiot-a2c1c-default-rtdb.europe-west1.firebasedatabase.app",
    "project_id": "iiot-a2c1c",
    "storage_bucket": "iiot-a2c1c.appspot.com"
  },
  "client": [
    {
      "client_info": {
        "mobilesdk_app_id": "1:421329545361:android:9a6e82027e018fda0db730",
        "android_client_info": {
          "package_name": "iutinfo.lp.devmob.recoltiotdata"
        }
      },
      "oauth_client": [
        {
          "client_id": "421329545361-sch6d369459n13gv3afsgouq3b2inq75.apps.googleusercontent.com",
          "client_type": 3
        }
      ],
      "api_key": [
        {
          "current_key": "AIzaSyB_Qe0FkGgC8CdCN7zz4SvelU2dJ82kHZk"
        }
      ],
      "services": {
        "appinvite_service": {
          "other_platform_oauth_client": [
            {
              "client_id": "421329545361-sch6d369459n13gv3afsgouq3b2inq75.apps.googleusercontent.com",
              "client_type": 3
            }
          ]
        }
      }
    }
  ],
  "configuration_version": "1"
}