<svg width="297" height="32" viewBox="0 0 297 32" fill="none" xmlns="http://www.w3.org/2000/svg">
<path fill-rule="evenodd" clip-rule="evenodd" d="M96.6706 17.3146V31.1254H89.9781V18.1482C89.963 17.6215 89.8441 17.103 89.6282 16.6222C89.4123 16.1414 89.1035 15.7077 88.7197 15.346C88.3358 14.9842 87.8843 14.7015 87.3909 14.5139C86.8975 14.3262 86.3719 14.2374 85.8441 14.2525C85.3163 14.2676 84.7967 14.3863 84.3149 14.6017C83.8331 14.8172 83.3985 15.1253 83.036 15.5083C82.6735 15.8914 82.3901 16.342 82.2021 16.8343C82.0141 17.3266 81.9251 17.8511 81.9402 18.3778V25.7598V31.1504H75.2427V0H81.9352V11.1804C82.8305 9.25378 85.2564 7.95605 88.2675 7.95605H88.9328C93.8846 8.25553 96.6706 11.7394 96.6706 17.3146ZM268.795 29.1501C267.451 27.3497 266.526 25.2728 266.089 23.0707L266.079 23.0657C265.411 24.1559 264.405 24.9986 263.214 25.4655C262.022 25.9324 260.71 25.9978 259.478 25.6519C258.245 25.306 257.16 24.5677 256.387 23.5494C255.614 22.5311 255.195 21.2886 255.195 20.0111C255.195 18.7336 255.614 17.4911 256.387 16.4728C257.16 15.4545 258.245 14.7162 259.478 14.3703C260.71 14.0244 262.022 14.0898 263.214 14.5567C264.405 15.0236 265.411 15.8663 266.079 16.9565C266.519 14.7549 267.447 12.6795 268.795 10.8821C267.05 9.41216 264.921 8.47045 262.657 8.16789C260.394 7.86534 258.092 8.21456 256.021 9.1744C253.95 10.1342 252.197 11.6647 250.968 13.5855C249.74 15.5064 249.087 17.7375 249.087 20.0161C249.087 22.2947 249.74 24.5258 250.968 26.4466C252.197 28.3675 253.95 29.8979 256.021 30.8578C258.092 31.8176 260.394 32.1668 262.657 31.8643C264.921 31.5617 267.05 30.62 268.795 29.1501ZM297 8.07471V8.18565C296.999 9.74315 296.689 11.285 296.088 12.7225C295.487 14.1599 294.607 15.4645 293.499 16.561C293.401 16.6472 293.303 16.739 293.203 16.8323C293.037 16.9873 292.867 17.1463 292.689 17.2897C292.902 18.1875 293.01 19.1071 293.009 20.0299C293.009 23.2003 291.747 26.2409 289.5 28.4827C287.253 30.7245 284.206 31.9839 281.029 31.9839C277.852 31.9839 274.805 30.7245 272.559 28.4827C270.312 26.2409 269.05 23.2003 269.05 20.0299V19.9301C269.083 16.7747 270.362 13.7598 272.61 11.5402C274.857 9.3206 277.892 8.07567 281.054 8.07584H296.885L296.904 8.07519C296.914 8.07497 296.923 8.07488 296.932 8.07484L296.95 8.07483L296.958 8.07484L296.971 8.07486L297 8.07471ZM284.34 24.8914C284.495 24.7866 284.646 24.6718 284.791 24.552C285.452 24.0004 285.983 23.3101 286.346 22.5301C286.709 21.7502 286.896 20.8999 286.891 20.0399C286.894 19.995 286.894 19.95 286.891 19.9051C286.873 19.0627 286.673 18.2341 286.305 17.476C285.936 16.7179 285.408 16.0482 284.756 15.5128C284.611 15.393 284.461 15.2782 284.305 15.1734L284.065 15.0237C283.779 14.8518 283.48 14.7033 283.17 14.5794L283.005 14.5195C282.88 14.4746 282.755 14.4347 282.625 14.3998C282.563 14.3762 282.5 14.3579 282.435 14.3449C282.399 14.3366 282.362 14.3267 282.326 14.3169C282.23 14.2911 282.134 14.265 282.04 14.265C281.974 14.2501 281.907 14.2401 281.84 14.235C281.707 14.2127 281.574 14.1977 281.439 14.1901H281.234H280.819H280.614C280.48 14.1974 280.346 14.2124 280.214 14.235C280.147 14.2398 280.08 14.2498 280.014 14.265C279.884 14.285 279.754 14.3099 279.634 14.3399L279.444 14.3898C279.32 14.423 279.195 14.463 279.069 14.5096L278.903 14.5695C278.593 14.6923 278.294 14.8409 278.008 15.0137L277.768 15.1634C277.613 15.2682 277.458 15.383 277.313 15.5028C276.645 16.0536 276.107 16.7447 275.738 17.5269C275.369 18.309 275.178 19.1629 275.178 20.0274C275.178 20.8919 275.369 21.7458 275.738 22.5279C276.107 23.3101 276.645 24.0012 277.313 24.552C277.458 24.6718 277.613 24.7866 277.768 24.8914L278.008 25.0461L278.173 25.1409C278.288 25.2058 278.403 25.2657 278.523 25.3206C279.313 25.6984 280.178 25.8944 281.054 25.8944C281.93 25.8944 282.795 25.6984 283.585 25.3206C283.703 25.2667 283.818 25.2068 283.93 25.1409L284.1 25.0461L284.34 24.8914ZM105.964 10.07C107.933 8.75699 110.248 8.05619 112.617 8.05619C115.793 8.05619 118.838 9.31511 121.084 11.556C123.33 13.7969 124.591 16.8362 124.591 20.0052C124.591 22.3685 123.889 24.6788 122.573 26.6438C121.257 28.6088 119.387 30.1403 117.199 31.0447C115.011 31.9491 112.603 32.1858 110.281 31.7247C107.958 31.2636 105.824 30.1256 104.149 28.4545C102.475 26.7834 101.334 24.6543 100.872 22.3364C100.41 20.0185 100.647 17.6159 101.554 15.4325C102.46 13.2491 103.995 11.3829 105.964 10.07ZM109.35 24.884C110.317 25.5278 111.454 25.871 112.617 25.87C114.175 25.8686 115.668 25.2502 116.769 24.1505C117.87 23.0508 118.489 21.5598 118.489 20.0052C118.489 18.8451 118.144 17.711 117.498 16.7465C116.852 15.7819 115.934 15.0302 114.86 14.5865C113.785 14.1427 112.603 14.0269 111.463 14.2536C110.323 14.4803 109.276 15.0393 108.454 15.86C107.632 16.6807 107.073 17.7262 106.847 18.8642C106.621 20.0021 106.738 21.1815 107.183 22.253C107.629 23.3246 108.383 24.2402 109.35 24.884ZM0 0.0605469H6.7075V31.3906H0V0.0605469ZM135.36 8.73079H128.563V22.2521C128.563 28.9004 133.695 32 139.502 32C145.309 32 150.441 28.9004 150.441 22.2521V8.73079H143.643V21.6681C143.643 24.7228 141.753 25.8458 139.502 25.8458C137.251 25.8458 135.36 24.7228 135.36 21.6681V8.73079ZM153.727 20.0051C153.727 12.7728 158.949 8.14588 166.016 8.14588C173.084 8.14588 177.676 13.2669 177.676 19.6258C177.676 19.6258 177.676 20.7488 177.586 21.782H160.434C160.569 24.4772 162.935 26.2292 166.467 26.2292C167.492 26.2637 168.513 26.086 169.466 25.7071C170.419 25.3283 171.283 24.7566 172.004 24.028L175.92 27.7565C174.679 29.0974 173.166 30.1594 171.481 30.8719C169.797 31.5845 167.98 31.9313 166.152 31.8893C158.769 31.8893 153.727 27.2624 153.727 20.1648V20.0051ZM170.923 17.4446C170.923 15.3782 168.717 13.6712 166.016 13.6712C163.09 13.6712 160.704 15.3333 160.514 17.4446H170.923ZM179.491 14.7946H182.492V31.3905H189.02V14.7946H194.017H194.022H198.428V31.3905H204.931V14.7946H209.933V8.73024H204.931V0.060441H198.428V8.73024H194.022H194.017H189.02V0.060441H182.492V8.73024H179.491V14.7946ZM223.278 8.14588C216.21 8.14588 210.988 12.7728 210.988 20.0051L211.008 20.1648C211.008 27.2624 216.05 31.8893 223.433 31.8893C225.262 31.9313 227.079 31.5845 228.763 30.8719C230.447 30.1594 231.96 29.0974 233.201 27.7565L229.285 24.028C228.564 24.7566 227.7 25.3283 226.747 25.7071C225.795 26.086 224.773 26.2637 223.748 26.2292C220.217 26.2292 217.851 24.4772 217.716 21.782H234.847C234.937 20.7488 234.937 19.6258 234.937 19.6258C234.937 13.2669 230.345 8.14588 223.278 8.14588ZM223.278 13.6712C225.979 13.6712 228.185 15.3782 228.185 17.4446H217.776C217.966 15.3333 220.352 13.6712 223.278 13.6712ZM67.2699 22.9695C66.6176 24.0791 65.6175 24.9438 64.4239 25.4299C63.2303 25.9161 61.9095 25.9967 60.6654 25.6595C59.4213 25.3223 58.323 24.5858 57.5399 23.5639C56.7569 22.5419 56.3326 21.2912 56.3326 20.0047C56.3326 18.7182 56.7569 17.4675 57.5399 16.4455C58.323 15.4236 59.4213 14.6871 60.6654 14.3499C61.9095 14.0127 63.2303 14.0933 64.4239 14.5795C65.6175 15.0656 66.6176 15.9302 67.2699 17.0399L71.6615 12.6676C70.129 10.703 68.0199 9.2651 65.6287 8.55479C63.2375 7.84449 60.6836 7.89723 58.3239 8.70565C55.9642 9.51407 53.9165 11.0378 52.4668 13.064C51.0171 15.0901 50.2379 17.5176 50.2379 20.0072C50.2379 22.4968 51.0171 24.9242 52.4668 26.9504C53.9165 28.9766 55.9642 30.5003 58.3239 31.3087C60.6836 32.1172 63.2375 32.1699 65.6287 31.4596C68.0199 30.7493 70.129 29.3114 71.6615 27.3468L67.2699 22.9695ZM28.2203 10.6711C26.4297 9.36842 24.9341 8.32525 21.4678 8.32525C15.0354 8.32525 10.2186 13.5112 10.2186 20.0697C10.2186 26.6282 15.0354 31.7941 21.4678 31.7941C24.9341 31.7941 26.7198 30.8508 28.2203 29.4482V31.3898H34.9278V8.72954H28.2203V10.6711ZM28.6255 20.0497C28.6255 23.2141 25.9695 25.7098 22.6833 25.7098C21.1789 25.7098 19.7362 25.1134 18.6725 24.052C17.6087 22.9905 17.0112 21.5508 17.0112 20.0497C17.0112 18.5485 17.6087 17.1089 18.6725 16.0474C19.7362 14.9859 21.1789 14.3896 22.6833 14.3896C25.9695 14.3896 28.6255 16.8852 28.6255 20.0497Z" fill="#452EFF"/>
</svg>
