Ensembl	GeneSymbol	EntrezID
ENSG00000100813	ACIN1	22985
ENSG00000164252	AGGF1	55109
ENSG00000183684	ALYREF	10189
ENSG00000021776	AQR	9716
ENSG00000134884	ARGLU1	55082
ENSG00000112208	BAG2	9532
ENSG00000116752	BCAS2	10286
ENSG00000154473	BUB3	9184
ENSG00000137656	BUD13	84811
ENSG00000106245	BUD31	8896
ENSG00000136819	C9orf78	51759
ENSG00000105298	CACTIN	58509
ENSG00000060339	CCAR1	55749
ENSG00000158941	CCAR2	57805
ENSG00000160799	CCDC12	151903
ENSG00000104957	CCDC130	81576
ENSG00000169217	CD2BP2	10421
ENSG00000168438	CDC40	51362
ENSG00000096401	CDC5L	988
ENSG00000185324	CDK10	8558
ENSG00000008128	CDK11A	728642
ENSG00000149187	CELF1	10658
ENSG00000070761	CFAP20	29105
ENSG00000085872	CHERP	10523
ENSG00000099622	CIRBP	1153
ENSG00000074201	CLNS1A	1207
ENSG00000101343	CRNKL1	51340
ENSG00000132792	CTNNBL1	56259
ENSG00000150316	CWC15	51503
ENSG00000163510	CWC22	57703
ENSG00000153015	CWC27	10283
ENSG00000018610	CXorf56	63932
ENSG00000100201	DDX17	10521
ENSG00000174243	DDX23	9416
ENSG00000198563	DDX39B	7919
ENSG00000215301	DDX3X	1654
ENSG00000183258	DDX41	51428
ENSG00000198231	DDX42	11325
ENSG00000145833	DDX46	9879
ENSG00000108654	DDX5	1655
ENSG00000109606	DHX15	1665
ENSG00000204560	DHX16	8449
ENSG00000101452	DHX35	60625
ENSG00000140829	DHX38	9785
ENSG00000163214	DHX57	90957
ENSG00000067596	DHX8	1659
ENSG00000135829	DHX9	1660
ENSG00000116675	DNAJC6	9829
ENSG00000126698	DNAJC8	22826
ENSG00000108883	EFTUD2	9343
ENSG00000141543	EIF4A3	9775
ENSG00000066044	ELAVL1	1994
ENSG00000100056	ESS2	8220
ENSG00000105058	FAM32A	26017
ENSG00000071859	FAM50A	9130
ENSG00000145945	FAM50B	26240
ENSG00000148690	FRA10AC1	118924
ENSG00000109536	FRG1	2483
ENSG00000089280	FUS	2521
ENSG00000076650	GPATCH1	55094
ENSG00000068394	GPKOW	27238
ENSG00000177733	HNRNPA0	10949
ENSG00000135486	HNRNPA1	3178
ENSG00000122566	HNRNPA2B1	3181
ENSG00000170144	HNRNPA3	220988
ENSG00000197451	HNRNPAB	3182
ENSG00000092199	HNRNPC	3183
ENSG00000138668	HNRNPD	3184
ENSG00000169813	HNRNPF	3185
ENSG00000169045	HNRNPH1	3187
ENSG00000126945	HNRNPH2	3188
ENSG00000096746	HNRNPH3	3189
ENSG00000165119	HNRNPK	3190
ENSG00000099783	HNRNPM	4670
ENSG00000125944	HNRNPR	10236
ENSG00000153187	HNRNPU	3192
ENSG00000105323	HNRNPUL1	11100
ENSG00000204389	HSPA1A	3303
ENSG00000109971	HSPA8	3312
ENSG00000106211	HSPB1	3315
ENSG00000102241	HTATSF1	27336
ENSG00000113141	IK	3550
ENSG00000143621	ILF2	3608
ENSG00000129351	ILF3	3609
ENSG00000240682	ISY1	57461
ENSG00000173801	JUP	3728
ENSG00000121774	KHDRBS1	10657
ENSG00000131773	KHDRBS3	10656
ENSG00000151657	KIN	22944
ENSG00000204392	LSM2	57819
ENSG00000170860	LSM3	27258
ENSG00000130520	LSM4	25804
ENSG00000106355	LSM5	23658
ENSG00000164167	LSM6	11157
ENSG00000130332	LSM7	51690
ENSG00000128534	LSM8	51691
ENSG00000007392	LUC7L	55692
ENSG00000162385	MAGOH	4116
ENSG00000015479	MATR3	9782
ENSG00000140259	MFAP1	4236
ENSG00000136937	NCBP1	4686
ENSG00000114503	NCBP2	22916
ENSG00000074356	NCBP3	55421
ENSG00000101882	NKAP	79576
ENSG00000142546	NOSIP	51070
ENSG00000053702	NRIP2	83714
ENSG00000126653	NSRP1	84081
ENSG00000070756	PABPC1	26986
ENSG00000159086	PAXBP1	94104
ENSG00000169564	PCBP1	5093
ENSG00000197111	PCBP2	5094
ENSG00000100410	PHF5A	84844
ENSG00000171566	PLRG1	5356
ENSG00000100941	PNN	5411
ENSG00000084072	PPIE	10450
ENSG00000138398	PPIG	9360
ENSG00000171960	PPIH	10465
ENSG00000137168	PPIL1	51645
ENSG00000100023	PPIL2	23759
ENSG00000240344	PPIL3	53938
ENSG00000131013	PPIL4	85313
ENSG00000172531	PPP1CA	5499
ENSG00000117751	PPP1R8	5511
ENSG00000113593	PPWD1	23398
ENSG00000102103	PQBP1	10084
ENSG00000143294	PRCC	5546
ENSG00000100462	PRMT5	10419
ENSG00000165630	PRPF18	8559
ENSG00000110107	PRPF19	27339
ENSG00000117360	PRPF3	9129
ENSG00000105618	PRPF31	26121
ENSG00000134748	PRPF38A	84950
ENSG00000136875	PRPF4	9128
ENSG00000196504	PRPF40A	55660
ENSG00000112739	PRPF4B	8899
ENSG00000101161	PRPF6	24148
ENSG00000174231	PRPF8	10594
ENSG00000011304	PTBP1	5725
ENSG00000117569	PTBP2	58155
ENSG00000179950	PUF60	22827
ENSG00000112531	QKI	9444
ENSG00000204628	RACK1	10399
ENSG00000125970	RALY	22913
ENSG00000122257	RBBP6	5930
ENSG00000100320	RBFOX2	23543
ENSG00000182872	RBM10	8241
ENSG00000134453	RBM17	84991
ENSG00000086589	RBM22	55696
ENSG00000100461	RBM23	55147
ENSG00000119707	RBM25	58517
ENSG00000131051	RBM39	9584
ENSG00000173933	RBM4	5936
ENSG00000126254	RBM42	79171
ENSG00000003756	RBM5	10181
ENSG00000076053	RBM7	10179
ENSG00000265241	RBM8A	9939
ENSG00000147274	RBMX	27316
ENSG00000134597	RBMX2	51634
ENSG00000125352	RNF113A	7737
ENSG00000205937	RNPS1	10921
ENSG00000150459	SAP18	10284
ENSG00000161526	SAP30BP	29115
ENSG00000175467	SART1	9092
ENSG00000143751	SDE2	163859
ENSG00000075826	SEC31B	25956
ENSG00000168066	SF1	7536
ENSG00000099995	SF3A1	10291
ENSG00000104897	SF3A2	8175
ENSG00000183431	SF3A3	10946
ENSG00000115524	SF3B1	23451
ENSG00000087365	SF3B2	10992
ENSG00000189091	SF3B3	23450
ENSG00000143368	SF3B4	10262
ENSG00000169976	SF3B5	83443
ENSG00000115128	SF3B6	51639
ENSG00000164609	SLU7	10569
ENSG00000172062	SMN1	6606
ENSG00000119953	SMNDC1	10285
ENSG00000122692	SMU1	55234
ENSG00000163877	SNIP1	79753
ENSG00000144028	SNRNP200	23020
ENSG00000124380	SNRNP27	11017
ENSG00000060688	SNRNP40	9410
ENSG00000104852	SNRNP70	6625
ENSG00000077312	SNRPA	6626
ENSG00000131876	SNRPA1	6627
ENSG00000125835	SNRPB	6628
ENSG00000125870	SNRPB2	6629
ENSG00000124562	SNRPC	6631
ENSG00000167088	SNRPD1	6632
ENSG00000125743	SNRPD2	6633
ENSG00000100028	SNRPD3	6634
ENSG00000182004	SNRPE	6635
ENSG00000139343	SNRPF	6636
ENSG00000143977	SNRPG	6637
ENSG00000100138	SNU13	4809
ENSG00000100603	SNW1	22938
ENSG00000096063	SRPK1	6732
ENSG00000135250	SRPK2	6733
ENSG00000133226	SRRM1	10250
ENSG00000167978	SRRM2	23524
ENSG00000087087	SRRT	51593
ENSG00000136450	SRSF1	6426
ENSG00000188529	SRSF10	10772
ENSG00000161547	SRSF2	6427
ENSG00000112081	SRSF3	6428
ENSG00000116350	SRSF4	6429
ENSG00000100650	SRSF5	6430
ENSG00000124193	SRSF6	6431
ENSG00000115875	SRSF7	6432
ENSG00000111786	SRSF9	8683
ENSG00000105705	SUGP1	57794
ENSG00000117614	SYF2	25949
ENSG00000135316	SYNCRIP	10492
ENSG00000113649	TCERG1	10915
ENSG00000100109	TFIP11	24144
ENSG00000079134	THOC1	9984
ENSG00000125676	THOC2	57187
ENSG00000051596	THOC3	84321
ENSG00000100296	THOC5	8563
ENSG00000163634	THOC7	80145
ENSG00000054118	THRAP3	9967
ENSG00000132773	TOE1	114034
ENSG00000164548	TRA2A	29896
ENSG00000136527	TRA2B	6434
ENSG00000123144	TRIR	79002
ENSG00000163728	TTC14	151613
ENSG00000141759	TXNL4A	10907
ENSG00000160201	U2AF1	7307
ENSG00000063244	U2AF2	11338
ENSG00000163714	U2SURP	23350
ENSG00000198258	UBL5	59286
ENSG00000168883	USP39	10713
ENSG00000084463	WBP11	51729
ENSG00000116455	WDR77	79084
ENSG00000123154	WDR83	84292
ENSG00000076924	XAB2	56949
ENSG00000065978	YBX1	4904
ENSG00000060138	YBX3	8531
ENSG00000158545	ZC3H18	124245
ENSG00000155329	ZCCHC10	54819
ENSG00000146007	ZMAT2	153527
ENSG00000010244	ZNF207	7756
ENSG00000198783	ZNF830	91603
