{
    "auth": {
        "email": "admin",
        "password": "admin123",
        "name": "Viet Vuong"
    },
    "list-news": [
        {
            "title": "Thị trường đậu tương tăng điểm mạnh nhờ xuất khẩu và hạn hán ở Mỹ",
            "tags": [
                "E",
                "Kim Loại"
            ],
            "time": "11:22:20",
            "date": "23/05"
        },
        {
            "title": "Các tập đoàn sản xuất quặng sắt lớn nhất bang Tây Úc đẩy mạnh sản lượng xuất khẩu",
            "tags": [
                "Công nghiệp nặng"
            ],
            "time": "11:22:20",
            "date": "23/05"
        },
        {
            "title": "Thị trường hàng hoá tuần từ 03/02 - 07/02/2020: Tìm cơ hội trong đại dịch Corona",
            "tags": [
                "Kim loại"
            ],
            "time": "11:22:20",
            "date": "23/05"
        },
        {
            "title": "MXV họp Hội đồng xét duyệt hồ sơ cho một số TVKD được phép giao dịch mặt hàng thuộc nhóm năng lượng",
            "tags": [
                "Năng lượng",
                "Tag 1",
                "Tag 2",
                "Tag 3"
            ],
            "time": "11:22:20",
            "date": "23/05"
        },
        {
            "title": "Giá Đồng hồi phục nhờ các chính sách đầu tư của Chính phủ Trung Quốc",
            "tags": [
                "E"
            ],
            "time": "11:22:20",
            "date": "23/05"
        },
        {
            "title": "Ngô bất ngờ đóng cửa tăng mạnh trong phiên hôm qua",
            "tags": [
                "Kim loại"
            ],
            "time": "11:22:20",
            "date": "23/05"
        },
        {
            "title": "Giá Dầu đi ngang chờ đợi cuộc họp OPEC+",
            "tags": [
                "Kim loại nặng",
                "Tag 1",
                "Tag 2"
            ],
            "time": "11:22:20",
            "date": "23/05"
        },
        {
            "title": "Dầu đậu tương tăng mạnh theo xu hướng của giá dầu thế giới và đậu tương",
            "tags": [
                "E"
            ],
            "time": "11:22:20",
            "date": "23/05"
        },
        {
            "title": "Giá dầu thế giới sụt giảm khiến giá đồng USD tăng mạnh",
            "tags": [
                "E"
            ],
            "time": "11:22:20",
            "date": "23/05"
        },
        {
            "title": "Giá đường hồi phục nhẹ nhờ vào giá dầu thô và đồng Real lên giá",
            "tags": [
                "E"
            ],
            "time": "11:22:20",
            "date": "23/05"
        },
        {
            "title": "Giá Đồng hồi phục nhờ các chính sách đầu tư của Chính phủ Trung Quốc",
            "tags": [
                "E"
            ],
            "time": "11:22:20",
            "date": "23/05"
        },
        {
            "title": "Ngô bất ngờ đóng cửa tăng mạnh trong phiên hôm qua",
            "tags": [
                "E"
            ],
            "time": "11:22:20",
            "date": "23/05"
        }
    ],
    "notification": {
        "mailCount": 5,
        "notificationCount": 10
    },
    "trading-bar": [
        {
            "name": "Cao su RSS 3",
            "value": "140.4",
            "unit": "D",
            "valueChanged": "-1",
            "percentValueChanged": "0.71"
        },
        {
            "name": "Đường",
            "value": "9.73",
            "unit": "E",
            "valueChanged": "0.5",
            "percentValueChanged": "1.12"
        },
        {
            "name": "Ngô",
            "value": "315.6",
            "unit": "E",
            "valueChanged": "-3.4",
            "percentValueChanged": "1.1"
        },
        {
            "name": "Dầu đậu tương",
            "value": "832.2",
            "unit": "E",
            "valueChanged": "-7",
            "percentValueChanged": "0.35"
        },
        {
            "name": "Đồng",
            "value": "2.3370",
            "unit": "E",
            "valueChanged": "0.25",
            "percentValueChanged": "1.08"
        },
        {
            "name": "Đậu tương",
            "value": "287.7",
            "unit": "E",
            "valueChanged": "-1",
            "percentValueChanged": "0.35"
        },
        {
            "name": "Dầu đậu tương",
            "value": "832.2",
            "unit": "E",
            "valueChanged": "-7",
            "percentValueChanged": "0.35"
        },
        {
            "name": "Đồng",
            "value": "2.3370",
            "unit": "E",
            "valueChanged": "0.25",
            "percentValueChanged": "1.08"
        },
        {
            "name": "Đậu tương",
            "value": "287.7",
            "unit": "E",
            "valueChanged": "-1",
            "percentValueChanged": "0.35"
        }
    ]
}