{
  "profile_permissions": {
  "System Administrator": {
    "Resources": {
      "action": ["create", "edit", "list", "show", "delete"],
      "analysis": ["create", "edit", "list", "show", "delete"],
      "analysis_variables": ["create", "edit", "list", "show", "delete"],
      "context": ["create", "edit", "list", "show", "delete"],
      "basin": ["create", "edit", "list", "show", "delete"],
      "field_point": ["create", "edit", "list", "show", "delete"],
      "funding_agency": ["create", "edit", "list", "show", "delete"],
      "lithostratigraphic_unit": ["create", "edit", "list", "show", "delete"],
      "menu": ["create", "edit", "list", "show", "delete"],
      "menu_items": ["create", "edit", "list", "show", "delete"],
      "menu_menu_items": ["create", "edit", "list", "show", "delete"],
      "permission": ["create", "edit", "list", "show", "delete"],
      "permission_contexts": ["create", "edit", "list", "show", "delete"],
      "profile": ["create", "edit", "list", "show", "delete"],
      "profile_context": ["create", "edit", "list", "show", "delete"],
      "profile_permissions": ["create", "edit", "list", "show", "delete"],
      "project": ["create", "edit", "list", "show", "delete"],
      "project_field_points": ["create", "edit", "list", "show", "delete"],
      "publication": ["create", "edit", "list", "show", "delete"],
      "resource": ["create", "edit", "list", "show", "delete"],
      "sample": ["create", "edit", "list", "show", "delete"],
      "technique": ["create", "edit", "list", "show", "delete"],
      "technique_variables": ["create", "edit", "list", "show", "delete"],
      "user": ["create", "edit", "list", "show", "delete"],
      "user_publications": ["create", "edit", "list", "show", "delete"],
      "user_type": ["create", "edit", "list", "show", "delete"],
      "user_profile": ["create", "edit", "list", "show", "delete"],
      "variable": ["create", "edit", "list", "show", "delete"],
      "variable_type": ["create", "edit", "list", "show", "delete"]
    },
    "Contexts": {
      "isSystemAdminContext": {
        "name": "System Admin Context", "description": "User access all records"
      }
    }
  },
  "Application Administrator": {
    "Resources": {
      "action": ["list", "show"],
      "analysis": ["create", "edit", "list", "show", "delete"],
      "analysis_variables": ["create", "edit", "list", "show", "delete"],
      "basin": ["create", "edit", "list", "show", "delete"],
      "field_point": ["create", "edit", "list", "show", "delete"],
      "funding_agency": ["create", "edit", "list", "show", "delete"],
      "lithostratigraphic_unit": ["create", "edit", "list", "show", "delete"],
      "menu": ["create", "edit", "list", "show", "delete"],
      "menu_items": ["create", "edit", "list", "show", "delete"],
      "menu_menu_items": ["create", "edit", "list", "show", "delete"],
      "profile": ["create", "edit", "list", "show", "delete"],
      "profile_context": ["create", "edit", "list", "show", "delete"],
      "profile_permissions": ["create", "edit", "list", "show", "delete"],
      "project": ["create", "edit", "list", "show", "delete"],
      "project_field_points": ["create", "edit", "list", "show", "delete"],
      "publication": ["create", "edit", "list", "show", "delete"],
      "resource": ["list", "show"],
      "sample": ["create", "edit", "list", "show", "delete"],
      "technique": ["create", "edit", "list", "show", "delete"],
      "technique_variables": ["create", "edit", "list", "show", "delete"],
      "user": ["create", "edit", "list", "show", "delete"],
      "user_publications": ["create", "edit", "list", "show", "delete"],
      "user_type": ["list", "show"],
      "user_profile": ["create", "edit", "list", "show", "delete"],
      "variable": ["create", "edit", "list", "show", "delete"],
      "variable_type": ["create", "edit", "list", "show", "delete"]
    },
    "Contexts": {
      "isAppAdminContext": {
        "name": "Application Admin Context",
        "description": "User accesses all Geology records"
      }
    }
  },
  "Common User": {
    "Resources": {
      "analysis": ["list", "show"],
      "analysis_variables": ["list", "show"],
      "basin": ["list", "show"],
      "field_point": ["list", "show"],
      "funding_agency": ["list", "show"],
      "lithostratigraphic_unit": ["list", "show"],
      "menu": ["list", "show"],
      "menu_items": ["list", "show"],
      "menu_menu_items": ["list", "show"],
      "profile": ["list", "show"],
      "profile_context": ["list", "show"],
      "profile_permissions": ["list", "show"],
      "project": ["list", "show"],
      "project_field_points": ["list", "show"],
      "publication": ["list", "show"],
      "resource": ["list", "show"],
      "sample": ["list", "show"],
      "technique": ["list","show"],
      "technique_variables": ["list", "show"],
      "user": ["edit", "list", "show", "delete"],
      "user_publications": ["create", "edit", "list", "show", "delete"],
      "user_profile": ["list", "show"],
      "variable": ["list", "show"],
      "variable_type": ["list", "show"]
    },
    "Contexts": {
      "isCommomContext": {
        "name": "Commom User Context",
        "description": "User only has access to their own records"
      }
    }
  },
  "Researcher User": {
    "Resources": {
      "analysis": ["create", "edit", "list", "show", "delete"],
      "analysis_variables": ["create", "edit", "list", "show", "delete"],
      "basin": ["create", "edit", "list", "show", "delete"],
      "field_point": ["create", "edit", "list", "show", "delete"],
      "funding_agency": ["create", "edit", "list", "show", "delete"],
      "lithostratigraphic_unit": ["create", "edit", "list", "show", "delete"],
      "menu": ["list", "show"],
      "menu_items": ["list", "show"],
      "menu_menu_items": ["list", "show"],
      "profile": ["list", "show"],
      "profile_context": ["list", "show"],
      "profile_permissions": ["list", "show"],
      "project": ["create", "edit", "list", "show", "delete"],
      "project_field_points": ["create", "edit", "list", "show", "delete"],
      "publication": ["create", "edit", "list", "show", "delete"],
      "resource": ["list", "show"],
      "sample": ["create", "edit", "list", "show", "delete"],
      "technique": ["list","show"],
      "technique_variables": ["list", "show"],
      "user": ["edit", "list", "show", "delete"],
      "user_publications": ["create", "edit", "list", "show", "delete"],
      "user_profile": ["list", "show"],
      "variable": ["list", "show"],
      "variable_type": ["list", "show"]
    },
    "Contexts": {
      "isResearcherContext": {
        "name": "Research User Context", "description": "User accesses some groups of records and their own records"
      }
    }
  }
}}
