<svg width="84" height="100" viewBox="0 0 84 100" fill="none" xmlns="http://www.w3.org/2000/svg">
<path d="M0.460938 52.5559L21.488 14.707L27.5439 24.1272L35.1136 16.3892H41.6741L53.4493 36.0706C53.4493 36.0706 55.9725 42.1264 52.44 45.8272C48.9074 49.5279 44.0291 51.3783 40.4966 51.0419C36.964 50.7055 33.095 49.8644 25.5253 48.5186C17.9555 47.1729 12.0679 45.8272 8.03069 48.1822C3.99348 50.5373 0.460938 52.5559 0.460938 52.5559Z" fill="#794421" fill-opacity="0.929412"/>
<path d="M23.5063 11.3426L28.8893 1.41787C28.8893 1.41787 30.1658 -1.6289 31.749 1.21002C33.3752 4.12612 38.6459 12.3518 38.6459 12.3518H34.2722L28.3846 18.9123L23.5063 11.3426Z" fill="#917C6F"/>
<path d="M43.751 12.6084H52.5655C52.9511 12.6084 55.2099 12.7187 56.3117 13.9856C57.4135 15.2528 77.3564 40.0988 77.3564 40.0988C77.3564 40.0988 69.886 34.5603 65.8424 33.2124C61.8759 31.8902 57.3045 31.064 56.0362 31.0638C55.6506 31.0637 43.751 12.6084 43.751 12.6084Z" fill="#794420" fill-opacity="0.929412"/>
<path d="M0.181087 59.7906C0.181087 59.7906 3.72236 54.4402 10.5098 53.026C14.9137 52.1085 21.2748 52.8805 21.2748 52.8805C21.2748 52.8805 33.4219 55.0627 35.0222 55.2081C36.6224 55.3536 43.6779 55.4266 46.0782 54.6262C48.4785 53.8261 54.0471 51.4794 56.0432 48.1526C59.3164 42.6973 57.9201 38.9957 56.4068 35.7146C54.8937 32.4335 58.0798 36.6602 59.5345 40.0061C60.2116 41.5633 61.2802 44.443 59.68 48.2253C58.0798 52.0077 52.77 56.9538 44.6962 58.6268C36.6224 60.2997 25.2026 61.7545 20.4747 64.8822C15.7468 68.0099 15.1649 68.9555 13.4192 71.0648C11.6735 73.1742 8.76405 80.9571 9.92783 83.5756C11.0916 86.1942 3.35847 77.7455 1.19174 70.806C-0.633176 64.9612 0.181087 59.7906 0.181087 59.7906Z" fill="#165044"/>
<path d="M15.2376 89.322C15.2376 89.322 14.9467 82.3393 17.5652 78.5569C20.1838 74.7746 25.0572 71.1377 29.8578 68.7374C34.6585 66.3371 39.8955 65.537 42.8778 64.8823C45.86 64.2277 50.9516 62.9184 53.4247 61.2455C55.8977 59.5725 59.5219 57.3811 60.9893 52.8807C62.0739 49.5541 62.7543 45.9096 62.2986 42.843C61.8428 39.7765 60.3347 36.1512 59.6801 35.3511C58.7658 34.2337 60.8045 36.3854 61.2075 37.024C62.1013 38.4405 62.4441 38.988 63.0987 41.6792C63.7533 44.3705 64.408 49.8258 62.5168 54.6264C60.6256 59.4271 55.2431 65.7552 53.061 68.2282C50.8788 70.7013 46.2964 76.5203 44.9144 82.6302C43.5324 88.7402 44.5507 91.2132 45.3508 93.1771C46.1509 95.141 48.4785 97.9778 48.915 98.4869C49.3514 98.9961 41.423 99.3598 38.0771 98.9233C34.7312 98.4869 27.0211 96.8139 23.3115 94.7773C19.6019 92.7407 15.2376 89.322 15.2376 89.322Z" fill="#217867"/>
<path d="M56.9161 96.0865C56.9161 96.0865 52.9156 92.5951 53.2065 86.6307C53.5063 80.4849 54.4052 78.383 57.7162 72.5197C61.2076 66.3371 63.4625 62.6275 64.699 59.2816C65.9356 55.9357 66.9539 52.1533 66.8084 48.1528C66.6629 44.1522 65.5718 39.8608 64.6263 38.6242C63.6807 37.3877 62.9533 36.2239 62.9533 36.2239C62.9533 36.2239 64.3353 37.3876 64.5536 37.7514C64.772 38.1149 65.7173 39.1334 66.1538 40.079C66.5902 41.0245 68.1177 43.8612 68.4086 45.8252C68.6997 47.7891 69.9361 51.4987 68.9905 57.8995C68.0449 64.3004 67.3903 65.8279 67.8995 68.5192C68.4086 71.2105 69.7907 73.9744 71.4636 75.5747C73.1366 77.1749 74.476 78.5067 77.0644 79.5752C77.4004 79.7139 74.8822 83.9395 72.0455 86.558C69.2087 89.1765 64.8445 92.5224 62.0078 94.1954C59.171 95.8683 56.9161 96.0865 56.9161 96.0865Z" fill="#2CA089"/>
<path d="M66.8081 37.606C66.8081 37.606 71.827 39.4971 74.1546 41.461C76.4821 43.4249 80.8464 47.9346 81.6465 49.8258C82.4466 51.717 84.1196 54.4082 83.8286 59.6453C83.5376 64.8823 81.501 71.5014 81.1373 72.2288C81.0648 72.3743 77.0034 70.897 74.8092 66.7735C73.632 64.5612 72.918 60.7364 73.0635 56.5903C73.212 52.3585 72.4089 47.4982 71.4633 45.2434C70.5177 42.9885 68.5538 39.7881 68.0447 39.1334C67.5355 38.4788 66.8081 37.606 66.8081 37.606Z" fill="#37C8AB"/>
</svg>
