chief_complaint,freq
cc_chest_or_esophag_pain,691
cc_acs_ami,81
cc_dyspnea,80
cc_arrest,54
cc_ekg,26
cc_chest_other,22
cc_abd_pain,16
cc_arm_cmplt,14
cc_high_bp,13
cc_syncope,13
cc_weakness_ftt,10
cc_jaw_cmplt,8
cc_dizzy_lightheaded_vertigo,8
cc_tachycard_palp,8
cc_side_weakness,6
cc_nausea_vomit,6
cc_gsw_stab,5
cc_evaluation,5
cc_ent_cmplt,4
cc_foot_ankle_toe_cmplt,4
cc_fever_chills,4
cc_unresponsive,4
cc_edema,4
cc_device_or_equipment,4
cc_face_cmplt,3
cc_shoulder_cmplt,3
cc_elbow_wri_hand_finger_cmplt,3
cc_back_pain,3
cc_ams,3
cc_cough,3
cc_numb_unspec,3
cc_bleeding,2
cc_epistaxis,2
cc_neck_cmplt,2
cc_hip_femur_groin_cmplt,2
cc_fall,2
cc_headache,2
cc_diarrhea,2
cc_stroke,2
cc_pneumonia,2
cc_leg_swell_onesided,2
cc_sickle_cell,2
cc_tumor_or_mass_or_biopsy,2
cc_aortic_dissect,2
cc_mvc_or_ped_struck,2
cc_mult_complaints,1
cc_pain_nonspec,1
cc_abnormal_labs,1
cc_fracture_or_disloc,1
cc_pelvis_cmplt,1
cc_leg_cmplt,1
cc_penile_or_testic_cmplt,1
cc_cellulitis,1
cc_low_bp,1
cc_anxiety,1
cc_abd_nopain,1
cc_overdose,1
cc_flank_side,1
cc_gi_bleed,1
cc_asthma,1
cc_copd,1
cc_pulm_embo,1
cc_hematuria,1
cc_wound_cut_lac_incis,1
cc_neuro_evaluation,1
cc_hyperglycemia,1
cc_afib,1
