loinc_code,lab_cat
2823-3,k
4544-3,hct
2160-0,cre
718-7,hgb
777-3,plt
6690-2,wbc_blood
789-8,rbc
787-2,mcv
786-4,mchc
785-6,mch
788-0,rdw
3094-0,bun
2028-9,co2
2951-2,sodium
2075-0,cl
10466-1,anion
17861-6,ca
6777-7,glu_other
33914-3,gfr
2601-3,mg
5902-2,pt
6301-6,pt_inr
736-9,perc_lymph
5905-5,perc_monos
770-8,anc_blood
731-0,lymph
752-6,anc_blood
742-7,monos
713-8,perc_eos
706-2,perc_baso
711-2,aeos
704-7,baso
1920-8,sgot
1751-7,alb
1742-6,sgpt
5898-2,ptt
6768-6,alkp
2885-2,tp
1975-2,tbili
2336-6,glob
4548-4,ghba1c
2777-1,phosph
2093-3,chol
1968-7,dbili
2571-8,trig
X1174-2,hct
11557-6,bpco2
11556-8,bpo2
11555-0,ubasex
5803-2,ua_ph
5802-4,ua_nit
5811-5,ua_spgr
30313-1,hgb
5778-6,ua_color
5770-3,ua_bili
2753-2,bph
5818-0,ua_urobi
5792-7,ua_gluc
51733-4,o2_sat
20565-8,co2
5797-6,ua_ket
2157-6,cpk
2085-9,hdl
3016-3,tsh
764-1,perc_bands
5821-4,uas_wbc
5808-1,uas_rbc
735-1,atyps
744-3,perc_monos
769-0,anc_blood
737-7,perc_lymph
714-6,perc_eos
707-0,perc_baso
5799-2,ua_wbc
5782-8,uas_crys
2345-7,glu_other
5794-3,ua_bld
5804-0,ua_alb
2091-7,vldl
13969-1,cpk_mb
13457-7,ldl
30392-5,nrbc
2532-0,ldh
25162-9,hcast
3084-1,uric
6598-7,trop_t
5769-5,uas_bact
43755-8,casts_hpf
11277-1,uas_squa
11279-7,uas_com
3040-3,lips
26499-4,anc_blood
26478-8,perc_lymph
26485-3,perc_monos
26474-7,lymph
26484-6,monos
26511-6,perc_neut
26450-7,perc_eos
26449-9,aeos
1995-0,ic
30180-4,perc_baso
26444-0,baso
738-5,macro
2106-3,ucg
4537-7,esr
X1166-8,crp
728-6,hypo
X1727-7,glu_poc
9317-9,pltest
1798-8,amy
6298-4,k
62292-8,vitdt
10839-9,trop_i
741-9,microc
35674-1,ucre
2498-4,fe
2276-4,fer
2947-0,na
19080-1,hcg
8246-1,uas_amor
740-1,meta
2524-7,lact
2132-9,b12
2500-7,tibc
9439-1,casts
38892-6,aniso
2465-3,igg
15198-5,macro
8247-9,uas_muc
3377-9,ubarb
3349-8,uamph
14957-5,grmalb
3390-2,ubenz
28542-9,mvp
702-1,aniso
749-2,myelo
20578-1,vanc
2458-8,iga
2857-1,psa
2472-9,igm
3773-9,umethd
15150-6,aniso
3026-2,t4
14314-9,urcoca
3255-7,fib
4679-7,retic
2284-8,folate
2692-2,osm
9830-1,chol_hdl
776-5,mvp
6824-7,fcolor
14959-1,malbcre
5639-0,alc_ts
3297-9,acetom
4073-3,trc_ts
2339-0,glu_other
4023-8,salic
2731-8,pth
3024-7,freet4
13520-2,f_baso
2501-5,uibcu
5767-9,ua_turb
1994-3,ic
6743-9,f_wbc
11558-4,bph
33762-6,nt_bnp
15180-3,hypo
2746-6,vph
2021-4,vpco2
2705-2,vpo2
2089-1,ldl
27353-2,glu_other
35663-4,utp
26461-4,nrbcperc_
2027-1,co2
30350-3,hgb
3879-4,uopi
3426-4,uthc
18262-6,ldl
1927-3,vbasex
12238-2,f_poly
11031-2,flymph
3053-6,t3
26487-9,f_mono
26452-3,feos
26510-8,fbands
13518-6,f_atyp
26455-6,f_rbc
35678-2,u_una
8310-5,temp
1753-3,ua_alb
2243-4,est
5048-4,anatit
36916-5,kappa
33944-0,lambda
3968-5,phen
2713-6,o2_sat
48378-4,kflc_llc
17790-7,lshift
3520-4,cyclowb
2143-6,cort
2828-2,uk
48058-2,ddimer
X1012-4,uosm
54218-3,c4_c8
15067-2,fsh_ch
6742-1,rcm
24467-3,cd4
2842-3,prl
8124-0,3_pct
3393-6,urcoca
X1490-2,ucre
3376-1,barb_ts
3389-4,benz_ts
35676-6,ucl
10998-3,uoxcod
20453-7,ua_epis
3151-8,fio2
8117-4,cd19
3167-4,utvol
XC20-8,anapat
3936-2,urpcp
18267-5,cd1656
19048-8,nrbcperc_
15199-3,microc
8130-7,cd45
13362-9,utime
11572-5,rhf
35668-3,trgent
X1194-0,anatit
783-1,promyelo
5130-0,dna
2019-8,apco2
2703-7,apo2
4086-5,valp
4542-7,hap
X1006-6,ucre
4498-2,c4
16362-6,nh3
2839-9,prog
709-6,blasts
4485-9,c3
2880-3,csf_tp
10501-5,lh_chm
2342-4,csf_glu
3414-0,bupur
17788-1,lucp
2744-1,aph
17789-9,luc
5796-8,hcast
13965-9,pbh
5640-8,ethan
15129-0,ddimer
13068-2,anapat
30934-4,bnp
3181-5,acligg
32167-9,ua_turb
4532-8,ch5_
2039-6,cea
53962-7,afptm
1834-1,afp
3432-2,carba
8099-4,tpo
5351-2,ro
4552-6,hba2
4625-0,hbs
4563-3,hbc
5353-8,la
2324-2,ggt
52755-6,lupusscr
4547-6,hba
X1008-2,utp
21198-7,bhcg
771-6,nrbca
X1004-1,uun
763-3,band
3719-2,lith
19113-0,ige
42247-7,hbep
5356-1,sm
2986-8,tes
8067-1,acligm
5301-7,rnp
13047-6,pcell
X1171-8,psa
730-2,othrcells
13514-5,hbep
2881-1,ftp
19261-7,uamph
19550-3,umethd
19270-8,ubarb
11282-1,tcnt
3948-7,pheno
10886-0,psa
11273-0,rcm
10334-1,ca125
27811-9,atiiif
2991-8,ftes
2344-0,fglu
15197-7,fslymp
13590-5,apcrsc
26473-9,fother
29953-7,anatit
3013-0,trg
4545-0,hct
27819-2,prtcact
5892-5,protsf
2529-6,fldh
30522-7,crp
2711-0,so2_venous
2639-3,semyo
35670-9,untobr
12841-3,psapctf
10976-9,6mnmor
43755-8,casts
14836-1,mtx
4092-3,vanc
2161-8,ucre
43755-8,casts_lpf
10378-8,polych
12377-8,demox
30318-0,based
12210-1,u_eos
1795-4,famy
35675-8,uca
4049-3,theo
33594-3,hpia
2191-5,dhea
3779-6,umamph
2748-2,fph
2118-8,hcg
2955-3,una
5567-3,acet
3299-5,uacetom
5781-0,jf_c
32140-6,k_b
X1015-7,u_una
1761-6,aldol
14135-8,cd8ab
13532-7,csf_xa
21023-7,anca
2158-4,ckmbri
8122-4,3_abs
2888-6,utp
16135-6,b2gpg
2484-4,smc
30434-5,microc
2356-4,g6pd
2141-0,acth
19415-9,uthc
20448-7,ins
721-1,hgb
14338-8,prealb
15205-8,rhf
3209-4,fviii
5117-7,cryog
5693-7,methan
X1007-4,u_umg
2708-6,o2_sat
703-9,stippl
3395-1,coke
1971-1,ubili
15152-2,dbili
30229-9,band
3312-6,alpraz
2026-3,co2
10335-8,ccolor
3184-9,act
1763-2,aldos
3055-1,thbi
4576-5,hbf
800-3,schist
34167-7,pltlge
9335-1,f_turb
10343-2,temaz
1747-5,falb
2695-5,uosm
2064-4,cer
13530-1,fnrbc
10835-7,lp_a_
35622-0,ddiaz
30089-7,uas_tran
4014-7,quin
X7036-5,diaz
X7042-1,glutet
X7040-9,flur
X7049-8,methaq
X7034-2,dsalfl
35637-8,4ohglu
X7052-1,ddiaz
X7045-4,lor
X7066-5,trazo
X7059-8,oxazep
X7029-8,clrdz
10328-3,clymph
792-2,crbc
10333-3,cturb
X7032-1,clonaz
10329-1,cmonos
35626-1,npropx
35595-8,acetom
7790-9,burrs
3690-5,imipr
35597-4,salic
13516-0,cneut
13555-8,psdepd
803-7,tgran
13553-3,coetoh
3538-6,dxtrmp
3465-2,clrphn
2469-5,igg4
X7025-0,theo
X7028-7,carba
19321-9,6mnmor
X7060-9,pento
X7027-6,butal
X7065-4,secob
X7043-3,ibup
X7061-0,pheno
13583-0,thior
X7067-2,amitr
13566-5,meso
2467-9,igg2
2468-7,igg3
13575-6,dmapr
4082-4,trimip
X7031-8,clom
X7084-7,dispyr
13585-5,trfluo
3734-1,mapro
13578-0,prom
X7030-0,clrprm
4007-1,pyrl
3915-6,pntaz
2466-1,igg1
X7064-3,propra
X7063-2,propx
X7055-4,normep
X7053-2,ddoxep
X7057-6,nortr
X7033-2,cylbnz
X7047-6,meper
X7054-3,nfluox
6771-0,a1at
X7038-3,doxep
X7039-1,fluox
X7037-5,dphn
X7035-4,desip
X7048-7,mthdon
X7062-1,phen
32215-6,ft4i
35673-3,u_up
12208-5,ceos
13529-3,cnrbc
2009-9,ca19_9
12278-8,cbands
4091-5,vanc
13519-4,cbaso
2915-7,renin
6014-5,ristoc
X1172-6,psa
13522-8,fblast
X7014-4,other
11004-9,trcug
5247-2,ama
13525-1,cmonos
3243-3,tt
13517-8,creact
3182-3,acligm
13527-7,cunid
2963-7,gh
5358-7,asmas
3211-0,fviii
27816-8,vwf
X1178-3,t_ucre
7791-7,teardr
774-0,ovals
35662-6,ua_gluc
2609-6,met_tu
806-0,cwbc
11013-0,dna
35603-0,clonaz
53959-3,lowhcg
8061-4,anapat
21000-5,rdw
2006-5,ca125
2269-9,pfb
X1043-9,seq
7793-3,hjbody
13967-5,shbg
X1001-7,u_uua
X7011-0,othrcells
1986-9,cpepn
42242-8,uetoh
10381-2,target
14316-4,ubenz
3034-6,trf
5643-2,ethan
34660-1,hba2
779-9,poik
30240-6,ddimer
11276-3,uas_tubu
30457-6,fnohem
11153-4,f_mhct
2668-2,t_unore
2232-7,t_uepi
12228-3,ftri
X1278-1,ro_int
34985-2,funid
X1281-5,la_int
1690-7,5__nuc
5348-8,scl7_
8123-2,cd3p_cd4p
2147-7,u_f
4478-4,c1q
30424-6,macro
30400-6,hypo
35600-6,clrdz
3095-7,uun
35635-2,trazo
X1010-8,uca
5132-6,ssdna
11274-8,ellipt
4477-6,c1inh
751-8,anc_blood
2078-4,ucl
16136-4,b2gpm
12230-9,macphg
2333-3,gast
17862-4,uca
X1280-7,rnpint
X1279-9,sm_int
3179-9,bt
3173-2,ptt
6875-9,ca15_3
49774-3,gbm
X5016-1,cother
1959-6,hc_3
35618-8,mthdon
11090-8,sm_iu
29374-6,rnp_od
46420-6,wbcc_micro
33037-3,anion
19123-9,mg
29280-5,ddimer
6741-3,f_rbc
30562-3,flm
X1489-4,t_unormt
3298-7,acetom
X5007-0,ctube
35624-6,nfluox
1558-6,glu_fast
34571-0,lupusscr
3714-3,lidotdm
8119-0,cd2_
6303-2,drvvt
40844-3,kflc_llc
49024-3,difmet
3834-9,napa
5793-5,gcast
40457-4,antipt
4546-8,hba
5774-5,uas_caox
802-9,sphero
35607-1,diaz
4024-6,salic
35608-9,dphn
X1502-4,ft3ml
33935-8,antccp
4531-0,cate
4621-9,sickle
772-4,nrbc
15190-2,othrcells
48066-5,ddimer
5644-0,uetoh
3665-7,trgent
2821-7,fk
2539-5,ldh2
2536-1,ldh1
2542-9,ldh3
2545-2,ldh4
42254-3,anapat
2548-6,ldh5
4484-2,c2
5964-2,pt
5785-1,u_eos
27812-7,atiiif
3663-2,trgent
XC270-9,la_cut
XC269-1,rnpcut
2950-4,fna
2283-0,rbcfol
X3012-2,inhibscr
3187-2,fix
7798-2,smudge
27820-0,protca
35610-5,fluox
32693-4,lact
6874-2,t_uca
1974-5,fbili
7792-5,dohle
2072-7,fcl
20569-0,perc_ckmb
9643-8,perc_ckmm
9642-0,perc_ck1bb
13589-7,apcrsc
2464-6,iggcsf
XC271-7,rnpcut
XC272-5,rnpcut
3274-8,hep_ufh
5077-3,aca
8135-6,cd7
20584-9,f_wbc
8101-8,cd3_cd8
13332-2,cd425
35669-1,unamik
10330-9,f_mono
24108-3,ca19_9
35616-2,lor
3427-2,uthc
52756-4,drvvt
24380-8,risto
3226-8,fxi
17785-7,riu
35467-0,mcpp
2012-3,ca27_29
24379-0,collag
2349-9,ua_gluc
5822-2,uas_yeas
1960-4,ahco3
13557-4,dms
3872-9,nortr
24377-4,adp
20513-8,f_turb
2778-9,up
XC13-3,thbr
2640-1,umyo
2528-8,csf_ldh
2193-1,dhea
24381-6,arach
48343-8,hbvar
33571-1,jo_1
11211-0,fco2
2460-4,igd
3199-7,fvii
12183-0,fchol
5763-8,zinc
53957-7,lowhcg
1746-7,albcsf
40593-6,epi5_
X7003-7,tox1
801-1,sick
13941-0,f_ly
X7004-5,tox2
3531-1,desip
3093-2,fun
34701-3,hpia
2784-7,spc
11235-9,ufentnyl
33984-6,fxact
1992-7,cciton
43743-4,aatyp
X7015-4,meoh
13579-8,sert
43219-5,tramadu
19343-3,uamph
3128-6,visc
15196-9,19_pct
14725-6,ftype
3397-7,urcoca
19648-5,uoxymorph
41858-2,u_eddp
X7059-9,ucreadlt
3333-2,amitr
X3014-8,inhiblev
3725-9,ulor
12308-3,vicodin
15372-6,unordz
3830-7,umorph
3507-1,ucodeine
3313-4,ualpraz
3887-7,uoxazep
13588-9,venlfx
12382-8,utemaz
9834-3,uhdrmor
35632-9,phen
12234-1,fmeso
35614-7,ibup
8118-2,cd2pct
28073-5,7aclonz
