var_raw,Variable
n_patients,$n$ Patients
n_encounters,$n$ Visits
test_rate,Test Rate
cath_rate,Catheterization Rate
stress_rate,Stress Overall Test Rate
death_030_day,Death (30 Day)
stent_or_cabg_010_day,Yield (10 Day)
stent_010_day,Stent (10 Day)
cabg_010_day,CABG (10 Day)
macetrop_030_pos,Diagnosed Event (30 Day)
has_ecg,ECG in ER
tn_rate,Troponin Test in ER
mean_pos_tn,"Mean Troponin, if Positive"
age_mean,"Age, mean"
age_median_iqr,"Age, median {[}IQR{]}"
female,Female
dem_race_white,White
dem_race_black,Black
dem_race_hispanic,Hispanic
dem_race_other,Other
miles_to_bwh,"Distance to hospital, median {[}IQR{]}"
athero,Past Heart Disease
athero_custom_zch,Athero Custom
athero_rf_custom_zch,Any Risk Factor
diabetes,Diabetes
htn_custom_zch,Hypertension Custom
hypertension,Hypertension
cholesterol,Cholesterol
ami_day_of,Heart Attack Diagnosis
maxtrop_sameday_pos,Positive Troponin Test in ER
macetrop_pos_or_death_030,Adverse Event (30 Day)
macetrop_or_death_31_to_365,Adverse Event (31-365 Day)
death_365_day,Death (365 Day)
