ccs,comorbidity
dia_t2yall_ccs_lvl_4_label_count_congestive_heart_failure,chf
dia_t2yall_ccs_lvl_3_label_count_congestive_heart_failure_nonhypertensive_108.,chf
dia_t2yall_ccs_category_description_count_chfnonhp,chf
