feature,feature_lab
dem_sex_female,Female
ed_enc_t0d_count_cc_chest_or_esophag_pain,Reason for Visit: Chest Pain
ed_enc_t0d_count_cc_sob,Reason for Visit: Shortness of Breath
dem_age,Age
ed_enc_t2yall_disch_disp_count_admit,Hospital Admissions (last 2y)
ed_enc_t0d_count_cc_acs_ami,Reason for Visit: Suspected ACS Referral
dem_agi_under_25K,Low Income
