{
  "id": "72c405ec-6078-4753-bf41-c6b774131ca8",
  "name": "Model Field",
  "modelName": "ModelField",
  "createdAt": "2020-08-28T12:10:49.013Z",
  "updatedAt": "2020-08-28T12:10:49.013Z",
  "deletedAt": null,
  "ModelFields": [
    {
      "id": "24c279f1-ee6d-441f-96d3-0027a930c69f",
      "targetModel": null,
      "targetModelAlias": null,
      "default": null,
      "name": "targetModel",
      "selectOptions": null,
      "length": 255,
      "modelFieldType": "DataTypes.STRING",
      "type": "string",
      "createdAt": "2020-08-28T12:10:49.024Z",
      "updatedAt": "2020-08-28T12:10:49.024Z",
      "deletedAt": null,
      "ModelId": "72c405ec-6078-4753-bf41-c6b774131ca8"
    },
    {
      "id": "a18efb23-2169-43e9-85e4-af33afe6e4a1",
      "targetModel": null,
      "targetModelAlias": null,
      "default": null,
      "name": "targetModelAlias",
      "selectOptions": null,
      "length": 255,
      "modelFieldType": "DataTypes.STRING",
      "type": "string",
      "createdAt": "2020-08-28T12:10:49.024Z",
      "updatedAt": "2020-08-28T12:10:49.024Z",
      "deletedAt": null,
      "ModelId": "72c405ec-6078-4753-bf41-c6b774131ca8"
    },
    {
      "id": "9752e8de-70bb-4ae9-ba9b-ad77c81bb82b",
      "targetModel": null,
      "targetModelAlias": null,
      "default": null,
      "name": "default",
      "selectOptions": null,
      "length": 255,
      "modelFieldType": "DataTypes.STRING",
      "type": "string",
      "createdAt": "2020-08-28T12:10:49.024Z",
      "updatedAt": "2020-08-28T12:10:49.024Z",
      "deletedAt": null,
      "ModelId": "72c405ec-6078-4753-bf41-c6b774131ca8"
    },
    {
      "id": "e13697a0-195e-4196-8873-a8cae3f52c5e",
      "targetModel": null,
      "targetModelAlias": null,
      "default": null,
      "name": "name",
      "selectOptions": null,
      "length": 255,
      "modelFieldType": "DataTypes.STRING",
      "type": "string",
      "createdAt": "2020-08-28T12:10:49.024Z",
      "updatedAt": "2020-08-28T12:10:49.024Z",
      "deletedAt": null,
      "ModelId": "72c405ec-6078-4753-bf41-c6b774131ca8"
    },
    {
      "id": "d1ad6160-cdde-4cee-b443-773956f215c7",
      "targetModel": null,
      "targetModelAlias": null,
      "default": null,
      "name": "selectOptions",
      "selectOptions": null,
      "length": null,
      "modelFieldType": "DataTypes.JSON",
      "type": "json",
      "createdAt": "2020-08-28T12:10:49.024Z",
      "updatedAt": "2020-08-28T12:10:49.024Z",
      "deletedAt": null,
      "ModelId": "72c405ec-6078-4753-bf41-c6b774131ca8"
    },
    {
      "id": "d102d1b1-4042-4e79-b043-4d5e025f002d",
      "targetModel": null,
      "targetModelAlias": null,
      "default": null,
      "name": "length",
      "selectOptions": null,
      "length": 10,
      "modelFieldType": "DataTypes.INTEGER",
      "type": "integer",
      "createdAt": "2020-08-28T12:10:49.024Z",
      "updatedAt": "2020-08-28T12:10:49.024Z",
      "deletedAt": null,
      "ModelId": "72c405ec-6078-4753-bf41-c6b774131ca8"
    },
    {
      "id": "b131f243-ff71-4908-9dee-3bf682ea25b1",
      "targetModel": null,
      "targetModelAlias": null,
      "default": null,
      "name": "modelFieldType",
      "selectOptions": [
        {
          "labelKey": "string",
          "value": "DataTypes.STRING"
        },
        {
          "labelKey": "integer",
          "value": "DataTypes.INTEGER"
        },
        {
          "labelKey": "decimal",
          "value": "DataTypes.DECIMAL(12, 2)"
        },
        {
          "labelKey": "text",
          "value": "DataTypes.TEXT"
        },
        {
          "labelKey": "json",
          "value": "DataTypes.JSON"
        },
        {
          "labelKey": "boolean",
          "value": "DataTypes.BOOLEAN"
        },
        {
          "labelKey": "datetime",
          "value": "DataTypes.DATETIME"
        }
      ],
      "length": null,
      "modelFieldType": "DataTypes.STRING",
      "type": "string",
      "createdAt": "2020-08-28T12:10:49.024Z",
      "updatedAt": "2020-08-28T12:10:49.024Z",
      "deletedAt": null,
      "ModelId": "72c405ec-6078-4753-bf41-c6b774131ca8"
    },
    {
      "id": "0eeb1cd4-e258-4528-a6ef-fd58505cf244",
      "targetModel": "Model",
      "targetModelAlias": "Model",
      "default": null,
      "name": "ModelId",
      "selectOptions": null,
      "length": null,
      "modelFieldType": null,
      "type": "belongsTo",
      "createdAt": "2020-08-28T12:16:45.662Z",
      "updatedAt": "2020-08-28T12:16:47.910Z",
      "deletedAt": null,
      "ModelId": "72c405ec-6078-4753-bf41-c6b774131ca8"
    },
    {
      "id": "39a510cd-4953-4dbd-9b1e-c11fadd4da1e",
      "targetModel": "ViewField",
      "targetModelAlias": "ViewField",
      "default": null,
      "name": "ViewFields",
      "selectOptions": null,
      "length": null,
      "modelFieldType": null,
      "type": "hasMany",
      "createdAt": "2020-08-28T12:16:45.662Z",
      "updatedAt": "2020-08-28T12:16:47.910Z",
      "deletedAt": null,
      "ModelId": "72c405ec-6078-4753-bf41-c6b774131ca8"
    },
    {
      "id": "4fd7d22d-3be7-4049-a55e-3bf16c02b1ba",
      "targetModel": null,
      "targetModelAlias": null,
      "default": null,
      "name": "type",
      "selectOptions": [
        {
          "labelKey": "string",
          "value": "string"
        },
        {
          "labelKey": "integer",
          "value": "integer"
        },
        {
          "labelKey": "decimal",
          "value": "decimal"
        },
        {
          "labelKey": "text",
          "value": "text"
        },
        {
          "labelKey": "json",
          "value": "json"
        },
        {
          "labelKey": "boolean",
          "value": "boolean"
        },
        {
          "labelKey": "hasMany",
          "value": "hasMany"
        },
        {
          "labelKey": "belongsTo",
          "value": "belongsTo"
        }
      ],
      "length": null,
      "modelFieldType": "DataTypes.STRING",
      "type": "string",
      "createdAt": "2020-08-28T12:10:49.024Z",
      "updatedAt": "2020-08-28T12:10:49.024Z",
      "deletedAt": null,
      "ModelId": "72c405ec-6078-4753-bf41-c6b774131ca8"
    }
  ],
  "Views": [
    {
      "id": "9cb74854-e757-4d4f-8925-9908db897ba3",
      "filters": null,
      "key": "form-modelFields",
      "type": "FormView",
      "showOnMenu": false,
      "labelKey": "modelFields",
      "include": null,
      "slug": null,
      "createdAt": "2020-08-28T12:10:49.088Z",
      "updatedAt": "2020-08-28T12:10:49.088Z",
      "deletedAt": null,
      "ModelId": "72c405ec-6078-4753-bf41-c6b774131ca8",
      "ViewFields": [
        {
          "id": "0eaf5562-7c46-42ca-89d8-d5efa5570726",
          "labelKey": "length",
          "class": "is-2",
          "mask": null,
          "format": null,
          "valueColumn": null,
          "descriptionColumn": null,
          "findType": null,
          "required": null,
          "canUpdate": null,
          "canOrderBy": null,
          "breakAfter": null,
          "order": "3",
          "filters": null,
          "include": null,
          "createdAt": "2020-08-28T12:10:49.144Z",
          "updatedAt": "2020-08-28T12:10:49.144Z",
          "deletedAt": null,
          "ModelFieldId": "d102d1b1-4042-4e79-b043-4d5e025f002d",
          "ViewId": "9cb74854-e757-4d4f-8925-9908db897ba3",
          "ChildViewId": null
        },
        {
          "id": "da8942ef-feb8-4392-9513-5923747ba468",
          "labelKey": "type",
          "class": "is-2",
          "mask": null,
          "format": null,
          "valueColumn": null,
          "descriptionColumn": null,
          "findType": null,
          "required": null,
          "canUpdate": null,
          "canOrderBy": null,
          "breakAfter": null,
          "order": "1",
          "filters": null,
          "include": null,
          "createdAt": "2020-08-28T12:10:49.144Z",
          "updatedAt": "2020-08-28T12:10:49.144Z",
          "deletedAt": null,
          "ModelFieldId": "4fd7d22d-3be7-4049-a55e-3bf16c02b1ba",
          "ViewId": "9cb74854-e757-4d4f-8925-9908db897ba3",
          "ChildViewId": null
        },
        {
          "id": "6d6de357-4f15-4477-9f82-c5bf94dff048",
          "labelKey": "targetModel",
          "class": "is-2",
          "mask": null,
          "format": null,
          "valueColumn": null,
          "descriptionColumn": null,
          "findType": null,
          "required": null,
          "canUpdate": null,
          "canOrderBy": null,
          "breakAfter": null,
          "order": "4",
          "filters": null,
          "include": null,
          "createdAt": "2020-08-28T12:10:49.144Z",
          "updatedAt": "2020-08-28T12:10:49.144Z",
          "deletedAt": null,
          "ModelFieldId": "24c279f1-ee6d-441f-96d3-0027a930c69f",
          "ViewId": "9cb74854-e757-4d4f-8925-9908db897ba3",
          "ChildViewId": null
        },
        {
          "id": "dcd7ed21-07a2-4c48-b5c4-b5f9d70a7642",
          "labelKey": "selectOptions",
          "class": "is-2",
          "mask": null,
          "format": null,
          "valueColumn": null,
          "descriptionColumn": null,
          "findType": null,
          "required": null,
          "canUpdate": null,
          "canOrderBy": null,
          "breakAfter": null,
          "order": "6",
          "filters": null,
          "include": null,
          "createdAt": "2020-08-28T12:10:49.144Z",
          "updatedAt": "2020-08-28T12:10:49.144Z",
          "deletedAt": null,
          "ModelFieldId": "d1ad6160-cdde-4cee-b443-773956f215c7",
          "ViewId": "9cb74854-e757-4d4f-8925-9908db897ba3",
          "ChildViewId": null
        },
        {
          "id": "860a8897-3bbf-440d-a84b-63b5d7971765",
          "labelKey": "default",
          "class": "is-2",
          "mask": null,
          "format": null,
          "valueColumn": null,
          "descriptionColumn": null,
          "findType": null,
          "required": null,
          "canUpdate": null,
          "canOrderBy": null,
          "breakAfter": null,
          "order": "7",
          "filters": null,
          "include": null,
          "createdAt": "2020-08-28T12:10:49.144Z",
          "updatedAt": "2020-08-28T12:10:49.144Z",
          "deletedAt": null,
          "ModelFieldId": "9752e8de-70bb-4ae9-ba9b-ad77c81bb82b",
          "ViewId": "9cb74854-e757-4d4f-8925-9908db897ba3",
          "ChildViewId": null
        },
        {
          "id": "1ced9c02-dc51-4a8f-8de0-d7205df97ef8",
          "labelKey": "modelFieldType",
          "class": "is-2",
          "mask": null,
          "format": null,
          "valueColumn": null,
          "descriptionColumn": null,
          "findType": null,
          "required": null,
          "canUpdate": null,
          "canOrderBy": null,
          "breakAfter": null,
          "order": "2",
          "filters": null,
          "include": null,
          "createdAt": "2020-08-28T12:10:49.144Z",
          "updatedAt": "2020-08-28T12:10:49.144Z",
          "deletedAt": null,
          "ModelFieldId": "b131f243-ff71-4908-9dee-3bf682ea25b1",
          "ViewId": "9cb74854-e757-4d4f-8925-9908db897ba3",
          "ChildViewId": null
        },
        {
          "id": "e022c49f-ef23-4cd3-8616-5c4d2cb98d21",
          "labelKey": "name",
          "class": "is-2",
          "mask": null,
          "format": null,
          "valueColumn": null,
          "descriptionColumn": null,
          "findType": null,
          "required": null,
          "canUpdate": null,
          "canOrderBy": null,
          "breakAfter": null,
          "order": "0",
          "filters": null,
          "include": null,
          "createdAt": "2020-08-28T12:10:49.144Z",
          "updatedAt": "2020-08-28T12:10:49.144Z",
          "deletedAt": null,
          "ModelFieldId": "e13697a0-195e-4196-8873-a8cae3f52c5e",
          "ViewId": "9cb74854-e757-4d4f-8925-9908db897ba3",
          "ChildViewId": null
        },
        {
          "id": "14bca2b7-53e8-45be-8000-b9f4ff9e0eb7",
          "labelKey": "targetModelAlias",
          "class": "is-2",
          "mask": null,
          "format": null,
          "valueColumn": null,
          "descriptionColumn": null,
          "findType": null,
          "required": null,
          "canUpdate": null,
          "canOrderBy": null,
          "breakAfter": null,
          "order": "5",
          "filters": null,
          "include": null,
          "createdAt": "2020-08-28T12:10:49.144Z",
          "updatedAt": "2020-08-28T12:10:49.144Z",
          "deletedAt": null,
          "ModelFieldId": "a18efb23-2169-43e9-85e4-af33afe6e4a1",
          "ViewId": "9cb74854-e757-4d4f-8925-9908db897ba3",
          "ChildViewId": null
        }
      ],
      "ViewActions": [],
      "ViewRowActions": []
    }
  ]
}
