[gd_scene load_steps=4 format=2]

[ext_resource path="res://src/Disease/InfectiousBubble.cs" type="Script" id=1]

[sub_resource type="CircleShape2D" id=1]
radius = 50.0

[sub_resource type="CircleShape2D" id=2]
radius = 5.0

[node name="InfectiousBubble" type="Node2D"]
script = ExtResource( 1 )

[node name="Area2D" type="Area2D" parent="."]
input_pickable = false
monitorable = false

[node name="CollisionShape2D" type="CollisionShape2D" parent="Area2D"]
shape = SubResource( 1 )

[node name="Particles" type="CPUParticles2D" parent="."]
emitting = false
amount = 100
lifetime = 1.5
explosiveness = 0.67
spread = 180.0
gravity = Vector2( 0, 0 )
initial_velocity = 30.0
initial_velocity_random = 1.0
radial_accel = -5.0
damping = 5.0
color = Color( 1, 0.027451, 0.027451, 1 )

[node name="KinematicBody2D" type="KinematicBody2D" parent="."]

[node name="CollisionShape2D" type="CollisionShape2D" parent="KinematicBody2D"]
shape = SubResource( 2 )
disabled = true

[connection signal="body_entered" from="Area2D" to="." method="InfectiousAreaBodyChange" binds= [ true ]]
[connection signal="body_exited" from="Area2D" to="." method="InfectiousAreaBodyChange" binds= [ false ]]
