{
  "posts": [
    {
      "id": 1,
      "title": "json-server",
      "author": "typicode"
    }
  ],
  "comments": [
    {
      "id": 1,
      "body": "some comment",
      "postId": 1
    }
  ],
  "profile": {
    "name": "typicode"
  },

  "pessoas": [
    {
    "name": "Ethel Price",
    "gender": "female",
    "company": "Johnson, Johnson and Partners, LLC CMP DDC",
    "age": 22
    }
  ]

}

