"Experience","Salary","Predicted_Salary"
0,27197.6217672389,31126.3685133392
1,30849.1125525836,33080.2164687087
2,41793.5415707456,35034.0644240782
3,36352.5419571229,36987.9123794478
4,38646.4386758047,38941.7603348173
5,48575.3249344164,40895.6082901868
6,44304.581029946,42849.4562455564
7,37674.6938269673,44803.3042009259
8,42565.7357405324,46757.1521562954
9,45771.6901495002,48711.000111665
10,56120.4089871973,50664.8480670345
