$date
	Mon Jan  1 13:10:22 2024
$end
$version
	Icarus Verilog
$end
$timescale
	1ps
$end
$scope module tb_d_flipflop $end
$var wire 1 ! q_bar $end
$var wire 1 " q $end
$var reg 1 # clk $end
$var reg 1 $ d $end
$scope module flipflop_inst $end
$var wire 1 # clk $end
$var wire 1 $ d $end
$var reg 1 " q $end
$var reg 1 ! q_bar $end
$upscope $end
$upscope $end
$enddefinitions $end
#0
$dumpvars
1$
0#
x"
x!
$end
#10000
1!
0"
1#
0$
#20000
0#
#30000
0!
1"
1#
1$
#40000
0#
0$
#50000
