$date
	Mon Jan  1 12:59:25 2024
$end
$version
	Icarus Verilog
$end
$timescale
	1ps
$end
$scope module tb_sr_flipflop $end
$var wire 1 ! q_bar $end
$var wire 1 " q $end
$var reg 1 # clk $end
$var reg 1 $ r $end
$var reg 1 % s $end
$scope module flipflop_inst $end
$var wire 1 # clk $end
$var wire 1 $ r $end
$var wire 1 % s $end
$var reg 1 " q $end
$var reg 1 ! q_bar $end
$upscope $end
$upscope $end
$enddefinitions $end
#0
$dumpvars
1%
0$
0#
1"
0!
$end
#10000
1#
0%
#20000
1!
0"
0#
1$
#30000
1#
0$
#40000
0#
#50000
