$date
	Mon Jan  1 12:33:26 2024
$end
$version
	Icarus Verilog
$end
$timescale
	1ps
$end
$scope module tb_mux4to1 $end
$var wire 4 ! y [3:0] $end
$var reg 4 " a [3:0] $end
$var reg 4 # b [3:0] $end
$var reg 4 $ c [3:0] $end
$var reg 4 % d [3:0] $end
$var reg 2 & sel [1:0] $end
$scope module mux_inst $end
$var wire 4 ' a [3:0] $end
$var wire 4 ( b [3:0] $end
$var wire 4 ) c [3:0] $end
$var wire 4 * d [3:0] $end
$var wire 2 + sel [1:0] $end
$var wire 4 , y [3:0] $end
$upscope $end
$upscope $end
$enddefinitions $end
#0
$dumpvars
b1010 ,
b0 +
b110 *
b11 )
b1100 (
b1010 '
b0 &
b110 %
b11 $
b1100 #
b1010 "
b1010 !
$end
#10000
b1111 !
b1111 ,
b1010 %
b1010 *
b0 $
b0 )
b1111 #
b1111 (
b101 "
b101 '
b1 &
b1 +
#20000
b1100 !
b1100 ,
b11 %
b11 *
b1100 $
b1100 )
b101 #
b101 (
b1001 "
b1001 '
b10 &
b10 +
#30000
b0 !
b0 ,
b0 %
b0 *
b1101 $
b1101 )
b1110 #
b1110 (
b11 "
b11 '
b11 &
b11 +
#40000
