<?xml version="1.0" encoding="UTF-8" standalone="no"?>
<svg
   width="26.7463"
   height="34.133301"
   viewBox="0 0 26.7463 34.133301"
   fill="none"
   version="1.1"
   id="svg40"
   xmlns="http://www.w3.org/2000/svg"
   xmlns:svg="http://www.w3.org/2000/svg">
  <path
     fill-rule="evenodd"
     clip-rule="evenodd"
     d="M 0,0 H 26.7463 V 34.1333 H 0 Z M 3.2,3.2 V 30.9333 H 23.5463 V 3.2 Z"
     fill="url(#paint0_radial_183_33)"
     id="path2"
     style="fill:url(#paint0_radial_183_33)" />
  <path
     fill-rule="evenodd"
     clip-rule="evenodd"
     d="M 13.2899,8.75032 C 9.9489,8.63687 6.38996,9.66757 2.67157,11.9642 L 0.98999,9.24168 C 5.12035,6.69057 9.29475,5.41281 13.3985,5.55216 c 4.115,0.13974 8.0187,1.70008 11.5977,4.58554 l 1.133,0.9135 -0.8024,1.2142 c -2.3594,3.5706 -6.4649,5.843 -10.2549,6.601 l -0.6275,-3.1379 c 2.655,-0.531 5.4148,-1.9624 7.2885,-4.0385 -2.7304,-1.88728 -5.5577,-2.8417 -8.443,-2.93968 z"
     fill="url(#paint1_radial_183_33)"
     id="path4"
     style="fill:url(#paint1_radial_183_33)" />
  <path
     fill-rule="evenodd"
     clip-rule="evenodd"
     d="m 18.4745,23.0458 -5.0786,-5.0786 2.2627,-2.2627 5.0786,5.0786 z"
     fill="url(#paint2_radial_183_33)"
     id="path6"
     style="fill:url(#paint2_radial_183_33)" />
  <path
     d="m 17.2974,14.2965 c 0,2.4224 -1.9637,4.3861 -4.3861,4.3861 -2.4223,0 -4.38603,-1.9637 -4.38603,-4.3861 0,-2.4223 1.96373,-4.38604 4.38603,-4.38604 2.4224,0 4.3861,1.96374 4.3861,4.38604 z m -6.378,0 c 0,1.1002 0.8918,1.992 1.9919,1.992 1.1002,0 1.992,-0.8918 1.992,-1.992 0,-1.1001 -0.8918,-1.9919 -1.992,-1.9919 -1.1001,0 -1.9919,0.8918 -1.9919,1.9919 z"
     fill="url(#paint3_radial_183_33)"
     id="path8"
     style="fill:url(#paint3_radial_183_33)" />
  <defs
     id="defs38">
    <radialGradient
       id="paint0_radial_183_33"
       cx="0"
       cy="0"
       r="1"
       gradientUnits="userSpaceOnUse"
       gradientTransform="matrix(13.373155,26.090414,-20.804271,10.663638,7.91087,10.7893)">
       <stop
          offset="0"
         stop-color="#00B2FF"
         id="stop10" />
      <stop
         offset="0.682292"
         stop-color="#794AFF"
         id="stop12" />
      <stop
         offset="1"
         stop-color="#44259A"
         id="stop14" />
    </radialGradient>
    <radialGradient
       id="paint1_radial_183_33"
       cx="0"
       cy="0"
       r="1"
       gradientUnits="userSpaceOnUse"
       gradientTransform="matrix(12.569646,10.184875,-9.7861806,12.077598,8.42554,9.75365)">
       <stop
         offset="0"
         stop-color="#00B2FF"
         id="stop17" />
      <stop
         offset="0.682292"
         stop-color="#794AFF"
         id="stop19" />
      <stop
         offset="1"
         stop-color="#44259A"
         id="stop21" />
    </radialGradient>
    <radialGradient
       id="paint2_radial_183_33"
       cx="0"
       cy="0"
       r="1"
       gradientUnits="userSpaceOnUse"
       gradientTransform="matrix(-4.5000345,-7.9999808,7.1992837,-4.0496378,20,25.5)">
       <stop
         offset="0"
         stop-color="#00B2FF"
         id="stop24" />
      <stop
         offset="0.682292"
         stop-color="#794AFF"
         id="stop26" />
      <stop
         offset="1"
         stop-color="#44259A"
         id="stop28" />
    </radialGradient>
    <radialGradient
       id="paint3_radial_183_33"
       cx="0"
       cy="0"
       r="1"
       gradientUnits="userSpaceOnUse"
       gradientTransform="matrix(4.3860659,6.7051396,-6.0340457,3.9470799,11.1198,12.6833)">
      <stop
         offset="0"
         stop-color="#00B2FF"
         id="stop31" />
      <stop
         offset="0.682292"
         stop-color="#794AFF"
         id="stop33" />
      <stop
         offset="0.876142"
         stop-color="#44259A"
         id="stop35" />
    </radialGradient>
  </defs>
</svg>
