<?xml version="1.0" encoding="UTF-8" standalone="no"?>
<!-- Created with Inkscape (http://www.inkscape.org/) -->

<svg
   width="2.6681705mm"
   height="4.3786373mm"
   viewBox="0 0 2.6681705 4.3786373"
   version="1.1"
   id="svg894"
   xmlns="http://www.w3.org/2000/svg"
   xmlns:svg="http://www.w3.org/2000/svg">
  <defs
     id="defs891" />
  <path
     style="fill:none;stroke:#000000;stroke-width:0.264583px;stroke-linecap:butt;stroke-linejoin:miter;stroke-opacity:1"
     d="M 0.133,4.156 V 0.133 H 2.5357655 L 2.536,4.156 1.332,3.5209027 Z"
     id="path1231" />
</svg>
