[
  {
    "model": "product_models.category",
    "pk": 16,
    "fields": {
      "name": "Đồ công nghệ",
      "slug": "do-cong-nghe",
      "description": "Mô tả về đồ công nghệ",
      "is_active": true,
      "meta_keywords": "",
      "meta_description": "",
      "created_at": "2023-03-05T03:52:40.973Z",
      "updated_at": "2023-03-05T13:12:33.753Z"
    }
  },
  {
    "model": "product_models.category",
    "pk": 24,
    "fields": {
      "name": "Đồ chơi",
      "slug": "do-choi",
      "description": "Mô tả về đồ chơi",
      "is_active": true,
      "meta_keywords": "",
      "meta_description": "",
      "created_at": "2023-03-05T09:47:32.367Z",
      "updated_at": "2023-03-05T09:56:56.251Z"
    }
  },
  {
    "model": "product_models.category",
    "pk": 25,
    "fields": {
      "name": "Quần áo",
      "slug": "quan-ao",
      "description": "Mô tả về quần áo",
      "is_active": true,
      "meta_keywords": "",
      "meta_description": "",
      "created_at": "2023-03-05T09:54:37.856Z",
      "updated_at": "2023-03-05T09:54:37.863Z"
    }
  },
  {
    "model": "product_models.category",
    "pk": 26,
    "fields": {
      "name": "Thể thao",
      "slug": "the-thao",
      "description": "Mô tả về thể thao",
      "is_active": true,
      "meta_keywords": "",
      "meta_description": "",
      "created_at": "2023-03-05T09:56:39.241Z",
      "updated_at": "2023-03-05T09:56:39.266Z"
    }
  },
  {
    "model": "product_models.category",
    "pk": 27,
    "fields": {
      "name": "Quà lưu niệm",
      "slug": "qua-luu-niem",
      "description": "Mô tả về quà lưu niệm",
      "is_active": true,
      "meta_keywords": "",
      "meta_description": "",
      "created_at": "2023-03-05T10:00:11.656Z",
      "updated_at": "2023-03-05T10:00:11.664Z"
    }
  },
  {
    "model": "product_models.product",
    "pk": 3,
    "fields": {
      "name": "Apple iPhone 14 Pro 128GB",
      "slug": "apple-iphone-14-pro-128gb",
      "brand": "Apple",
      "sku": "1",
      "price": 11000000,
      "old_price": 0,
      "image": "iphone-14-pro-128gb.webp",
      "is_active": true,
      "is_bestseller": false,
      "is_featured": false,
      "quantity": 1000,
      "description": "Điện thoại iPhone 14 Pro sở hữu trọng lượng 206g cùng thiết kế nhỏ gọn cho khả năng cầm nắm thoải mái. Về thông số màn hình, điện thoại được trang bị màn hình có độ phân giải 2556 x 1179 pixel và mật độ điểm ảnh 2556 x 1179 pixel mang lại khả năng hiển thị ấn tượng.",
      "meta_keywords": "test",
      "meta_description": "test",
      "created_at": "2023-03-05T16:11:10.856Z",
      "updated_at": "2023-03-06T15:17:01.798Z",
      "categories": [16]
    }
  },
  {
    "model": "product_models.product",
    "pk": 4,
    "fields": {
      "name": "Samsung Galaxy S23 Ultra 256GB",
      "slug": "samsung-galaxy-s23-ultra-256gb",
      "brand": "Samsung",
      "sku": "22",
      "price": 2699000,
      "old_price": 0,
      "image": "s23-ultra-tim_0BRqHUE.webp",
      "is_active": true,
      "is_bestseller": false,
      "is_featured": false,
      "quantity": 1000,
      "description": "Samsung Galaxy S23 Ultra là điện thoại cao cấp của hãng điện thoại Samsung được ra mắt vào đầu năm 2023. Điện thoại Samsung S23 series mới này sở hữu camera độ phân giải 200MP ấn tượng cùng một khung viền vuông vức sang trọng. Cấu hình máy cũng là một điểm nổi bật với con chip Snapdragon 8 Gen 2 mạnh mẽ, bộ nhớ RAM 8GB mang lại hiệu suất xử lý vượt trội.",
      "meta_keywords": "Meta keywords:",
      "meta_description": "Meta description:",
      "created_at": "2023-03-06T15:35:45.666Z",
      "updated_at": "2023-03-06T15:35:45.666Z",
      "categories": [27, 16]
    }
  },
  {
    "model": "product_models.product",
    "pk": 5,
    "fields": {
      "name": "Samsung Galaxy Z Flip4 128GB",
      "slug": "samsung-galaxy-z-flip4-128gb",
      "brand": "Samsung",
      "sku": "33",
      "price": 1999000,
      "old_price": 1999000,
      "image": "samsung-galaxy-z-flip4-tim.jpg",
      "is_active": true,
      "is_bestseller": false,
      "is_featured": false,
      "quantity": 2222,
      "description": "Tiếp tục là một mẫu smartphone màn hình gập độc đáo, đầy lôi cuốn và mới mẻ từ hãng công nghệ Hàn Quốc, dự kiến sẽ có tên là Samsung Galaxy Z Flip 4 với nhiều nâng cấp. Đây hứa hẹn sẽ là một siêu phẩm bùng nổ trong thời gian tới và thu hút được sự quan tâm của đông đảo người dùng với nhiều cải tiến từ ngoại hình, camera, bộ vi xử lý và viên pin được nâng cấp.",
      "meta_keywords": "Meta keywords:",
      "meta_description": "Meta description:",
      "created_at": "2023-03-06T15:37:49.128Z",
      "updated_at": "2023-03-06T15:37:49.128Z",
      "categories": [24, 16]
    }
  },
  {
    "model": "product_models.product",
    "pk": 6,
    "fields": {
      "name": "Samsung Galaxy Z Fold4",
      "slug": "samsung-galaxy-z-fold4",
      "brand": "Samsung",
      "sku": "44",
      "price": 3799000,
      "old_price": 3799000,
      "image": "samsung_galaxy_z_fold_4-4.webp",
      "is_active": true,
      "is_bestseller": false,
      "is_featured": false,
      "quantity": 3312,
      "description": "Galaxy Z Fold3 vốn đã rất nổi bật thì mới đây, sự xuất hiện của điện thoại gập mới Samsung Galaxy Z Fold 4 lại càng hấp dẫn nhiều người dùng hơn khi sở hữu thiết kế gập màn hình mới cùng với những cải tiến cho trải nghiệm nhân đôi. Vậy chiếc smartphone màn hình gập cao cấp thế hệ mới có gì mới, giá bao nhiêu và có nên mua không? Cùng tìm hiểu nhé!",
      "meta_keywords": "Meta keywords:",
      "meta_description": "Meta description:",
      "created_at": "2023-03-06T15:38:50.509Z",
      "updated_at": "2023-03-06T15:38:50.509Z",
      "categories": [26, 24, 16]
    }
  },
  {
    "model": "product_models.product",
    "pk": 7,
    "fields": {
      "name": "Heo béo mập xù Lulu Pi",
      "slug": "heo-beo-mp-xu-lulu-pi",
      "brand": "Meeko",
      "sku": "41",
      "price": 320000,
      "old_price": 320000,
      "image": "pig.webp",
      "is_active": true,
      "is_bestseller": false,
      "is_featured": false,
      "quantity": 313,
      "description": "Bé heo bông mập tròn xoe nhìn là thấy cưng liền. Chất lông mềm mịn ôm siêu êm tay. Đặc biệt bé heo còn có tạp dề đi kèm siêu cưng.\r\n\r\n* Thông tin chi tiết sản phẩm:\r\n\r\n- Công dụng: Ôm, tựa lưng, trang trí phòng ngủ, trang trí sofa, xe hơi... quà tặng siêu cấp đáng yêu gửi đến người bạn yêu thương.\r\n\r\n- Chất liệu: Lông mềm mịn, nhồi bông gòn êm ái\r\n\r\n- Kích thước:\r\n\r\n+ 35cm\r\n\r\n+ 45cm",
      "meta_keywords": "Meta keywords:",
      "meta_description": "Meta description:",
      "created_at": "2023-03-06T15:46:09.939Z",
      "updated_at": "2023-03-06T15:46:09.939Z",
      "categories": [27, 24]
    }
  },
  {
    "model": "product_models.product",
    "pk": 8,
    "fields": {
      "name": "Heo bông mập nằm ườn Lulu",
      "slug": "heo-bong-mp-nm-n-lulu",
      "brand": "Meeko",
      "sku": "22",
      "price": 320000,
      "old_price": 320000,
      "image": "pig2.webp",
      "is_active": true,
      "is_bestseller": false,
      "is_featured": false,
      "quantity": 312,
      "description": "Có bé heo mặp mặp nằm ường để ôm, để tựa lưng thì êm ái miễn bàn.\r\n\r\nLà món quà đặc biệt mềm mại, dễ thương gửi tới người thân, người yêu, bạn bè... của bạn nữa đó.\r\n\r\n* Thông tin chi tiết bé heo nằm ườn Lulu:\r\n\r\n- Chất liệu: Lông mềm mịn, bông gòn cao cấp\r\n\r\n- Kèm theo tạp dề để bé heo mặc xinh xinh\r\n\r\n- Kích thước: 45cm và 55 cm\r\n\r\nKết nạp ngay bé heo về đội quân đáng yêu ở nhà bạn thui nàooo !",
      "meta_keywords": "Meta keywords:",
      "meta_description": "Meta description:",
      "created_at": "2023-03-06T15:47:15.583Z",
      "updated_at": "2023-03-06T15:47:15.583Z",
      "categories": [27, 24]
    }
  },
  {
    "model": "product_models.product",
    "pk": 9,
    "fields": {
      "name": "Mèo bông thần tài Nami Cat",
      "slug": "meo-bong-thn-tai-nami-cat",
      "brand": "Meeko",
      "sku": "23",
      "price": 320000,
      "old_price": 320000,
      "image": "cat.webp",
      "is_active": true,
      "is_bestseller": false,
      "is_featured": false,
      "quantity": 421,
      "description": "Một bé mèo thần tài đáng yêu và siêu may mắn đó là mèo bông Shiki Nami\r\n\r\nRinh ngay bé mèo để tận hưởng sự đáng yêu này thui nào bạn ơi\r\n\r\n* Thông tin chi tiết bé mèo:\r\n\r\n- Kích thước: 42cm\r\n\r\n- Chất liệu: Bông mềm mịn, bông siêu êm\r\n\r\n- Có kèm chuông cổ may mắn",
      "meta_keywords": "Meta keywords:",
      "meta_description": "Meta description:",
      "created_at": "2023-03-06T15:48:31.317Z",
      "updated_at": "2023-03-06T15:48:31.317Z",
      "categories": [27, 24]
    }
  }
]