<?xml version="1.0" encoding="UTF-8" standalone="no"?>
<svg
   xmlns:dc="http://purl.org/dc/elements/1.1/"
   xmlns:cc="http://creativecommons.org/ns#"
   xmlns:rdf="http://www.w3.org/1999/02/22-rdf-syntax-ns#"
   xmlns:svg="http://www.w3.org/2000/svg"
   xmlns="http://www.w3.org/2000/svg"
   xmlns:sodipodi="http://sodipodi.sourceforge.net/DTD/sodipodi-0.dtd"
   xmlns:inkscape="http://www.inkscape.org/namespaces/inkscape"
   inkscape:version="1.0 (4035a4f, 2020-05-01)"
   sodipodi:docname="Logo_MAIL.svg"
   version="1.1"
   viewBox="0 0 87.18 87.18"
   data-name="Livello 1"
   id="Livello_1">
  <metadata
     id="metadata842">
    <rdf:RDF>
      <cc:Work
         rdf:about="">
        <dc:format>image/svg+xml</dc:format>
        <dc:type
           rdf:resource="http://purl.org/dc/dcmitype/StillImage" />
        <dc:title></dc:title>
      </cc:Work>
    </rdf:RDF>
  </metadata>
  <sodipodi:namedview
     inkscape:current-layer="Livello_1"
     inkscape:window-maximized="1"
     inkscape:window-y="23"
     inkscape:window-x="0"
     inkscape:cy="43.59"
     inkscape:cx="43.59"
     inkscape:zoom="8.1670108"
     showgrid="false"
     id="namedview840"
     inkscape:window-height="1155"
     inkscape:window-width="1880"
     inkscape:pageshadow="2"
     inkscape:pageopacity="0"
     guidetolerance="10"
     gridtolerance="10"
     objecttolerance="10"
     borderopacity="1"
     bordercolor="#666666"
     pagecolor="#ffffff" />
  <defs
     id="defs835">
    <style
       id="style833">.cls-1{fill:#1d1d1b;}</style>
  </defs>
  <path
     style="fill:#e5e5e5;fill-opacity:1"
     id="path837"
     d="M72.56,46.48l14.62,0,0-6-14.62,0L72,37.39l13.9-4.57-1.88-5.7-13.9,4.57L68.72,28.9l11.8-8.64L77,15.42l-11.8,8.64L63,21.85,71.51,10,66.64,6.48,58.08,18.35l-2.79-1.41L59.76,3,54,1.18,49.57,15.1l-3.09-.47L46.43,0l-6,0,0,14.63-3.09.5L32.82,1.26l-5.7,1.87L31.69,17,28.9,18.46,20.26,6.66,15.42,10.2,24.06,22l-2.21,2.22L10,15.68,6.48,20.54,18.35,29.1l-1.41,2.8L3,27.43,1.18,33.14,15.1,37.61l-.47,3.1L0,40.76l0,6,14.63,0,.5,3.09L1.26,54.37l1.87,5.69L17,55.49l1.43,2.79L6.66,66.92l3.54,4.84L22,63.12l2.22,2.21L15.68,77.19l4.86,3.51L29.1,68.84l2.8,1.41L27.43,84.17,33.14,86l4.47-13.93,3.09.48.06,14.62,6,0L46.7,72.53l3.1-.5,4.57,13.9,5.7-1.88L55.5,70.15l2.78-1.43,8.64,11.8L71.76,77l-8.64-11.8L65.33,63l11.86,8.56,3.51-4.87L68.84,58.08l1.41-2.79,13.92,4.47L86,54,72.08,49.57ZM50.22,71.84l-2-12.23a17.15,17.15,0,0,1-3.95.63l2,12.24-5.1,0,1.89-12.25a16.7,16.7,0,0,1-4-.61L37.21,71.9l-4.86-1.56,5.58-11.07a16.57,16.57,0,0,1-3.57-1.79L28.78,68.54l-4.14-3,8.73-8.81a16.48,16.48,0,0,1-2.85-2.81l-8.73,8.8-3-4.12,11-5.67A16.15,16.15,0,0,1,28,49.39l-11,5.68-1.59-4.85,12.23-2A16.06,16.06,0,0,1,27,44.28l-12.25,2,0-5.1,12.26,1.88a16.61,16.61,0,0,1,.6-3.95L15.28,37.21l1.56-4.86,11.08,5.58a16.61,16.61,0,0,1,1.78-3.58L18.64,28.78l3-4.15,8.8,8.74a16.84,16.84,0,0,1,2.81-2.85l-8.8-8.73,4.12-3,5.67,11A16.6,16.6,0,0,1,37.79,28l-5.68-11L37,15.34l2,12.24a16.63,16.63,0,0,1,3.95-.64l-2-12.24,5.11,0L44.13,26.94a16.61,16.61,0,0,1,3.95.6L50,15.28l4.86,1.56L49.25,27.92a16.61,16.61,0,0,1,3.58,1.78l5.58-11.06,4.14,3-8.73,8.8a16.78,16.78,0,0,1,2.84,2.81l8.73-8.8,3,4.12-11,5.67a17,17,0,0,1,1.81,3.56l11-5.68L71.84,37,59.61,39a17.15,17.15,0,0,1,.63,3.95l12.25-2V46L60.25,44.13a16.61,16.61,0,0,1-.61,3.95L71.9,50l-1.56,4.86L59.27,49.25a16.64,16.64,0,0,1-1.79,3.58l11.06,5.58-3,4.14-8.81-8.73a16.78,16.78,0,0,1-2.81,2.84l8.8,8.73-4.12,3L53,57.4a16.56,16.56,0,0,1-3.56,1.81l5.68,11Z"
     class="cls-1" />
</svg>
