Vorname;Nachname;Adresse;PLZ;Ort;Accountname;Passwort
V 1;Name;Str. 1;123;Ort 1;infos1;6dNcR*x
V 2;Name;Str. 2;124;Ort 2;infos2;6dNcR*x
V 3;Name;Str. 3;125;Ort 3;infos3;6dNcR*x
V 4;Name;Str. 4;126;Ort 4;infos4;6dNcR*x
V 5;Name;Str. 5;127;Ort 5;infos5;6dNcR*x
