alk	Wein	wp-2022/AA/wiki_90/12015
alk	Bier	wp-2022/AK/wiki_69/506512
alk	Schnaps	wp-2022/AB/wiki_30/17602
alk	Likör	wp-2022/AC/wiki_27/39832
alk	Wodka	wp-2022/AB/wiki_08/14462
alk	Riesling	wp-2022/AB/wiki_08/14508
alk	Rum	wp-2022/AC/wiki_33/41375
alk	Pils	wp-2022/AA/wiki_41/4167
alk	Spätburgunder	wp-2022/CD/wiki_32/9874221
alk	Cocktail	wp-2022/AC/wiki_21/38084
nonalk	Milch	wp-2022/AA/wiki_34/3391
nonalk	Cola	wp-2022/AB/wiki_14/15420
nonalk	Limonade	wp-2022/AE/wiki_47/109961
nonalk	Kaffee	wp-2022/BD/wiki_67/3948175
nonalk	Tee	wp-2022/AB/wiki_24/16696
nonalk	Mineralwasser	wp-2022/AP/wiki_56/1048028
nonalk	Saft	wp-2022/AD/wiki_31/71014
nonalk	Brause	wp-2022/AF/wiki_05/133751
nonalk	Eistee	wp-2022/AG/wiki_08/179582
nonalk	Pepsi	wp-2022/AC/wiki_12/35941