Wissenschaftler	Albert Einstein	wp-2022/AR/wiki_13/1278360
Wissenschaftler	Werner Heisenberg	wp-2022/AA/wiki_55/5647
Wissenschaftler	Niels Bohr	wp-2022/AP/wiki_91/1099385
Wissenschaftler	Max Planck	wp-2022/AA/wiki_34/3359
Wissenschaftler	Isaac Newton	wp-2022/AA/wiki_23/2348
Wissenschaftler	Johannes Kepler	wp-2022/AA/wiki_25/2555
Politiker	Konrad Adenauer	wp-2022/AA/wiki_27/2657
Politiker	Willy Brandt	wp-2022/AS/wiki_61/1518001
Politiker	Helmut Schmidt	wp-2022/AB/wiki_13/15177
Politiker	Helmut Kohl	wp-2022/AA/wiki_21/2155
Politiker	Gerhard Schröder	wp-2022/AQ/wiki_01/1116341
Politiker	Angela Merkel	wp-2022/AA/wiki_01/145
Musiker	Bon Scott	wp-2022/AE/wiki_92/128606
Musiker	David Bowie	wp-2022/AC/wiki_94/57997
Musiker	Lemmy Kilmister	wp-2022/AH/wiki_78/281059
Musiker	Janis Joplin	wp-2022/AB/wiki_46/19866
Musiker	Ronnie James Dio	wp-2022/AJ/wiki_15/377909
Musiker	John Lennon	wp-2022/BB/wiki_33/3433709
Sportler	Lothar Mathäus	wp-2022/AE/wiki_93/129341
Sportler	Boris Becker	wp-2022/AC/wiki_18/37384
Sportler	Steffi Graf	wp-2022/AD/wiki_67/81780
Sportler	Dirk Nowitzki	wp-2022/AC/wiki_88/56417
Sportler	Michael Schumacher	wp-2022/AB/wiki_01/13503
Sportler	Robert Harting	wp-2022/AY/wiki_37/2773499
