<svg xmlns="http://www.w3.org/2000/svg" width="26.597" height="24" viewBox="0 0 26.597 24">
    <g id="Group_357" data-name="Group 357" transform="translate(0 -25)">
        <g id="Group_356" data-name="Group 356" transform="translate(0 25)">
            <path id="Path_487" data-name="Path 487" d="M99.434,249H97.777a.777.777,0,0,0,0,1.554h1.658a.777.777,0,0,0,0-1.554Z" transform="translate(-91.959 -237.361)" fill="#a5b7b6" />
            <path id="Path_488" data-name="Path 488" d="M99.434,313H97.777a.777.777,0,1,0,0,1.554h1.658a.777.777,0,1,0,0-1.554Z" transform="translate(-91.959 -298.036)" fill="#a5b7b6" />
            <path id="Path_489" data-name="Path 489" d="M99.434,377H97.777a.777.777,0,1,0,0,1.554h1.658a.777.777,0,1,0,0-1.554Z" transform="translate(-91.959 -358.711)" fill="#a5b7b6" />
            <path id="Path_490" data-name="Path 490" d="M227.434,249h-1.658a.777.777,0,0,0,0,1.554h1.658a.777.777,0,0,0,0-1.554Z" transform="translate(-213.307 -237.361)" fill="#a5b7b6" />
            <path id="Path_491" data-name="Path 491" d="M227.434,313h-1.658a.777.777,0,1,0,0,1.554h1.658a.777.777,0,1,0,0-1.554Z" transform="translate(-213.307 -298.036)" fill="#a5b7b6" />
            <path id="Path_492" data-name="Path 492" d="M227.434,377h-1.658a.777.777,0,1,0,0,1.554h1.658a.777.777,0,1,0,0-1.554Z" transform="translate(-213.307 -358.711)" fill="#a5b7b6" />
            <path id="Path_493" data-name="Path 493" d="M355.434,249h-1.657a.777.777,0,1,0,0,1.554h1.657a.777.777,0,1,0,0-1.554Z" transform="translate(-334.655 -237.361)" fill="#a5b7b6" />
            <path id="Path_494" data-name="Path 494" d="M355.434,313h-1.657a.777.777,0,1,0,0,1.554h1.657a.777.777,0,1,0,0-1.554Z" transform="translate(-334.655 -298.036)" fill="#a5b7b6" />
            <path id="Path_495" data-name="Path 495" d="M355.434,377h-1.657a.777.777,0,1,0,0,1.554h1.657a.777.777,0,1,0,0-1.554Z" transform="translate(-334.655 -358.711)" fill="#a5b7b6" />
            <path
                id="Path_496"
                data-name="Path 496"
                d="M24.26,27.078H22.39v-1.3a.779.779,0,1,0-1.558,0v1.3H14.078v-1.3a.779.779,0,0,0-1.558,0v1.3H5.766v-1.3a.779.779,0,1,0-1.558,0v1.3H2.338A2.34,2.34,0,0,0,0,29.416V46.662A2.34,2.34,0,0,0,2.338,49H24.26A2.34,2.34,0,0,0,26.6,46.662V29.416A2.34,2.34,0,0,0,24.26,27.078Zm-22.7,2.338a.78.78,0,0,1,.779-.779h1.87v1.3a.779.779,0,1,0,1.558,0v-1.3h6.753v1.3a.779.779,0,1,0,1.558,0v-1.3h6.753v1.3a.779.779,0,1,0,1.558,0v-1.3h1.87a.78.78,0,0,1,.779.779v3.065H1.558Zm22.7,18.026H2.338a.78.78,0,0,1-.779-.779V34.039H25.039V46.662A.78.78,0,0,1,24.26,47.442Z"
                transform="translate(0 -25)"
                fill="#a5b7b6"
            />
        </g>
    </g>
</svg>