{
    "using_ios": false,
    "using_android": true,
    "firestore": false,
    "realtimedb": true,
    "remote_config": false,
    "messaging": true,
    "crashlytics": false,
    "crash_reporting": false,
    "storage": false,
    "facebook_auth": false,
    "google_auth": false,
    "admob": false,
    "invites": false,
    "ml_kit": false
}