sample_name,length_perc,determinant_1,determinant_2,determinant_3,roi_ref,reads,barcode
MPEG1-CRE-CAS-LINE4-B6N_1.1c,75,https://gitlab.com/l.teboul/cas9point4/-/raw/master/tests/data/dataset_1/det/cre_ref.fa,,,https://gitlab.com/l.teboul/cas9point4/-/raw/master/tests/data/dataset_1/roi_refs/Mpeg1_Cre.fa,https://gitlab.com/l.teboul/cas9point4/-/raw/master/tests/data/dataset_1/reads_sub/BC01_subset.fastq.gz,
MPEG1-CRE-CAS-LINE3-B6N_1.1d,75,https://gitlab.com/l.teboul/cas9point4/-/raw/master/tests/data/dataset_1/det/cre_ref.fa,,,https://gitlab.com/l.teboul/cas9point4/-/raw/master/tests/data/dataset_1/roi_refs/Mpeg1_Cre.fa,https://gitlab.com/l.teboul/cas9point4/-/raw/master/tests/data/dataset_1/reads_sub/BC02_subset.fastq.gz,
PRO_4274.1h,75,https://gitlab.com/l.teboul/cas9point4/-/raw/master/tests/data/dataset_1/det/cre_ref.fa,,,https://gitlab.com/l.teboul/cas9point4/-/raw/master/tests/data/dataset_1/roi_refs/Mpeg1_Cre.fa,https://gitlab.com/l.teboul/cas9point4/-/raw/master/tests/data/dataset_1/reads_sub/BC03_subset.fastq.gz,
PRO_4274.4a,75,https://gitlab.com/l.teboul/cas9point4/-/raw/master/tests/data/dataset_1/det/cre_ref.fa,,,https://gitlab.com/l.teboul/cas9point4/-/raw/master/tests/data/dataset_1/roi_refs/Mpeg1_Cre.fa,https://gitlab.com/l.teboul/cas9point4/-/raw/master/tests/data/dataset_1/reads_sub/BC04_subset.fastq.gz,
CX3CL1-FLOX-CAS-LINE1-B6N_1.1c,75,https://gitlab.com/l.teboul/cas9point4/-/raw/master/tests/data/dataset_1/det/loxp_5prime.fa,https://gitlab.com/l.teboul/cas9point4/-/raw/master/tests/data/dataset_1/det/loxp_3prime.fa,,https://gitlab.com/l.teboul/cas9point4/-/raw/master/tests/data/dataset_1/roi_refs/Cx3cl1_Flox.fa,https://gitlab.com/l.teboul/cas9point4/-/raw/master/tests/data/dataset_1/reads_sub/BC05_subset.fastq.gz,
PRO_3976.1f,75,https://gitlab.com/l.teboul/cas9point4/-/raw/master/tests/data/dataset_1/det/loxp_5prime.fa,https://gitlab.com/l.teboul/cas9point4/-/raw/master/tests/data/dataset_1/det/loxp_3prime.fa,,https://gitlab.com/l.teboul/cas9point4/-/raw/master/tests/data/dataset_1/roi_refs/Cx3cl1_Flox.fa,https://gitlab.com/l.teboul/cas9point4/-/raw/master/tests/data/dataset_1/reads_sub/BC06_subset.fastq.gz,
PRO_4264.4a,75,https://gitlab.com/l.teboul/cas9point4/-/raw/master/tests/data/dataset_1/det/loxp_5prime.fa,https://gitlab.com/l.teboul/cas9point4/-/raw/master/tests/data/dataset_1/det/loxp_3prime.fa,,https://gitlab.com/l.teboul/cas9point4/-/raw/master/tests/data/dataset_1/roi_refs/Pam_Flox.fa,https://gitlab.com/l.teboul/cas9point4/-/raw/master/tests/data/dataset_1/reads_sub/BC07_subset.fastq.gz,
PAM-FLOX-CAS-LINE1-B6N_1.1a,75,https://gitlab.com/l.teboul/cas9point4/-/raw/master/tests/data/dataset_1/det/loxp_5prime.fa,https://gitlab.com/l.teboul/cas9point4/-/raw/master/tests/data/dataset_1/det/loxp_3prime.fa,,https://gitlab.com/l.teboul/cas9point4/-/raw/master/tests/data/dataset_1/roi_refs/Pam_Flox.fa,https://gitlab.com/l.teboul/cas9point4/-/raw/master/tests/data/dataset_1/reads_sub/BC08_subset.fastq.gz,
PRO_4345.5a,75,https://gitlab.com/l.teboul/cas9point4/-/raw/master/tests/data/dataset_1/det/loxp_5prime.fa,https://gitlab.com/l.teboul/cas9point4/-/raw/master/tests/data/dataset_1/det/loxp_3prime.fa,,https://gitlab.com/l.teboul/cas9point4/-/raw/master/tests/data/dataset_1/roi_refs/Prdm8_Flox.fa,https://gitlab.com/l.teboul/cas9point4/-/raw/master/tests/data/dataset_1/reads_sub/BC09_subset.fastq.gz,
PRO_4345.3g,75,https://gitlab.com/l.teboul/cas9point4/-/raw/master/tests/data/dataset_1/det/loxp_5prime.fa,https://gitlab.com/l.teboul/cas9point4/-/raw/master/tests/data/dataset_1/det/loxp_3prime.fa,,https://gitlab.com/l.teboul/cas9point4/-/raw/master/tests/data/dataset_1/roi_refs/Prdm8_Flox.fa,https://gitlab.com/l.teboul/cas9point4/-/raw/master/tests/data/dataset_1/reads_sub/BC10_subset.fastq.gz,
PRO_4282.4e,75,https://gitlab.com/l.teboul/cas9point4/-/raw/master/tests/data/dataset_1/det/loxp_5prime.fa,https://gitlab.com/l.teboul/cas9point4/-/raw/master/tests/data/dataset_1/det/loxp_3prime.fa,,https://gitlab.com/l.teboul/cas9point4/-/raw/master/tests/data/dataset_1/roi_refs/Hnf1a_Flox.fa,https://gitlab.com/l.teboul/cas9point4/-/raw/master/tests/data/dataset_1/reads_sub/BC11_subset.fastq.gz,
