{
   "1001407065815272462": {
      "message": "ไม่สามารถเพิ่มลงใน$2​ไดรฟ์ของฉัน$1​"
   },
   "1013939682284715002": {
      "message": "จัดระเบียบ"
   },
   "1039394921418415681": {
      "message": "ลงชื่อเข้าใช้"
   },
   "1040405721361467195": {
      "message": "ใช้ปุ่มลูกศรเพื่อเลือกคำที่จะแสดงความคิดเห็น จากนั้นให้กด Shift ค้างไว้ระหว่างกดปุ่มลูกศรเพื่อขยายพื้นที่ที่เลือก แล้วใช้ปุ่ม Enter เพื่อสร้างความคิดเห็นหรือ Esc เพื่อยกเลิก"
   },
   "1055686627716339120": {
      "message": "เก็บ"
   },
   "1083918249169198626": {
      "message": "ปิดใช้แป้นพิมพ์ลัด"
   },
   "1101371910696766077": {
      "message": "ทำสำเนา"
   },
   "1122146167985532789": {
      "message": "เมื่อวาน"
   },
   "1127320433256851404": {
      "message": "โปรแกรมเล่นวิดีโอ"
   },
   "1131044617724567645": {
      "message": "บันทึกความคิดเห็นใน PDF ไปยังไฟล์แล้ว และสามารถดูได้ในแอปอื่นๆ"
   },
   "1137446830169628669": {
      "message": "เยื้องรายการแล้ว"
   },
   "1158660505977623040": {
      "message": "ลบทิ้งถาวร"
   },
   "1162642135048988280": {
      "message": "เปลี่ยนชื่อเอกสาร"
   },
   "1163324543881570799": {
      "message": "Google เอกสาร"
   },
   "1166244120191806795": {
      "message": "แสดงความคิดเห็น"
   },
   "116696227691552491": {
      "message": "เลือกสถานที่"
   },
   "1179891706526242218": {
      "message": "ถัดไป"
   },
   "1185164838496022543": {
      "message": "โปรดคลิกที่นี่เพื่อโหลดหน้าซ้ำ"
   },
   "1213005208968286932": {
      "message": "ทำเครื่องหมายว่าแก้ปัญหาแล้ว"
   },
   "1238002467849456204": {
      "message": "หากต้องการใช้การค้นหา โปรดลงชื่อเข้าใช้บัญชี G Suite ของคุณ"
   },
   "124010372300613445": {
      "message": "{numNotes,plural, =1{สร้างบันทึกที่ยกเลิกการเก็บแล้ว}other{สร้างบันทึกที่ยกเลิกการเก็บแล้ว # รายการ}}"
   },
   "1248242541854939846": {
      "message": "จัดการการแก้ไขที่ขัดแย้ง"
   },
   "124900027451629830": {
      "message": "เล่น"
   },
   "125608713654167241": {
      "message": "น้ำเงินอมเขียว"
   },
   "1256362146573583104": {
      "message": "แตกข้อมูล"
   },
   "1259492729704800881": {
      "message": "เก็บโน้ต"
   },
   "125962421212090538": {
      "message": "สัปดาห์หน้า"
   },
   "1263685395252160366": {
      "message": "LaTeX"
   },
   "1271038294394884640": {
      "message": "ยกเลิก"
   },
   "12768758038718216": {
      "message": "ตรึงโน้ตที่เก็บไว้"
   },
   "1280430284217153733": {
      "message": "เพิ่มเวลา"
   },
   "1294762503951327157": {
      "message": "ย้ายรายการที่ทำเครื่องหมายลงไปที่ด้านล่างโดยอัตโนมัติเพื่อไม่ให้เกะกะสายตา"
   },
   "1317913074512528649": {
      "message": "เก็บไอเดียดีๆ ทุกทีที่คิดได้"
   },
   "1330083198022464084": {
      "message": "สร้างโน้ตใหม่"
   },
   "1333255388111908292": {
      "message": "ของชำ"
   },
   "1335763707789999819": {
      "message": "{NUM_ITEMS,plural, =1{คุณไม่มีสิทธิ์ย้ายรายการนี้จากโฟลเดอร์ปัจจุบัน เพิ่มรายการใน {START_SPAN_1}{NAME}{END_SPAN} แทน}other{คุณไม่มีสิทธิ์ย้ายรายการเหล่านี้จากโฟลเดอร์ปัจจุบัน เพิ่มรายการใน {START_SPAN_2}{NAME}{END_SPAN} แทน}}"
   },
   "1338300799355131761": {
      "message": "โน้ตที่ไม่มีชื่อ"
   },
   "1349697396109290623": {
      "message": "กำลังแสดง $1​ ด้วยความละเอียดที่สูงขึ้น"
   },
   "1359937199332190522": {
      "message": "{NUM_ITEMS_1,plural, =0{unused plural form}=1{เพิ่ม {NUM_ITEMS_2} ไฟล์ไปที่ {XXX_1} แล้ว}other{เพิ่ม {NUM_ITEMS_2} ไฟล์ไปที่ {XXX_2} แล้ว}}"
   },
   "136335357683289450": {
      "message": "ปิด"
   },
   "1365216822837281424": {
      "message": "ส่วนขยายของ Chrome"
   },
   "1368808491835583439": {
      "message": "ม่วงเข้ม"
   },
   "1379850360723600538": {
      "message": "ไม่สนับสนุนไฟล์ที่ป้องกันด้วยรหัสผ่าน"
   },
   "1397887822627488928": {
      "message": "บุคคลหรืออีเมลที่จะแชร์"
   },
   "1419896259743862406": {
      "message": "เปิดด้วย"
   },
   "1429848477922945853": {
      "message": "โน้ตว่างเปล่า"
   },
   "1432850707344442376": {
      "message": "สร้างป้ายกำกับ $1​"
   },
   "1434081385486479995": {
      "message": "การแชร์ไม่พร้อมใช้งานในขณะนี้"
   },
   "1439211265324766071": {
      "message": "โน้ตในถังขยะ"
   },
   "1441487391064925653": {
      "message": "ดูทางลัดทั้งหมดในศูนย์ช่วยเหลือ"
   },
   "1441712877952841568": {
      "message": "แก้ไข $1​"
   },
   "1442722292947881614": {
      "message": "ประเภท"
   },
   "1446829548948002072": {
      "message": "จุลภาค (,)"
   },
   "1453330983536591773": {
      "message": "เทาอ่อน"
   },
   "1463389029497634261": {
      "message": "ลดเสียง"
   },
   "1466663154000252842": {
      "message": "บางคนอาจไม่สามารถเข้าถึงได้"
   },
   "1467797923781828000": {
      "message": "เพิ่ม $1​ รายการลงใน $2​ แล้ว"
   },
   "1473312930157933007": {
      "message": "ไม่สามารถแชร์กับผู้ใช้ต่อไปนี้ได้เนื่องจากผู้ดูแลระบบของคุณปิดการแชร์กับภายนอกโดเมน"
   },
   "1475258635371833968": {
      "message": "$2​, $1​"
   },
   "1478393252643397554": {
      "message": "ส้ม"
   },
   "1482452362096735080": {
      "message": "เกิดขึ้น {numOccurrences} ครั้ง"
   },
   "1494651568810904560": {
      "message": "ปรับแต่งค่าเริ่มต้นสำหรับการช่วยเตือน"
   },
   "1499433769420882987": {
      "message": "กำลังแสดง $1​"
   },
   "1505876360160857231": {
      "message": "$1​ TB"
   },
   "1507063529674142853": {
      "message": "ในวันสุดท้ายของเดือน"
   },
   "1507445189431379166": {
      "message": "ลบ"
   },
   "1512114410402431831": {
      "message": "รีเฟรช"
   },
   "1512454807955173272": {
      "message": "Keep จะอัปเดตเมื่อออนไลน์"
   },
   "1513178578981188988": {
      "message": "Edge"
   },
   "1532717559893630620": {
      "message": "รวมป้ายกำกับ $1​ เข้ากับ $2​ แล้ว"
   },
   "1536051766421561160": {
      "message": "เท่ากับ (=)"
   },
   "153659275234722804": {
      "message": "ปิด"
   },
   "1543499632005215694": {
      "message": "{NUM_ITEMS,plural, =0{unused plural form}=1{ตรวจพบ DLP ในไฟล์ที่อยู่ระหว่างการย้ายไปยัง \"{ADDED_PARENT_NAME}\" อาจมีข้อมูลที่ละเอียดอ่อนภายในไฟล์นี้}other{ตรวจพบ DLP ในบางไฟล์ที่อยู่ระหว่างการย้ายไปยัง\"{ADDED_PARENT_NAME}\" อาจมีข้อมูลที่ละเอียดอ่อนภายในไฟล์เหล่านี้}}"
   },
   "1568379678795589771": {
      "message": "จัตุรัส"
   },
   "1586968957182554447": {
      "message": "ปิดใช้"
   },
   "1588268697057804046": {
      "message": "$1​ ชั่วโมงที่ผ่านมา"
   },
   "1600730176972144699": {
      "message": "กด Shift + J เพื่อย้ายไปยังตำแหน่งก่อนหน้าและกด Shift + K สำหรับตำแหน่งถัดไป"
   },
   "1606998668553414638": {
      "message": "ขอรับสิทธิ์การเข้าถึง"
   },
   "1612117309990202511": {
      "message": "จุด"
   },
   "1623657263486883050": {
      "message": "ซม."
   },
   "1633798963327779260": {
      "message": "พรุ่งนี้"
   },
   "1655692513689044870": {
      "message": "คุณออกจากระบบแล้ว"
   },
   "1656911987308166143": {
      "message": "ลบ"
   },
   "1665821947855814052": {
      "message": "ขนาด"
   },
   "1675711464233426777": {
      "message": "วันนี้เวลาอื่น"
   },
   "1675900304699098572": {
      "message": "{count,plural, =1{เลิกตรึงโน้ตแล้ว}other{เลิกตรึงโน้ต # รายการแล้ว}}"
   },
   "1680617124502957636": {
      "message": "ไม่สามารถเชื่อมต่อได้ในขณะนี้ โปรดลองอีกครั้งในภายหลัง"
   },
   "1680818623013843452": {
      "message": "LucidChart"
   },
   "1683762293389974494": {
      "message": "ลบ"
   },
   "1694896269813520248": {
      "message": "เพิ่มภาพวาด"
   },
   "1697160643589236962": {
      "message": "$1​ PB"
   },
   "1703175513040690135": {
      "message": "ทุกคนใน $1​"
   },
   "1704004075228783011": {
      "message": "{every,plural, =1{เกิดซ้ำทุกเดือนในวันสุดท้ายของเดือน}other{เกิดซ้ำทุก # เดือนในวันสุดท้ายของเดือน}}"
   },
   "1711424025297585662": {
      "message": "||"
   },
   "171683163267149669": {
      "message": "$1​ GB"
   },
   "1730171019350750807": {
      "message": "ดำ"
   },
   "1737240194537729525": {
      "message": "ทุกสัปดาห์"
   },
   "1738407623218213194": {
      "message": "ไม่ระบุชื่อ"
   },
   "1739900012825270238": {
      "message": "ไปที่รายการก่อนหน้า"
   },
   "1740371341228065086": {
      "message": "โหลดซ้ำ"
   },
   "1745782414562966515": {
      "message": "ต้องการรวมป้ายกำกับ \"$1​\" เข้ากับป้ายกำกับ \"$2​\" ไหม โน้ตทั้งหมดที่มีป้ายกำกับ \"$1​\" จะเปลี่ยนไปติดป้ายกำกับ \"$2​\" แทนและป้ายกำกับ \"$1​\" จะถูกลบออกไป"
   },
   "1746512984326924716": {
      "message": "การดำเนินการนี้จะเลิกทำไม่ได้"
   },
   "1770899865480106963": {
      "message": "อุปกรณ์ Android"
   },
   "1783719421893050637": {
      "message": "ขนาด"
   },
   "178927681797742562": {
      "message": "ลงชื่อเข้าใช้"
   },
   "1790494039990261456": {
      "message": "เก็บไว้ทั้งคู่"
   },
   "1791115075948268631": {
      "message": "เปิดความช่วยเหลือสำหรับแป้นพิมพ์ลัด"
   },
   "179545118447015250": {
      "message": "มุมมองตาราง"
   },
   "1803966010993357655": {
      "message": "อื่นๆ"
   },
   "1808245543551507519": {
      "message": "Audio"
   },
   "1808500458645743749": {
      "message": "โน้ตหน้าจอล็อกจะบันทึกไปยัง Google Keep โดยอัตโนมัติ โน้ตใหม่ที่สุดจะคงอยู่บนหน้าจอล็อก"
   },
   "1810354345035313773": {
      "message": "เปิดตัวเลือกสีและขนาดของปากกาเมจิก"
   },
   "1819225489062185613": {
      "message": "อื่นๆ"
   },
   "1823222042913714987": {
      "message": "ส่งรหัสผ่าน"
   },
   "1829174126565818591": {
      "message": "Firefox"
   },
   "1830157062072535681": {
      "message": "กำลังแสดง $1​"
   },
   "1852745815330163711": {
      "message": "Google วาดเขียน"
   },
   "1857224091554117760": {
      "message": "แดง"
   },
   "1858255237143975969": {
      "message": "$2​ความเป็นส่วนตัว$1​"
   },
   "1870691479127746185": {
      "message": "ขวา"
   },
   "187077078156858455": {
      "message": "กระดาษโน้ตเสียง"
   },
   "189303170370862360": {
      "message": "$1​ จาก $2​ รายการ"
   },
   "1893171779130110098": {
      "message": "Google Assistant มาเป็นผู้ช่วยให้คุณแล้ว!"
   },
   "1900571668686750716": {
      "message": "vCard"
   },
   "1901215424950227523": {
      "message": "ไม่มีป้ายกำกับ $1​"
   },
   "1936219394601788126": {
      "message": "ระดับบนสุด"
   },
   "1938115711058331119": {
      "message": "แสดงคอลัมน์ความคิดเห็น"
   },
   "195154114623528341": {
      "message": "เพิ่มตำแหน่ง"
   },
   "1956794332842050061": {
      "message": "หน้าถัดไป"
   },
   "1965626377712226216": {
      "message": "Keynote"
   },
   "1967536906522187719": {
      "message": "พบปัญหาในการดูตัวอย่างแผ่นงานนี้"
   },
   "1968405748623909021": {
      "message": "ลองใช้แอปใดแอปหนึ่งด้านล่างเพื่อเปิดหรือแก้ไขรายการนี้"
   },
   "1969531182936822963": {
      "message": "เลิกทำการทำงานแล้ว"
   },
   "1973454937875679500": {
      "message": "ป้อนชื่อป้ายกำกับ"
   },
   "1975630610063119352": {
      "message": "{charsRemaining,plural, =1{เหลือ # อักขระ}other{เหลือ # อักขระ}}"
   },
   "1980209166254310911": {
      "message": "วัน"
   },
   "1998476658842502120": {
      "message": "กด C เพื่อเขียนโน้ตใหม่"
   },
   "200005227964332868": {
      "message": "อื่นๆ"
   },
   "2003845117979929469": {
      "message": "รายละเอียด"
   },
   "200488920523496447": {
      "message": "ซูมเข้าไปยังรายการ"
   },
   "2039757863628752523": {
      "message": "ตัวเลือกความถี่"
   },
   "205445381296663832": {
      "message": "อัปโหลดไม่สำเร็จ"
   },
   "205876860571942679": {
      "message": "Google My Maps"
   },
   "2059084517358086391": {
      "message": "ปิดแถบค้นหา"
   },
   "2061440050632248160": {
      "message": "เก็บถาวร"
   },
   "2068023589621557589": {
      "message": "TrueType Font"
   },
   "2072502213578290051": {
      "message": "หากใช้โน้ตเสร็จแล้ว ให้ใช้ปุ่ม \"เก็บ\""
   },
   "2073322475696388995": {
      "message": "ข้ามไปข้างหน้า"
   },
   "2074454463201225704": {
      "message": "รีเซ็ตระดับการซูม"
   },
   "207810168108507460": {
      "message": "$1​ ชั่วโมงที่ผ่านมา"
   },
   "2085048987351765091": {
      "message": "รับทราบ"
   },
   "2107379241532042955": {
      "message": "ตำแหน่ง"
   },
   "2109979457438465538": {
      "message": "เปิดเมนูเครื่องมือเลือกป้ายกำกับแล้ว"
   },
   "2113092209746357267": {
      "message": "Chrome"
   },
   "2118635459760443566": {
      "message": "ต่อไป"
   },
   "2119255452378336327": {
      "message": "เปลี่ยนสัญลักษณ์หัวข้อย่อยกลับไปเป็น $1​ แล้ว"
   },
   "212796670323571824": {
      "message": "ตกลง"
   },
   "214517458278879973": {
      "message": "ลงชื่อเข้าใช้เป็น $1​"
   },
   "2147952938331523160": {
      "message": "เปลี่ยนชื่อ..."
   },
   "2154372123324862271": {
      "message": "เครื่องหมายทับ (/)"
   },
   "2159130950882492111": {
      "message": "ยกเลิก"
   },
   "2166966123760559393": {
      "message": "สร้างป้ายกำกับใหม่"
   },
   "2181197458532159304": {
      "message": "{numberOfNotes,plural, =1{ทิ้งโน้ตแล้ว}other{ทิ้งโน้ต # รายการแล้ว}}"
   },
   "2184278444368405837": {
      "message": "$1​ รายการ"
   },
   "2187239650627580457": {
      "message": "ส่ง"
   },
   "2189621188983913867": {
      "message": "เชื่อมต่อแอปเพิ่มเติม"
   },
   "2190049738646901760": {
      "message": "{count,plural, =1{ลบโน้ตไหม}other{ลบโน้ตไหม}}"
   },
   "2195440644060728966": {
      "message": "{NUM_ITEMS,plural, =1{คุณกำลังย้ายโฟลเดอร์ในโฟลเดอร์หนึ่ง}other{คุณกำลังย้ายโฟลเดอร์ในโฟลเดอร์หนึ่ง}}"
   },
   "220168959069469607": {
      "message": "การทำงานเพิ่มเติม"
   },
   "2203926649090909861": {
      "message": "ย้ายรายการไปที่ $1​"
   },
   "2215890921415017560": {
      "message": "โหมดเต็มหน้าจอ"
   },
   "2216904725760458480": {
      "message": "ทุกวัน"
   },
   "221715292685577880": {
      "message": "ใช่"
   },
   "2226562046914098941": {
      "message": "ไฟล์ใหญ่เกินกว่าจะแสดงตัวอย่าง"
   },
   "2226937423434054727": {
      "message": "เลือก $1​, $2​ ถึง $3​, $4​ แล้ว"
   },
   "223198388381606871": {
      "message": "ลาเวนเดอร์"
   },
   "2264311811697505466": {
      "message": "รีเฟรช"
   },
   "2270469222412517777": {
      "message": "ไม่พบข้อความ"
   },
   "2270633624888102832": {
      "message": "เลิกตรึงโน้ต"
   },
   "2280650195464600721": {
      "message": "การนำทาง"
   },
   "2282423663539387332": {
      "message": "เร็วๆ นี้"
   },
   "2285069188138705005": {
      "message": "แอปที่เชื่อมต่อ"
   },
   "2286685488296851497": {
      "message": "{NUM_ITEMS_1,plural, =0{unused plural form}=1{คุณกำลังย้าย 1 รายการออกจากโฟลเดอร์ที่แชร์ \"{SHARED_FOLDER_NAME}\" ซึ่งจะทำให้คนอื่นเสียสิทธิ์การเข้าถึง}other{คุณกำลังย้าย {NUM_ITEMS_2} รายการออกจากโฟลเดอร์ที่แชร์ \"{SHARED_FOLDER_NAME}\" ซึ่งจะทำให้คนอื่นเสียสิทธิ์การเข้าถึง}}"
   },
   "228741435562395266": {
      "message": "ยังไม่สามารถพิมพ์ได้"
   },
   "2289534534793293486": {
      "message": "ยกเลิกการเก็บ"
   },
   "2289812403593835836": {
      "message": "Pages"
   },
   "229177484946387188": {
      "message": "Google Earth"
   },
   "2292696732672795285": {
      "message": "เพิ่มเสียง"
   },
   "2299671629154778581": {
      "message": "เลิกตรึงและเก็บโน้ตแล้ว"
   },
   "2308018963132768704": {
      "message": "ขนาด 4"
   },
   "2310145944356900158": {
      "message": "เสร็จแล้ว"
   },
   "2311880726221661199": {
      "message": "กำลังโหลดความละเอียดที่สูงกว่า"
   },
   "2323249770683736002": {
      "message": "สร้างป้ายกำกับใหม่"
   },
   "2324955914430674498": {
      "message": "ไม่มีผลการค้นหาสำหรับ \"$1​\""
   },
   "2346361265476305332": {
      "message": "เจ้าของป้องกันไม่ให้ดาวน์โหลดไฟล์เสียงนี้"
   },
   "2357623745116912085": {
      "message": "{NUM_ITEMS,plural, =0{unused plural form}=1{สมาชิกของ \"{TEAM_DRIVE_NAME}\" จะเสียสิทธิ์การเข้าถึง เว้นแต่ว่าจะมีการแชร์รายการนี้ให้}other{สมาชิกของ \"{TEAM_DRIVE_NAME}\" จะเสียสิทธิ์การเข้าถึง เว้นแต่ว่าจะมีการแชร์รายการเหล่านี้ให้}}"
   },
   "2357761837816388330": {
      "message": "ออฟไลน์"
   },
   "2359614137862708172": {
      "message": "Shift"
   },
   "2364374826543847335": {
      "message": "นำแหล่งที่มาออก"
   },
   "236689092839978781": {
      "message": "ไม่เกิดซ้ำ"
   },
   "2370656573843123707": {
      "message": "วงเล็บปิด"
   },
   "2373760032138505521": {
      "message": "มีป้ายกำกับนี้อยู่แล้ว"
   },
   "2386536768112358461": {
      "message": "Pg-Down"
   },
   "2396804279177914769": {
      "message": "โอนการเป็นเจ้าของให้ไดรฟ์ของทีมใช่ไหม"
   },
   "2402010336938670264": {
      "message": "เริ่มวาดด้วยปลายนิ้วหรือใช้สไตลัสเขียนโน้ตด้วยลายมือ"
   },
   "2405795704816921421": {
      "message": "ไฟล์ $1​"
   },
   "2408383448126741628": {
      "message": "ระยะเวลา"
   },
   "2408933271548524782": {
      "message": "ล็อกแล้ว"
   },
   "2423364695613735749": {
      "message": "กด L เพื่อสร้างรายการใหม่"
   },
   "2423877407428530040": {
      "message": "ไฟล์มีแผนภูมิมากเกินไป"
   },
   "2433429041384246549": {
      "message": "ปิดเสียง"
   },
   "2438741853303074449": {
      "message": "ครั้ง"
   },
   "2444198666025646119": {
      "message": "ม่วงอมน้ำเงิน"
   },
   "2449254824382583885": {
      "message": "จอใหญ่"
   },
   "2452145367257933677": {
      "message": "เลิกทำ"
   },
   "2452522051596946166": {
      "message": "อ้าว! เกิดปัญหาในการแสดงตัวอย่าง $1​ กำลังลองใหม่"
   },
   "2454642351139428112": {
      "message": "เลิกทำ"
   },
   "2466251465475184755": {
      "message": "หากล้างข้อมูลในถังขยะ โน้ตทั้งหมดในถังขยะจะถูกลบทิ้งถาวร"
   },
   "246828342952819465": {
      "message": "บันทึกความคิดของคุณ $1​ จากอุปกรณ์ใดก็ได้"
   },
   "2475181823688399272": {
      "message": "ถัดไป"
   },
   "2478862372619762755": {
      "message": "ไฮไลต์พื้นที่เพื่อแสดงความคิดเห็น"
   },
   "2483363439634684283": {
      "message": "ขนาด 20"
   },
   "2494928104701250542": {
      "message": "ตรึงโน้ตและตั้งค่าการช่วยเตือนเพื่อให้ไม่พลาดสิ่งที่สำคัญ"
   },
   "2504232652631703202": {
      "message": "เชื่อมต่อแล้ว"
   },
   "2509141182388535183": {
      "message": "ดู"
   },
   "251025074207413762": {
      "message": "เพิ่มคำอธิบาย"
   },
   "2525633490863427854": {
      "message": "ทำซ้ำ"
   },
   "2527534830196374788": {
      "message": "Ctrl"
   },
   "2532280782491328445": {
      "message": "ค้นหาก่อนหน้านี้"
   },
   "2542788471536661524": {
      "message": "วางภาพที่นี่"
   },
   "2555961950726197809": {
      "message": "กำลังแสดงโปรแกรมดูเอกสาร"
   },
   "2562881166530755046": {
      "message": "วาดเขียน"
   },
   "257317112834806705": {
      "message": "สลับระหว่างมุมมองแบบรายการและแบบตาราง"
   },
   "2579261044590673579": {
      "message": "ไดรฟ์ของฉัน"
   },
   "2579679351920691492": {
      "message": "ข้ามไปข้างหลัง"
   },
   "2584557103820423944": {
      "message": "เยื้อง/ปลดการเยื้องที่รายการ"
   },
   "2600731575260427177": {
      "message": "ไม่มีไฟล์และอาจถูกลบไปแล้ว โปรดลองอัปโหลดไฟล์อีกครั้ง"
   },
   "2601304136110057215": {
      "message": "ภาพวาดใหม่"
   },
   "2604527707881848686": {
      "message": "ลดระยะเยื้องรายการนี้ไม่ได้อีกแล้ว"
   },
   "2609409316752026806": {
      "message": "PDF"
   },
   "2623861453769098676": {
      "message": "เกิดปัญหาในการแสดงตัวอย่างเอกสารนี้"
   },
   "2626653026098396543": {
      "message": "{NUM_ITEMS,plural, =0{Unused}=1{การย้ายรายการนี้จะเป็นการแชร์กับทุกคนที่มองเห็นโฟลเดอร์ที่แชร์ \"{SHARED_FOLDER_NAME}\"}other{การย้ายรายการเหล่านี้จะเป็นการแชร์กับทุกคนที่มองเห็นโฟลเดอร์ที่แชร์ \"{SHARED_FOLDER_NAME}\"}}"
   },
   "2630254198275172065": {
      "message": "ย้ายไปที่..."
   },
   "2632263751512428257": {
      "message": "ทุกปี"
   },
   "2632538140519286364": {
      "message": "โน้ตในถังขยะจะถูกลบหลังจาก 7 วัน"
   },
   "2645469029410848421": {
      "message": "{noteCount,plural, =1{ติดป้ายกำกับให้โน้ต}other{ติดป้ายกำกับให้โน้ต}}"
   },
   "2661850177130037208": {
      "message": "เปิดรายการ"
   },
   "2680303811435018716": {
      "message": "ไม่สามารถเพิ่มรายการได้อีก"
   },
   "2681830832355823748": {
      "message": "ค้นหาทางลัดทั้งหมด"
   },
   "268402507078609011": {
      "message": "{imagesAdded,plural, =1{เพิ่มรูปแล้ว}other{เพิ่มแล้ว # รูป}}"
   },
   "2704959686524436777": {
      "message": "กำลังโหลด"
   },
   "2713989182797848963": {
      "message": "สร้างภาพวาดและโน้ตที่เขียนด้วยลายมือ"
   },
   "2715199780155065699": {
      "message": "ไฟล์มีรูปร่าง กล่องข้อความ หรือภาพวาดมากเกินไป"
   },
   "2716433087531258659": {
      "message": "เลื่อนหน้าขึ้น"
   },
   "2719125961689709460": {
      "message": "บันทึก"
   },
   "2742719907061406418": {
      "message": "XML"
   },
   "2758125083752925237": {
      "message": "(เจ้าของ)"
   },
   "2760106082595028595": {
      "message": "โน้ตมีขนาดใหญ่เกินไป"
   },
   "277430914014962533": {
      "message": "อ้าว! เกิดปัญหาในการแสดงตัวอย่าง $1​"
   },
   "2777453609143551768": {
      "message": "ควบคุมระดับเสียง"
   },
   "2793841261389879255": {
      "message": "หน้าที่แล้ว"
   },
   "2794676336056877832": {
      "message": "{every,plural, =1{เกิดซ้ำทุกเดือนในวันเดียวกันของแต่ละเดือน}other{เกิดซ้ำทุก # เดือนในวันเดียวกันของแต่ละเดีอน}}"
   },
   "2798322202738486782": {
      "message": "{HOURS,plural, =0{0 ชั่วโมง }=1{1 ชั่วโมง }other{# ชั่วโมง }}{MINUTES,plural, =0{0 นาที }=1{1 นาที }other{# นาที }}{SECONDS,plural, =0{0 วินาที}=1{1 วินาที}other{# วินาที}}"
   },
   "2803553109654833664": {
      "message": "ชมพู"
   },
   "2814354342017225342": {
      "message": "แสดงตัวอย่างลิงก์ที่มีการจัดรูปแบบ"
   },
   "2818020101821669029": {
      "message": "สร้าง"
   },
   "2820045170951016567": {
      "message": "การเตือนความจำ"
   },
   "2823533464825550362": {
      "message": "การควบคุมเอกสาร"
   },
   "2827039933590757722": {
      "message": "Windows Shortcut"
   },
   "2828060233316503200": {
      "message": "{NUM_ITEMS_1,plural, =0{unused plural form}=1{ย้าย {NUM_ITEMS_2} รายการจาก {XXX_1} ไปที่ {XXX_2} แล้ว}other{ย้าย {NUM_ITEMS_2} รายการจาก {XXX_3} ไปที่ {XXX_4} แล้ว}}"
   },
   "2829226075651806940": {
      "message": "ซูมเข้า"
   },
   "2842462703735289745": {
      "message": "ทุกคนที่เห็นโฟลเดอร์ที่แชร์ \"$1​\" จะมีสิทธิ์เข้าถึงได้"
   },
   "2853036885874864031": {
      "message": "การเป็นเจ้าของจะโอนไปที่ $1​"
   },
   "2854717396594966319": {
      "message": "OpenOffice Writer"
   },
   "2873089307546162154": {
      "message": "ตกลง"
   },
   "2877285560485318801": {
      "message": "หยุดชั่วคราว"
   },
   "2879276552944958066": {
      "message": "กลับไปยังโฟลเดอร์ $1​"
   },
   "2886313667612471214": {
      "message": "จำเป็นต้องรีเฟรช อาจใช้เวลาหลายนาที"
   },
   "2893055432094515558": {
      "message": "แสดงช่องทำเครื่องหมายแล้ว"
   },
   "289798573180023043": {
      "message": "ตกลง"
   },
   "2901360496423912565": {
      "message": "รายงาน"
   },
   "2908917161758545146": {
      "message": "{count,plural, =1{เลิกตรึงและเก็บโน้ตแล้ว}other{เลิกตรึงและเก็บโน้ต # รายการแล้ว}}"
   },
   "2935193106137642160": {
      "message": "ไม่สามารถซูมได้"
   },
   "2942094715879803305": {
      "message": "ลบรายการที่เลือก"
   },
   "295331174171409695": {
      "message": "เกิดปัญหาในการอัปเดตสิทธิ์ในการดาวน์โหลดของ \"$1​\""
   },
   "2960516445247616550": {
      "message": "ไม่สามารถพิมพ์ได้"
   },
   "296391753033307868": {
      "message": "สร้างป้ายกำกับ $1​ และเพิ่มให้กับโน้ตแล้ว"
   },
   "2964778642459027786": {
      "message": "ไม่มีโน้ตในถังขยะ"
   },
   "2971623719720688041": {
      "message": "เลิกทำการทำงานแล้ว"
   },
   "2973306402585941108": {
      "message": "เช้า"
   },
   "2983318659047499045": {
      "message": "การช่วยเตือน"
   },
   "298817883481775869": {
      "message": "กำลังโหลด..."
   },
   "2990497076082409431": {
      "message": "ย้าย \"$1​\" ไปที่ $2​ แล้ว"
   },
   "2993901764282547916": {
      "message": "App Maker"
   },
   "3005058076425755361": {
      "message": "Backspace"
   },
   "3018905429279095639": {
      "message": "{NUM_ITEMS,plural, =1{คุณไม่มีสิทธิ์ย้ายโฟลเดอร์นี้จากโฟลเดอร์ปัจจุบัน เพิ่มโฟลเดอร์ไปที่ {START_SPAN_1}{NAME}{END_SPAN} แทน}other{คุณไม่มีสิทธิ์ย้ายโฟลเดอร์เหล่านี้จากโฟลเดอร์ปัจจุบัน เพิ่มโฟลเดอร์ไปที่ {START_SPAN_2}{NAME}{END_SPAN} แทน}}"
   },
   "3043961722025425136": {
      "message": "คำอธิบาย"
   },
   "304438440663479110": {
      "message": "ทางลัดสเปรดชีตที่เข้ากันได้"
   },
   "306516303501625305": {
      "message": "การตรวจสอบสิทธิ์ล้มเหลว"
   },
   "3074915509081765994": {
      "message": "iPhone และ iPad"
   },
   "3108098439469164127": {
      "message": "เปิดภาพวาดใหม่แล้ว"
   },
   "3109321241584918345": {
      "message": "เชื่อมต่อแอปเพิ่มเติม..."
   },
   "3121560585545725724": {
      "message": "$1​, $2​"
   },
   "3140236589681731084": {
      "message": "ใน $1​ ชั่วโมง"
   },
   "3147722095652727387": {
      "message": "ไม่สามารถแชร์กับผู้ใช้ต่อไปนี้ได้เนื่องจากผู้ดูแลระบบของผู้ใช้เหล่านี้ปิดการแชร์กับโดเมนของตน หรือผู้ดูแลระบบของคุณปิดการแชร์กับภายนอกโดเมน"
   },
   "3150651996344750990": {
      "message": "{count,plural, =1{ยกเลิกการเก็บโน้ตแล้ว}other{ยกเลิกการเก็บโน้ต # รายการแล้ว}}"
   },
   "3167198321908629554": {
      "message": "กำลังรีเฟรชและโหลดโน้ตใหม่..."
   },
   "3176246635438298155": {
      "message": "ลบ"
   },
   "3187117482772485385": {
      "message": "กำลังสร้างภาพขนาดย่อ..."
   },
   "3189854932778515441": {
      "message": "โน้ตในที่เก็บถาวร"
   },
   "3190546672187601036": {
      "message": "กลางคืน"
   },
   "3195812604657128345": {
      "message": "เลือกโฟลเดอร์ในไดรฟ์สำหรับใส่ไฟล์ที่แยก"
   },
   "32059145043728507": {
      "message": "{numberOfNotes,plural, =1{กู้คืนโน้ตแล้ว}other{กู้คืนโน้ต # รายการแล้ว}}"
   },
   "3207650089232728475": {
      "message": "เปลี่ยนป้ายกำกับ"
   },
   "3211163842850942567": {
      "message": "ซูมเข้า"
   },
   "3217354672216773127": {
      "message": "เริ่มทำงานเมื่อ $1​"
   },
   "3220641589840600333": {
      "message": "เปลี่ยนเป็นมุมมอง $1​ แล้ว"
   },
   "3241696131593027453": {
      "message": "เลือกโน้ต"
   },
   "3243916603465112517": {
      "message": "น้อยลง"
   },
   "3249966726137025950": {
      "message": "กลุ่มครอบครัวของผู้ทำงานร่วมกัน"
   },
   "3250489229749307913": {
      "message": "ePub"
   },
   "3258100527833044153": {
      "message": "ยกเลิกภาพวาดที่ว่างเปล่าแล้ว"
   },
   "3261131345401321392": {
      "message": "แสดงความคิดเห็นได้"
   },
   "3266448715145955862": {
      "message": "เลิกเก็บและตรึงโน้ตแล้ว"
   },
   "3272496516667407797": {
      "message": "เกิดปัญหาในการโหลดรายละเอียด"
   },
   "3278046126264096288": {
      "message": "สัปดาห์"
   },
   "3281684668260174833": {
      "message": "{numberOfNotes,plural, =1{เลิกตรึงและทิ้งโน้ตแล้ว}other{เลิกตรึงและทิ้งโน้ต # รายการแล้ว}}"
   },
   "3288498486633948368": {
      "message": "เพิ่ม \"$1​\" ไปยัง Google ไดรฟ์แล้ว"
   },
   "330603631583186798": {
      "message": "Word"
   },
   "3308935528045767909": {
      "message": "โน้ตใหม่พร้อมภาพวาด"
   },
   "3312545971976531405": {
      "message": "Message"
   },
   "3325094738421414114": {
      "message": "กด X เพื่อเพิ่มหรือนำโน้ตออกจากชุดของโน้ตที่เลือกไว้"
   },
   "3345567742278474807": {
      "message": "โน้ตนี้ได้รับแจ้งว่าไม่เหมาะสมและไม่สามารถแชร์ได้"
   },
   "3348057264663626000": {
      "message": "เลื่อนการเลือกขึ้นแล้ว"
   },
   "3354260708176476985": {
      "message": "กำลังโหลด…"
   },
   "3362903141674317449": {
      "message": "ผู้ทำงานร่วมกัน"
   },
   "3371033609268806242": {
      "message": "ลบป้ายกำกับ $1​ แล้ว"
   },
   "3378875258397512442": {
      "message": "ตั้งค่าช่วยเตือนในโน้ตสำหรับสถานที่และเวลา สร้างโน้ตเสียง และทำงานแบบออนไลน์หรือออฟไลน์"
   },
   "3381619429606029445": {
      "message": "Visio"
   },
   "3382236845597426718": {
      "message": "เปิด"
   },
   "3385831848537487538": {
      "message": "ท่องเที่ยว"
   },
   "3409257542937182842": {
      "message": "กำลังลองใหม่..."
   },
   "3409483962000136213": {
      "message": "เล่น/หยุดชั่วคราว"
   },
   "3418677553313974490": {
      "message": "ถังขยะ"
   },
   "3418767079436101103": {
      "message": "เกิดปัญหาในการโหลดหน้านี้"
   },
   "3419821606494999471": {
      "message": "จัดการการแจ้งเตือนเมื่อมีความคิดเห็นใหม่"
   },
   "3435089737264042207": {
      "message": "เปิด"
   },
   "3437227878928998987": {
      "message": "สร้างรายการ"
   },
   "3447704623213039325": {
      "message": "รายการของชำ"
   },
   "3448234415275521882": {
      "message": "ข้อมูลทั่วไป"
   },
   "3451851833460018584": {
      "message": "{NUM_COMMENTS,plural, =0{ไม่มีความคิดเห็น}=1{1 ความคิดเห็น}other{# ความคิดเห็น}}"
   },
   "3455405209271884570": {
      "message": "แตกข้อมูล"
   },
   "345585899501260401": {
      "message": "พิกเซล"
   },
   "345718983715470367": {
      "message": "แหล่งที่มา"
   },
   "3462556632501534753": {
      "message": "$2​ใบอนุญาตโอเพนซอร์ส$1​"
   },
   "3468441711253011521": {
      "message": "Google ชีต"
   },
   "3473620774713000513": {
      "message": "แก้ไขแล้ว"
   },
   "3478630283627055305": {
      "message": "กด Escape เพื่อหยุดแก้ไขโน้ต"
   },
   "3485469306694683931": {
      "message": "แตกข้อมูลไปยังบัญชีไดรฟ์ของคุณ"
   },
   "3487924397596265480": {
      "message": "เลือก $1​ แล้ว"
   },
   "3493932452507671194": {
      "message": "กด $1​ + วงเล็บเหลี่ยมแบบปิดเพื่อเยื้องรายการและกด $1​ + วงเล็บเหลี่ยมแบบเปิดเพื่อปลดการเยื้องรายการ"
   },
   "3496410038494993160": {
      "message": "แป้นพิมพ์ลัดที่นิยม"
   },
   "3518073392823563581": {
      "message": "แป้นพิมพ์ลัด"
   },
   "3528739824697875943": {
      "message": "รายการ"
   },
   "3544847661620838201": {
      "message": "ลองใช้เลย! คุณค้นหาโน้ตในภายหลังได้เสมอ"
   },
   "3549581437554274388": {
      "message": "เลื่อนการเลือกไปด้านขวาแล้ว"
   },
   "3551522853788442530": {
      "message": "ย้อนกลับ"
   },
   "3551608745198442336": {
      "message": "ภาพวาดที่ $1​/$2​"
   },
   "3553997866738769437": {
      "message": "แก้ไขภาพวาด"
   },
   "3555297636767750285": {
      "message": "เขียว"
   },
   "3561658662634401836": {
      "message": "ชื่อ"
   },
   "3569884090205828853": {
      "message": "OpenOffice Calc"
   },
   "3570074492517305433": {
      "message": "ลงชื่อสมัครใช้งาน"
   },
   "3571391964903695725": {
      "message": "เกิดซ้ำ"
   },
   "3571704286086017611": {
      "message": "ลบการช่วยเตือนแล้ว"
   },
   "3574963906259719128": {
      "message": "เบราว์เซอร์ของคุณไม่สามารถเล่นไฟล์เสียงนี้ได้"
   },
   "3580243353280636963": {
      "message": "เลือกวันที่และเวลา"
   },
   "3595000514985906359": {
      "message": "Excel"
   },
   "3595562664731337243": {
      "message": "เปลี่ยนชื่อป้ายกำกับ"
   },
   "3603931013946597836": {
      "message": "{NUM_ITEMS,plural, =1{คุณกำลังย้ายไฟล์ใน {NUM_PARENTS} โฟลเดอร์}other{คุณกำลังย้ายไฟล์ใน {NUM_PARENTS} โฟลเดอร์}}"
   },
   "3608521102844050208": {
      "message": "การแจ้งเตือน:"
   },
   "3608606849109645545": {
      "message": "ป้อนชื่อเอกสารใหม่:"
   },
   "3609912631958780352": {
      "message": "ปากกาเขียนลายมือ"
   },
   "3611573349633408445": {
      "message": "ดาวน์โหลด"
   },
   "3612936866865912552": {
      "message": "กำลังโหลด..."
   },
   "3617727970098875990": {
      "message": "ค้นหาแป้นพิมพ์ลัดทั้งหมด"
   },
   "362521762755836201": {
      "message": "สร้างเมื่อ $1​"
   },
   "3634885664399305142": {
      "message": "ภาพวาดไม่พร้อมใช้งาน"
   },
   "3651893685901703652": {
      "message": "..."
   },
   "3657386785336906042": {
      "message": "Backslash (\\)"
   },
   "3659554681396757189": {
      "message": "เปิดโดยฉัน"
   },
   "366289214151975122": {
      "message": "ทุกคนใน $1​ ที่มีลิงก์"
   },
   "3663571259791438207": {
      "message": "รายงานการละเมิด"
   },
   "3664842788764635265": {
      "message": "ไม่มี"
   },
   "3666123569747918021": {
      "message": "เอกสารนี้มีการเปลี่ยนแปลงที่ยังไม่ได้บันทึก คุณต้องการออกจากหน้านี้และยกเลิกการเปลี่ยนแปลงไหม"
   },
   "3678477908297567934": {
      "message": "ขีดเส้นใต้ (_)"
   },
   "3684032082082645570": {
      "message": "{count,plural, =1{เลือกสีเพื่อใช้กับโน้ต}other{เลือกสีเพื่อใช้กับโน้ต}}"
   },
   "3690515530505404607": {
      "message": "เกิดปัญหาในการเล่นวิดีโอนี้"
   },
   "369764661829607970": {
      "message": "{NUM_ITEMS,plural, =0{ไม่มีรายการ}=1{1 รายการ}other{# รายการ}}"
   },
   "3703024996011822310": {
      "message": "ยินดีต้อนรับสู่ Google Keep"
   },
   "3712215972250917265": {
      "message": "ความคิดเห็น"
   },
   "3721649886572275931": {
      "message": "ขนาด 8"
   },
   "372633345629975481": {
      "message": "ตรึงโน้ตแล้ว"
   },
   "372823375470132483": {
      "message": "ยกเลิกการเลือกโน้ตที่อยู่ในถังขยะ"
   },
   "3734444903221631913": {
      "message": "{NUM_ITEMS_1,plural, =0{unused plural form}=1{unused plural form}other{คุณกำลังย้าย {NUM_ITEMS_2} รายการออกจากไดรฟ์ของทีมและโฟลเดอร์ที่แชร์ ซึ่งจะทำให้คนอื่นเสียสิทธิ์การเข้าถึง}}"
   },
   "3751183760611784323": {
      "message": "ซูมเพื่อให้รายการพอดีกับความกว้างของหน้าจอ"
   },
   "3768927257183755959": {
      "message": "บันทึก"
   },
   "3787959261309150430": {
      "message": "หากต้องการวาดเส้น ให้คลิกไอคอนปากกา"
   },
   "3793086499925031123": {
      "message": "เปิดแถบค้นหา/ค้นหาก่อนหน้า"
   },
   "3796511349428373407": {
      "message": "ตัวเลือกวันที่"
   },
   "37992665410817181": {
      "message": "ถูกเปิดอีกครั้ง"
   },
   "3801617971018550169": {
      "message": "เมื่อวานนี้"
   },
   "381100310424863459": {
      "message": "Illustrator"
   },
   "3827179818223863356": {
      "message": "เขียวอ่อน"
   },
   "3845302429676793049": {
      "message": "เกิดปัญหาในการอัปเดตรายละเอียดของ \"$1​\""
   },
   "3847612745046208693": {
      "message": "รับทราบ"
   },
   "3852386690131857488": {
      "message": "เปิดใช้การแชร์"
   },
   "3856960241878617076": {
      "message": "กำลังโหลดความคิดเห็น โปรดรอสักครู่"
   },
   "3858324058837632381": {
      "message": "เกิดปัญหาในการเล่นไฟล์เสียงนี้"
   },
   "3869166581651870488": {
      "message": "แก้ไขเสร็จสิ้นแล้ว"
   },
   "3874597373619381607": {
      "message": "แสดงความคิดเห็นที่แก้ไขปัญหาแล้ว"
   },
   "3877974536163446728": {
      "message": "เลือก $1​, $2​ แล้ว"
   },
   "3888733084985311515": {
      "message": "มีกลุ่มครอบครัว"
   },
   "3897281533382850749": {
      "message": "เปิดเสียง"
   },
   "3907816292084809686": {
      "message": "ดำเนินการซ้ำอีกครั้ง"
   },
   "3909380459614154542": {
      "message": "ไปที่ลิงก์"
   },
   "3952341864324097024": {
      "message": "ล้างการค้นหา"
   },
   "3955575370175991097": {
      "message": "เปลี่ยนเป็นมุมมองป้ายกำกับ $1​ แล้ว"
   },
   "395680759377627007": {
      "message": "สร้าง \"$3​$2​$1​\""
   },
   "397098723873502323": {
      "message": "เสร็จสิ้น"
   },
   "3974822583047850066": {
      "message": "ยกเลิก"
   },
   "3977699855735576796": {
      "message": "เกิดปัญหาในการโหลดหน้าเพิ่ม"
   },
   "3981269900634596036": {
      "message": "{numberOfNotes,plural, =1{ลบบันทึก}other{ลบบันทึก}}"
   },
   "3988418762222300024": {
      "message": "มหัพภาค (.)"
   },
   "3989925953740167133": {
      "message": "Google Keep ต้องการใช้ข้อมูลตำแหน่งของคุณเพื่อปรับปรุงคำแนะนำสถานที่ของการแจ้งเตือนตำแหน่ง"
   },
   "4005725939358875643": {
      "message": "เลิกทำแล้ว"
   },
   "4020393055976236243": {
      "message": "การเป็นเจ้าของจะโอนจาก \"$3​\" ใน $2​ ให้ $1​"
   },
   "4023299615382814997": {
      "message": "ไม่สามารถแก้ไขในถังขยะ"
   },
   "4036523543547629779": {
      "message": "รูปภาพ"
   },
   "4044915502415235332": {
      "message": "เลือกโน้ตที่ตรึงไว้"
   },
   "4052960606031736645": {
      "message": "{NUM_ITEMS,plural, =1{คุณกำลังย้ายโฟลเดอร์ใน {NUM_PARENTS} โฟลเดอร์}other{คุณกำลังย้ายโฟลเดอร์ใน {NUM_PARENTS} โฟลเดอร์}}"
   },
   "4061102590585232601": {
      "message": "นำ $1​ ออกแล้ว"
   },
   "4064820890482961434": {
      "message": "แสดงช่องทำเครื่องหมาย"
   },
   "4072353527895477784": {
      "message": "บุคคล"
   },
   "407982090576503781": {
      "message": "ย้ายไปที่ไดรฟ์ของฉันใช่ไหม"
   },
   "4081524305222967804": {
      "message": "น้ำเงินอมเขียว"
   },
   "4085493778209859942": {
      "message": "เล่นเลย"
   },
   "4097921967754832323": {
      "message": "ยัติภังค์ (-)"
   },
   "411137507354526852": {
      "message": "เดือน"
   },
   "4111452225725405610": {
      "message": "นำดาวออกจาก \"$1​\" แล้ว"
   },
   "4117632433281998979": {
      "message": "ทุกเดือน"
   },
   "4122858386674768321": {
      "message": "ย้ายจาก $3​$2​$1​"
   },
   "4145164831312518309": {
      "message": "กด @ เพื่อส่งความคิดเห็น"
   },
   "4155905925766040098": {
      "message": "ไม่มีตัวอย่าง"
   },
   "4157091150222353401": {
      "message": "บันทึกความคิดเห็นไปยังไฟล์ DOCX, PPTX และ XLSX แล้ว และสามารถดูได้ใน Microsoft Office"
   },
   "4167720915844687374": {
      "message": "หากต้องการลบสิ่งที่วาด ให้คลิกยางลบ"
   },
   "4174786386751618325": {
      "message": "โน้ตรูปภาพ"
   },
   "4182427157920112948": {
      "message": "Tilde (~)"
   },
   "4186465168527990324": {
      "message": "แยกข้อมูล \"$1​\" ไปที่ $2​ สำเร็จแล้ว"
   },
   "4191000901158114852": {
      "message": "Google Keep"
   },
   "4204345954541079744": {
      "message": "ยังไม่มีโน้ตที่มีป้ายกำกับนี้"
   },
   "4206529410529166231": {
      "message": "{NUM_ITEMS,plural, =1{คุณกำลังย้ายรายการใน {NUM_PARENTS} โฟลเดอร์}other{คุณกำลังย้ายรายการใน {NUM_PARENTS} โฟลเดอร์}}"
   },
   "4209658291185545281": {
      "message": "ไม่สามารถเลิกทำการทำงานได้"
   },
   "4211182812451835307": {
      "message": "แก้ไขได้"
   },
   "4214190403999219403": {
      "message": "ซูม"
   },
   "4216242742234357612": {
      "message": "เลือกโน้ตทั้งหมด"
   },
   "4216628828665009319": {
      "message": "เขียวอะโวคาโด"
   },
   "4228870062013120023": {
      "message": "ไปยังโน้ตถัดไป/ก่อนหน้า"
   },
   "4230101516585408149": {
      "message": "เขียนโน้ตใหม่"
   },
   "4239183034054216803": {
      "message": "น้ำตาล"
   },
   "4243437721135025638": {
      "message": "คุณไม่มีสิทธิ์ย้ายไฟล์ในไดรฟ์ของทีมนี้"
   },
   "4267845092591696061": {
      "message": "ติดดาว/ยกเลิกการติดดาวรายการที่เลือก"
   },
   "426927371216979233": {
      "message": "กฎ"
   },
   "4280747719095153198": {
      "message": "ความคิดเห็นที่แก้ไขแล้ว"
   },
   "4293996570221590891": {
      "message": "ขาว"
   },
   "4296310694082659873": {
      "message": "ยางลบ"
   },
   "4299690446455033653": {
      "message": "Works"
   },
   "4310202846681054741": {
      "message": "{numberOfPreviews,plural, =1{นำตัวอย่างลิงก์ออกแล้ว}other{นำตัวอย่างลิงก์ # รายการออกแล้ว}}"
   },
   "4318861667254318892": {
      "message": "Google Video"
   },
   "4320831042030778": {
      "message": "ยกเลิก"
   },
   "4320942249997687388": {
      "message": "End"
   },
   "4321382260116636620": {
      "message": "เลือกโน้ต"
   },
   "4332252081504252077": {
      "message": "อ๊ะ!"
   },
   "4343825450663233452": {
      "message": "ดูได้"
   },
   "4343836986248234462": {
      "message": "รายการ"
   },
   "4343848624651344174": {
      "message": "บ่าย"
   },
   "435214284915110062": {
      "message": "เปิดแถบค้นหา"
   },
   "435444400175963053": {
      "message": "ย้าย $1​ รายการไปที่ $2​ แล้ว"
   },
   "4356312843186491987": {
      "message": "ย้าย"
   },
   "4391715930031906467": {
      "message": "ค้นหาถัดไป"
   },
   "4397482594800054550": {
      "message": "เกิดปัญหาในการเปลี่ยนชื่อ \"$1​\""
   },
   "4412626362660239325": {
      "message": "จัดระเบียบในไดรฟ์"
   },
   "4422985761498356257": {
      "message": "เปิดด้วย"
   },
   "4429542915339609008": {
      "message": "ขออภัย ระบบไม่สนับสนุนการใช้แอปนี้เปิดหลายไฟล์"
   },
   "4439831283519683004": {
      "message": "เทา"
   },
   "4448871104213529122": {
      "message": "ซ่อนรายละเอียด"
   },
   "4457424709416639982": {
      "message": "เพิ่มในไดรฟ์ของฉัน"
   },
   "4462389610494427551": {
      "message": "เซนติเมตร"
   },
   "4486429060311743289": {
      "message": "ล้างการเลือก"
   },
   "4494250072784000771": {
      "message": "ตรวจพบสไตลัส เปิดใช้งานการเลื่อนด้วยการแตะแล้ว"
   },
   "45228242181482134": {
      "message": "เล่น"
   },
   "4533605085334699862": {
      "message": "คำคม"
   },
   "4543077011795639870": {
      "message": "ลดระยะเยื้องรายการแล้ว"
   },
   "4550209323331625907": {
      "message": "$2​เรียนรู้เพิ่มเติม$1​"
   },
   "4557086341175267918": {
      "message": "ไม่สามารถแชร์ขณะออฟไลน์"
   },
   "4558568516353053251": {
      "message": "ผู้มีสิทธิ์อ่านไฟล์นี้จะเห็นความคิดเห็นและคำแนะนำ"
   },
   "4564682305303579317": {
      "message": "ดำเนินการต่อ"
   },
   "456512308416555173": {
      "message": "หนังสือ"
   },
   "4566838580250578446": {
      "message": "{every,plural, =1{ซ้ำทุกปี}other{ซ้ำทุก # ปี}}"
   },
   "4583714435275461910": {
      "message": "รายการระดับบนสุด"
   },
   "4586373282767984140": {
      "message": "เหลือง"
   },
   "4595551195988564947": {
      "message": "กำลังมีการเปลี่ยนแปลงรายการซื้อสินค้าของ Google Assistant"
   },
   "4602655470033495470": {
      "message": "เพิ่มโน้ต รายการ ภาพวาด รูปภาพ และเสียงลงใน Keep"
   },
   "4607656353105320648": {
      "message": "{count,plural, =1{ลบบันทึกถาวรไหม}other{ลบบันทึกถาวรไหม}}"
   },
   "4607802784047113873": {
      "message": "เพิ่มผู้ทำงานร่วมกัน"
   },
   "4608848277887462246": {
      "message": "ชีตอื่นๆ"
   },
   "461126197624379601": {
      "message": "แตะที่นี่เพื่อพูดคุยเกี่ยวกับไฟล์นี้กับผู้อื่น"
   },
   "4620034373159179678": {
      "message": "หน้า $1​ จาก $2​"
   },
   "4632830890362652221": {
      "message": "{NUM_ITEMS,plural, =1{คุณกำลังย้ายรายการในโฟลเดอร์หนึ่ง}other{คุณกำลังย้ายรายการในโฟลเดอร์หนึ่ง}}"
   },
   "4634925432725098930": {
      "message": "px"
   },
   "4643940860676429496": {
      "message": "กำลังบันทึก..."
   },
   "4671836579708244357": {
      "message": "รายชื่อติดต่อ"
   },
   "4675792829115971960": {
      "message": "เราจะแจ้งว่าโน้ตนี้ไม่เหมาะสมและนำออกจากบัญชีของคุณ"
   },
   "4685321580747790677": {
      "message": "{every,plural, =1{เกิดซ้ำทุกสัปดาห์ใน {days}}other{เกิดซ้ำทุก # สัปดาห์ใน {days}}}"
   },
   "4690120479780049536": {
      "message": "คะแนน"
   },
   "4691283408020124345": {
      "message": "มุมมองรายการ"
   },
   "4697169479015785830": {
      "message": "เปิดตัวเลือกสีและขนาดของปากกาเขียนลายมือ"
   },
   "4697673185436885400": {
      "message": "ชีตลบล้างแป้นพิมพ์ลัด $2​ ของเบราว์เซอร์ $1​ แล้ว"
   },
   "4698144269846224816": {
      "message": "ขนาด 1"
   },
   "4704493722060638379": {
      "message": "กด Shift + N สำหรับตำแหน่งก่อนหน้าและกด Shift + P สำหรับตำแหน่งถัดไป"
   },
   "4722167255291887189": {
      "message": "ขนาด 2"
   },
   "4734349318830134239": {
      "message": "สิ้นสุด"
   },
   "4738612839683751348": {
      "message": "เยื้องรายการนี้ไม่ได้อีกแล้ว"
   },
   "4740100782728373253": {
      "message": "บันทึกลงในไดรฟ์"
   },
   "4748046231232264180": {
      "message": "Google ฟอร์ม"
   },
   "4751202914935960324": {
      "message": "มีอีเมลนี้อยู่แล้ว"
   },
   "4752655540567953719": {
      "message": "ตำแหน่งที่ $1​"
   },
   "4762625944764691132": {
      "message": "เมนูหลัก"
   },
   "47670360985205683": {
      "message": "\"$1​\" ($2​) มีขนาดเกินไฟล์สูงสุดที่ Google สแกนได้ ไฟล์นี้อาจเป็นอันตรายต่อคอมพิวเตอร์ โปรดเล่นไฟล์นี้หากคุณเข้าใจความเสี่ยงเท่านั้น"
   },
   "4767722428137216885": {
      "message": "ยกเลิก"
   },
   "477328789314249432": {
      "message": "ค้นหาโน้ต"
   },
   "4775368111547931093": {
      "message": "ไม่มีคำอธิบาย"
   },
   "4805047680716507619": {
      "message": " - ย้ายไปที่:"
   },
   "4806763987633034948": {
      "message": "PKCS7 Signature"
   },
   "4807444103404336088": {
      "message": "เกิดปัญหาในการเพิ่มดาวให้กับ \"$1​\""
   },
   "4821130290026382049": {
      "message": "แป้นพิมพ์ลัดที่นิยมใช้"
   },
   "4833214200453019325": {
      "message": "$1​ จาก $2​"
   },
   "4840513623749850224": {
      "message": "ภาพยนตร์"
   },
   "4847795993918486929": {
      "message": "ไม่สามารถจับข้อความจากรูปภาพได้ ลองอีกครั้งในภายหลัง"
   },
   "4853788427396558692": {
      "message": "$1​ MB"
   },
   "4858389278403807208": {
      "message": "โน้ตในถังขยะ"
   },
   "4864051612562026766": {
      "message": "{count,plural, =1{เลือกแล้ว 1 รายการ}other{เลือกแล้ว # รายการ}}"
   },
   "4878012031550736317": {
      "message": "{NUM_ITEMS,plural, =0{unused plural form}=1{ผู้คนจะสูญเสียสิทธิ์เข้าถึงไฟล์นี้หากไม่ได้เป็นสมาชิกของ \"{TEAM_DRIVE_NAME}\"}other{ผู้คนจะสูญเสียสิทธิ์เข้าถึงไฟล์นี้หากไม่ได้เป็นสมาชิกของ \"{TEAM_DRIVE_NAME}\"}}"
   },
   "490045476479394048": {
      "message": "ไฮไลต์ข้อความเพื่อแสดงความคิดเห็น"
   },
   "4901386320110714275": {
      "message": "รหัสผ่านไม่ถูกต้อง โปรดลองอีกครั้ง"
   },
   "4906669330059413958": {
      "message": "ส่งรหัสผ่าน"
   },
   "4907349694646937491": {
      "message": "ย้ายโน้ตไปยังดัชนี $1​"
   },
   "4915450884407029247": {
      "message": "เพิ่มป้ายกำกับ $1​ แล้ว"
   },
   "4918998818369420588": {
      "message": "รายงานการละเมิด"
   },
   "4930422592340561418": {
      "message": "ไดรฟ์ของฉัน"
   },
   "4930506384627295710": {
      "message": "การตั้งค่า"
   },
   "4948512233726694061": {
      "message": "$4​หน้า$1​$5​$3​$1​$7​/$2​$6​$8​$1​"
   },
   "4955094356920130803": {
      "message": "เหลืองอำพัน"
   },
   "4957674814179289955": {
      "message": "ไปยังรายการย่อยถัดไป/ก่อนหน้า"
   },
   "4963533275503057654": {
      "message": "กำลังสร้างภาพขนาดย่อ..."
   },
   "4963784280521435720": {
      "message": "กำลังบันทึก..."
   },
   "4974059227183970715": {
      "message": "คุณยังสามารถเพิ่มป้ายกำกับได้โดยพิมพ์ \"#\""
   },
   "4982284738093713321": {
      "message": "ผู้จัด"
   },
   "4988132901627446385": {
      "message": "ขยายแผงรายละเอียดแล้ว"
   },
   "5000971639019912199": {
      "message": "$2​ข้อกำหนด$1​"
   },
   "5006765610090288212": {
      "message": "ใช้สี $1​ แล้ว"
   },
   "5008901799534614532": {
      "message": "ลบ"
   },
   "5009448218905630614": {
      "message": "นำออก"
   },
   "5011858093760184160": {
      "message": "นำดาวออก"
   },
   "5013331898336483156": {
      "message": "ย้ายไปที่ไดรฟ์ของฉันในโดเมนใหม่ใช่ไหม"
   },
   "501475221876543407": {
      "message": "โน้ตที่คุณเพิ่มปรากฏที่นี่"
   },
   "5023623739220371850": {
      "message": "ไม่สามารถตรวจสอบสิทธิ์ได้ จะซิงค์การเปลี่ยนแปลงเมื่อคุณลงชื่อเข้าใช้"
   },
   "5041572047197549869": {
      "message": "ในวันเดียวกันทุกเดือน"
   },
   "5045725997997672553": {
      "message": "{weekNumber,plural, =1{ใน{day}แรกของเดือน}=2{ใน{day}ที่ 2 ของเดือน}=3{ใน{day}ที่ 3 ของเดือน}=4{ใน{day}ที่ 4 ของเดือน}other{ใน{day}สุดท้ายของเดือน}}"
   },
   "5046371569383796818": {
      "message": "เก็บไว้"
   },
   "5052461293250181960": {
      "message": "เลื่อนหน้าลง"
   },
   "5060107422621709815": {
      "message": "รีเฟรชไม่สำเร็จ"
   },
   "5075841894330153061": {
      "message": "หากต้องการปิดภาพวาด ให้ไปด้านซ้ายบนแล้วคลิกย้อนกลับ"
   },
   "5078184843381528205": {
      "message": "ตรึงโน้ต"
   },
   "5085332075590890665": {
      "message": "เลิกทำ"
   },
   "5086862627563516607": {
      "message": "{NUM_ITEMS,plural, =0{Unused plural form}=1{สมาชิกของ \"{TEAM_DRIVE_NAME}\" จะสามารถเข้าถึงรายการนี้ได้}other{สมาชิกของ \"{TEAM_DRIVE_NAME}\" จะสามารถเข้าถึงรายการเหล่านี้ได้}}"
   },
   "5094400861508407603": {
      "message": "นำสัญลักษณ์หัวข้อย่อยออกแล้ว"
   },
   "5095987896933771566": {
      "message": "พิมพ์เอกสาร"
   },
   "509815948423424872": {
      "message": "การนำทาง"
   },
   "5098941979861776792": {
      "message": "Enter"
   },
   "5121976648047240846": {
      "message": "นำป้ายกำกับออก"
   },
   "5130903421326358933": {
      "message": "เกิดปัญหาในการบันทึกไฟล์แนบไปยัง Google ไดรฟ์"
   },
   "5134649253619244584": {
      "message": "ลบป้ายกำกับ"
   },
   "5140285776541296873": {
      "message": "กำหนดเอง"
   },
   "5140450179685369890": {
      "message": "{NUM_ITEMS_1,plural, =0{unused plural form}=1{ย้าย {NUM_ITEMS_2} โฟลเดอร์ไปที่ {XXX_1} แล้ว}other{ย้าย {NUM_ITEMS_2} โฟลเดอร์ไปที่ {XXX_2} แล้ว}}"
   },
   "5151247077945318396": {
      "message": "เกิดข้อผิดพลาดขณะเลือกโฟลเดอร์ปลายทางที่จะแตกข้อมูล"
   },
   "5159511879001144721": {
      "message": "น้ำเงินเข้ม"
   },
   "5167365673547406876": {
      "message": "{NUM_ITEMS,plural, =0{unused plural form}=1{สมาชิกของ \"{TEAM_DRIVE_NAME}\" จะเข้าถึงได้}other{สมาชิกของ \"{TEAM_DRIVE_NAME}\" จะเข้าถึงได้}}"
   },
   "5178674191443894176": {
      "message": "ป้ายกำกับ"
   },
   "5180454621500142444": {
      "message": "กู้คืน"
   },
   "5180989337128758117": {
      "message": "วงเล็บเปิด"
   },
   "5182569285908080938": {
      "message": "ตัวเลือกวันที่สิ้นสุด"
   },
   "5184692850089055965": {
      "message": "จับข้อความจากรูปภาพ"
   },
   "5184785218378634051": {
      "message": "รายการไม่มีการซูมแล้ว"
   },
   "5197718200713913936": {
      "message": "C++"
   },
   "5201670213497642487": {
      "message": "แถบแท็บแผงรายละเอียด กดปุ่มลูกศรซ้ายและขวาเพื่อสลับไปมาระหว่างแท็บ"
   },
   "5202835861850747976": {
      "message": "$2​เรียนรู้เพิ่มเติม$1​"
   },
   "5204391636475413312": {
      "message": "บันทึก"
   },
   "5238284741118437734": {
      "message": "เลิกทำ"
   },
   "5238307666527496111": {
      "message": "ตกลง"
   },
   "5238371081785912565": {
      "message": "เปิดด้วย $1​"
   },
   "5253765183290980485": {
      "message": "คุณมีสิทธิ์เพิ่มและแก้ไขรายการใน \"$1​\" เท่านั้น ดังนั้นจะไม่สามารถเลิกทำการทำงานนี้ได้"
   },
   "5255388116256536182": {
      "message": "ใช้ปุ่มลูกศรเพื่อเลือกเซลล์ที่จะแสดงความคิดเห็น จากนั้นให้กด Shift ค้างไว้ระหว่างกดปุ่มลูกศรเพื่อขยายพื้นที่ที่เลือก แล้วกด Enter เพื่อสร้างความคิดเห็นหรือ Esc เพื่อยกเลิก"
   },
   "5259541708332520733": {
      "message": "นำแหล่งที่มาออกแล้ว"
   },
   "5271615049826004958": {
      "message": "ตัวเลือกการแสดงตัวอย่างลิงก์"
   },
   "5281121179861637423": {
      "message": "ต้องมีรหัสผ่านเพื่อเข้าถึง $1​ โปรดป้อนรหัสผ่าน"
   },
   "5288037028604092288": {
      "message": "XPS"
   },
   "5299648222246616124": {
      "message": "Backtick (`)"
   },
   "5300527252159851865": {
      "message": "เนื้อหาของไฟล์ไม่ตรงกับรูปแบบไฟล์ที่คาดไว้"
   },
   "5320475549855398784": {
      "message": "ภาพวาดนี้จะใช้ได้เมื่อคุณออนไลน์"
   },
   "5321772883765574323": {
      "message": "ย้าย \"$1​\" จาก $2​ ไปที่ $3​ แล้ว"
   },
   "5334959887390704534": {
      "message": "เราจะลบและนำป้ายกำกับนี้ออกจากโน้ตทั้งหมดใน Keep โดยไม่มีการลบโน้ตของคุณ"
   },
   "5336801339221383042": {
      "message": "Javascript"
   },
   "5336924963122494935": {
      "message": "เลือกรายการนี้"
   },
   "534191528712675978": {
      "message": "Pause"
   },
   "534228323125524312": {
      "message": "ซูมออก"
   },
   "5353129315502554762": {
      "message": "Style Sheet"
   },
   "5362962746518601227": {
      "message": "{NUM_ITEMS,plural, =1{คุณกำลังย้ายไฟล์ในโฟลเดอร์หนึ่ง}other{คุณกำลังย้ายไฟล์ในโฟลเดอร์หนึ่ง}}"
   },
   "5363853533596749934": {
      "message": "ป้อนชื่อป้ายกำกับ"
   },
   "5372143986724491245": {
      "message": "$1​ วันที่ผ่านมา"
   },
   "5372160981898991853": {
      "message": "Publisher"
   },
   "5392844646168201484": {
      "message": "ขนาด 3"
   },
   "5394695048211047984": {
      "message": "เพิ่มวันที่"
   },
   "5398036630337418486": {
      "message": "เปิดเอกสาร"
   },
   "5399553230649155346": {
      "message": "ใน $1​ ชั่วโมง"
   },
   "5403636185480096151": {
      "message": "ทีวี"
   },
   "540596856674438371": {
      "message": "ไม่สามารถแชร์ได้เนื่องจากปิดการแชร์อยู่"
   },
   "5408091115193390231": {
      "message": "AutoCAD"
   },
   "5413225497191133249": {
      "message": "ตรึงหรือเลิกตรึงโน้ต"
   },
   "5423742603774911808": {
      "message": "รายการมีขนาดใหญ่เกินไป"
   },
   "5435749276779042277": {
      "message": "อีก $1​ รายการ"
   },
   "5447119197363232006": {
      "message": "แสดงในไดรฟ์"
   },
   "5455566801812656827": {
      "message": "น้อยลง"
   },
   "5465081454525683943": {
      "message": "บันทึกนี้ไม่แชร์กับบัญชีของคุณอีกต่อไป  ขอสิทธิ์การเข้าถึงจากเจ้าของ หรือสลับไปใช้บัญชีที่มีสิทธิ์"
   },
   "5467649767578147801": {
      "message": "{NUM_ITEMS,plural, =0{unused plural form}=1{ผู้คนจะสูญเสียสิทธิ์เข้าถึงไฟล์นี้หากไม่ได้เป็นสมาชิกของ \"{TEAM_DRIVE_NAME}\" หรืออยู่นอก {DOMAIN_NAME}}other{ผู้คนจะสูญเสียสิทธิ์เข้าถึงไฟล์นี้หากไม่ได้เป็นสมาชิกของ \"{TEAM_DRIVE_NAME}\" หรืออยู่นอก {DOMAIN_NAME}}}"
   },
   "546766753072101168": {
      "message": "ป้ายกำกับ"
   },
   "5472312735475866917": {
      "message": "แสดงความคิดเห็นโดย $1​"
   },
   "547865385964196102": {
      "message": "$1​ นาทีที่ผ่านมา"
   },
   "5478662967017843220": {
      "message": "น้ำเงินเข้ม"
   },
   "5480497191725157666": {
      "message": "Esc"
   },
   "5482604275203517054": {
      "message": "ซ้าย"
   },
   "5503885447744017882": {
      "message": "ย้ายไปที่ $1​ นอก $2​ ใช่ไหม"
   },
   "5506390497558702263": {
      "message": "{count,plural, =1{เลิกเก็บและตรึงโน้ตแล้ว}other{เลิกเก็บและตรึงโน้ต # รายการแล้ว}}"
   },
   "5520112019886360037": {
      "message": "ปิด"
   },
   "5534694255293809224": {
      "message": "กด $1​ + Enter เพื่อหยุดแก้ไขโน้ต"
   },
   "5539958940810433464": {
      "message": "ทิ้งโน้ต"
   },
   "5542817571710587822": {
      "message": "ไฟล์มีรูปภาพมากเกินไป"
   },
   "5545146751578623220": {
      "message": "Caps-Lock"
   },
   "5555182241047709329": {
      "message": "เลือกตำแหน่ง"
   },
   "5562491070882550010": {
      "message": "เมื่อลบแล้ว โน้ตที่แชร์จะไม่ปรากฏให้ทุกคนที่ได้รับแชร์โน้ตเห็น"
   },
   "556742419793425318": {
      "message": "ยกเลิก"
   },
   "5578032872220617725": {
      "message": "กด $1​ + A เพื่อเลือกโน้ตทั้งหมด"
   },
   "5581834527128285229": {
      "message": "เกิดปัญหาในการเพิ่ม \"$1​\" ไปยังไดรฟ์ของฉัน"
   },
   "5598649706113950710": {
      "message": "เครื่องมือแก้ไข"
   },
   "5603830044099155569": {
      "message": "กด J สำหรับโน้ตก่อนหน้าและกด K สำหรับโน้ตถัดไป"
   },
   "5627470193961862490": {
      "message": "โน้ตที่กำลังจะมีการแจ้งเตือนจะปรากฏที่นี่"
   },
   "564165666160590723": {
      "message": "Windows Media Player"
   },
   "5648022012893174586": {
      "message": "หากต้องการวาดเส้นหนา ให้คลิกไอคอนปากกาเมจิก"
   },
   "5652536812290902558": {
      "message": "ดาวน์โหลดเสียง"
   },
   "566719933273904590": {
      "message": "ไปที่ป้ายกำกับ"
   },
   "5670235154099791694": {
      "message": "นิ้ว"
   },
   "5672326933907786881": {
      "message": "โน้ตหน้าจอล็อกจะบันทึกไปยัง Google Keep โดยอัตโนมัติ"
   },
   "5678095606167600931": {
      "message": "แทรกสัญลักษณ์หัวข้อย่อยแล้ว"
   },
   "568072913338360182": {
      "message": "HTML"
   },
   "5707549724380589079": {
      "message": "ลบรายการที่ทำเสร็จแล้วไหม"
   },
   "5714240424645614611": {
      "message": "Android Package"
   },
   "5714760273477184428": {
      "message": "ใช้ลูกศรเพื่อไฮไลต์พื้นที่เพื่อแสดงความคิดเห็น แล้วกด Enter"
   },
   "5738003914096572768": {
      "message": "ทำงานแล้ว"
   },
   "5755541943799933389": {
      "message": "เพิ่มดาวให้กับ \"$1​\" แล้ว"
   },
   "577619047319778196": {
      "message": "ล้างการเลือก"
   },
   "5801257863595278616": {
      "message": "เลื่อนการเลือกไปด้านซ้ายแล้ว"
   },
   "5813834209240603556": {
      "message": "กด N สำหรับรายการก่อนหน้าและกด P สำหรับรายการถัดไป"
   },
   "5820033033803019104": {
      "message": "จัดระเบียบ"
   },
   "5826302153453971149": {
      "message": "ชมพูอ่อน"
   },
   "5840202488368071194": {
      "message": "โน้ตใหม่พร้อมรูปภาพ"
   },
   "5840330517914556080": {
      "message": "ซูมออก"
   },
   "5854158607727111728": {
      "message": "Tab"
   },
   "5870134033985574990": {
      "message": "กำลังคลายข้อมูล..."
   },
   "5871966496153339793": {
      "message": "กำลังแสดงภาพขนาดย่อของวิดีโอ $1​"
   },
   "5876498556450482026": {
      "message": "หากต้องการไฮไลต์ด้วยสี ให้คลิกไอคอนปากกาไฮไลต์"
   },
   "5895666393386604578": {
      "message": "หากต้องการเยื้อง ให้ลากรายการหรือใช้แป้นพิมพ์ลัด $1​"
   },
   "5909490544352162901": {
      "message": "ขอสิทธิ์การเข้าถึงโน้ตนี้จากเจ้าของ หรือสลับไปใช้บัญชีที่มีสิทธิ์ คุณลงชื่อเข้าใช้ด้วย $1​"
   },
   "5911012384539794869": {
      "message": "ไม่สามารถเริ่มงานแยกไฟล์ได้"
   },
   "591481266986424156": {
      "message": "เบราว์เซอร์ $1​ กำลังใช้แป้นพิมพ์ลัดนี้สำหรับ $2​"
   },
   "5916010927050975496": {
      "message": "$1​ KB"
   },
   "5917528552332886959": {
      "message": "แสดงความคิดเห็นที่ได้ข้อยุติแล้ว"
   },
   "5947790263929501779": {
      "message": "แปลงเป็นสัญลักษณ์หัวข้อย่อยแล้ว"
   },
   "5949528478488617689": {
      "message": "สิทธิ์การดาวน์โหลด"
   },
   "5950887255133612666": {
      "message": "ยังไม่เริ่ม"
   },
   "5954965790623966933": {
      "message": "เลือดหมู"
   },
   "5961981688037913870": {
      "message": "เพิ่ม $1​ แล้ว"
   },
   "5965683144165568126": {
      "message": "จัดเรียงรายการใหม่"
   },
   "5969696744752069015": {
      "message": "ไม่มีหน้าตัวอย่าง"
   },
   "597927944425927829": {
      "message": "การเป็นเจ้าของจะโอนจาก \"$1​\" ให้คุณ"
   },
   "5984398071085567332": {
      "message": "Google ตารางฟิวชัน"
   },
   "5987609488177213747": {
      "message": "สร้างป้ายกำกับ"
   },
   "5989809255170931770": {
      "message": "{time,plural, =1{Keep จะอัปเดตใน # วินาที}other{Keep จะอัปเดตใน # วินาที}}"
   },
   "5994697604396931641": {
      "message": "นำออกทั้งหมด"
   },
   "5999179030782577147": {
      "message": "กด # เพื่อทิ้งโน้ต"
   },
   "6009962986062136164": {
      "message": "กำลังโหลด $1​"
   },
   "6011637630664474614": {
      "message": "เว้นวรรค"
   },
   "6030537159236285525": {
      "message": "ย้ายรายการไปยังตำแหน่งถัดไป/ก่อนหน้า"
   },
   "60305871484579258": {
      "message": "Alt"
   },
   "6033916931543811803": {
      "message": "{NUM_ITEMS_1,plural, =0{unused plural form}=1{ย้าย {NUM_ITEMS_2} โฟลเดอร์จาก {XXX_1} ไปที่ {XXX_2} แล้ว}other{ย้าย {NUM_ITEMS_2} โฟลเดอร์จาก {XXX_3} ไปที่ {XXX_4} แล้ว}}"
   },
   "6043578784980337112": {
      "message": "ย้าย $1​ ไฟล์ไปที่ $2​ แล้ว"
   },
   "6062216008944363143": {
      "message": "{weekNumber,plural, =1{เกิดซ้ำทุก {every} เดือนใน{day}แรกของเดือน}=2{เกิดซ้ำทุก {every} เดือนใน{day}ที่ 2 ของเดือน}=3{เกิดซ้ำทุก {every} เดือนใน{day}ที่ 3 ของเดือน}=4{เกิดซ้ำทุก {every} เดือนใน{day}ที่ 4 ของเดือน}other{เกิดซ้ำทุก {every} เดือนใน{day}สุดท้ายของเดือน}}"
   },
   "6069780031254134657": {
      "message": "ทำเครื่องหมายว่าเสร็จแล้ว"
   },
   "6087078248621415351": {
      "message": "แก้ไขเมื่อ $1​"
   },
   "6100883940579706314": {
      "message": "หน้าตัวอย่างลิงก์"
   },
   "6105571474005679446": {
      "message": "เกิดปัญหากับการแสดงตัวอย่าง"
   },
   "6113237889871930608": {
      "message": "โน้ตเปล่า"
   },
   "6118623991445349480": {
      "message": "หน้า $1​"
   },
   "6122643025527543706": {
      "message": "Ctrl"
   },
   "6127325177382263770": {
      "message": "URL"
   },
   "6128550071219729739": {
      "message": "ลบรูปภาพแล้ว"
   },
   "6131822680770571276": {
      "message": "PowerPoint"
   },
   "6140634664402328750": {
      "message": "รายการแอป"
   },
   "6149175749937815029": {
      "message": "ดูรายการทั้งหมด"
   },
   "616807262818311711": {
      "message": "ประเภท"
   },
   "6176354714840789272": {
      "message": "คุณยังบันทึกลิงก์ไว้ใช้ทีหลังได้โดยใช้$2​ส่วนขยาย Google Keep ใน Chrome$1​"
   },
   "6186753450686672643": {
      "message": "{every,plural, =1{เกิดซ้ำทุกวัน}other{เกิดซ้ำทุก # วัน}}"
   },
   "6189397065139465013": {
      "message": "ทุก"
   },
   "6201176165479907499": {
      "message": "{count,plural, =1{ตรึงโน้ตแล้ว}other{ตรึงโน้ต # รายการแล้ว}}"
   },
   "6203260615455347677": {
      "message": "Numbers"
   },
   "6209117354086898503": {
      "message": "กลับ"
   },
   "6211895332551673425": {
      "message": "เพิ่มไปยัง$2​ไดรฟ์ของฉัน$1​แล้ว"
   },
   "6212070333807533570": {
      "message": "กำลังเพิ่มไปยัง$2​ไดรฟ์ของฉัน$1​..."
   },
   "6223207695466118454": {
      "message": "YouTube"
   },
   "6224687211096863620": {
      "message": "ทุกคน"
   },
   "6225875898439047571": {
      "message": "ปฏิเสธ"
   },
   "6231442995102088007": {
      "message": "มีอะไรใหม่ใน Google Keep"
   },
   "6252259197986158120": {
      "message": "เมื่อวานนี้"
   },
   "6263940822259442857": {
      "message": "ซ่อนช่องทำเครื่องหมาย"
   },
   "6286379137937560558": {
      "message": "บทความ"
   },
   "6286806453721792102": {
      "message": "จัดระเบียบในไดรฟ์"
   },
   "6305748545202493254": {
      "message": "แสดง/ซ่อนแผงรายละเอียด"
   },
   "6306268376900894985": {
      "message": "เกิดขึ้นจนถึงวันที่ {endDate}"
   },
   "6324768448533022780": {
      "message": "$1​ $2​"
   },
   "6336194821483049583": {
      "message": "แอปเริ่มต้นที่มาพร้อมเครื่อง"
   },
   "6347484050944915390": {
      "message": "ส่งคำขอแล้ว คุณจะได้รับอีเมลเมื่อได้รับอนุมัติ"
   },
   "6352952829934775705": {
      "message": "เพิ่มเติม"
   },
   "6366376928558090914": {
      "message": "อาหาร"
   },
   "6371576811194810854": {
      "message": "หลัง"
   },
   "6375244206466599493": {
      "message": "ปี"
   },
   "6375395544374251820": {
      "message": "เกิดปัญหาในการโหลดหน้าเพิ่ม กำลังลองใหม่..."
   },
   "6377664889539934": {
      "message": "วาดด้วยการแตะ"
   },
   "6381941041429900831": {
      "message": "เพิ่มผู้ทำงานร่วมกัน"
   },
   "6386587519843563719": {
      "message": "ไฟล์ไบนารี"
   },
   "639451288140270562": {
      "message": "คัดลอกไปที่ Google เอกสารแล้ว"
   },
   "6394816510866826521": {
      "message": "Dogfoody"
   },
   "6402092370576716734": {
      "message": "ล้างข้อมูลในถังขยะ"
   },
   "6413404795391222793": {
      "message": "สร้างรายการใหม่"
   },
   "6416495701611778255": {
      "message": "แอปของบุคคลที่สามที่แนะนำ"
   },
   "6417706204201069253": {
      "message": "โน้ตที่ลบจะไม่ปรากฏให้ทุกคนที่ได้รับแชร์โน้ตเห็น"
   },
   "6419411265907669340": {
      "message": "วันนี้"
   },
   "6424277546995954045": {
      "message": "การลบล้างแป้นพิมพ์ลัดใช้ไม่ได้กับเบราว์เซอร์ปัจจุบัน\nหากต้องการเปิดใช้ฟีเจอร์นี้ โปรดเปลี่ยนไปใช้ Chrome, Firefox, IE/Edge หรือ Safari"
   },
   "6428000916830484004": {
      "message": "น้ำตาล"
   },
   "6432019580434957057": {
      "message": "เสียง"
   },
   "6443615802319581315": {
      "message": "{NUM_ITEMS,plural, =1{คุณไม่มีสิทธิ์ย้ายไฟล์นี้จากโฟลเดอร์ปัจจุบัน เพิ่มไฟล์ไปที่ {START_SPAN_1}{NAME}{END_SPAN} แทน}other{คุณไม่มีสิทธิ์ย้ายไฟล์เหล่านี้จากโฟลเดอร์ปัจจุบัน เพิ่มไฟล์ไปที่ {START_SPAN_2}{NAME}{END_SPAN} แทน}}"
   },
   "6450508807204492448": {
      "message": "ไอคอน $1​"
   },
   "6457802200418354862": {
      "message": "ผู้ดูสามารถดาวน์โหลดได้"
   },
   "6459405233858728718": {
      "message": "Google สไลด์"
   },
   "6464761738227651511": {
      "message": "$1​ นาทีที่ผ่านมา"
   },
   "6466736813846482957": {
      "message": "ก่อนหน้า"
   },
   "6472238195689960152": {
      "message": "ขาว"
   },
   "6473102097014191455": {
      "message": "โน้ตภาพวาด"
   },
   "6477306554098527424": {
      "message": "Google Assistant"
   },
   "6480376252068839019": {
      "message": "เปิดตัวเลือกตารางกริด"
   },
   "6490084340347327400": {
      "message": "กด $1​ + Shift + 8 เพื่อสลับระหว่างโน้ตกับรายการ"
   },
   "6497197865876438261": {
      "message": "เพลง"
   },
   "6507257480072167483": {
      "message": "เปลี่ยนชื่อป้ายกำกับเป็น $1​ แล้ว"
   },
   "6510131849363684615": {
      "message": "พรุ่งนี้"
   },
   "6513721414466645971": {
      "message": "ลบแล้ว"
   },
   "6522917155620379865": {
      "message": "ดาวน์โหลด"
   },
   "6524849072392100692": {
      "message": "โฟลเดอร์ Google ไดรฟ์"
   },
   "653160061888539741": {
      "message": "ควบคุมความคืบหน้า"
   },
   "6571686604846453345": {
      "message": "เกิดปัญหาในการเพิ่มรายการนี้ไปยังไดรฟ์"
   },
   "6578339688410021742": {
      "message": "สมาชิกทุกคนของ \"$1​\" จะเข้าถึงรายการได้"
   },
   "6579707685908557993": {
      "message": "เย็น"
   },
   "6582286158693833652": {
      "message": "เรียนรู้เพิ่มเติม"
   },
   "6588176324871799870": {
      "message": "สคริปต์ Google Apps"
   },
   "6618562607681757575": {
      "message": "ไม่ต้องย้ายออกจากโฟลเดอร์ แต่ให้เพิ่มลงใน $3​$2​$1​"
   },
   "6622304228074863427": {
      "message": "แอปพลิเคชัน"
   },
   "6627510416186113122": {
      "message": "น้ำเงินอมเขียวอ่อน"
   },
   "6650600936729710500": {
      "message": "คำตอบ"
   },
   "6664835828596108553": {
      "message": "ตัวเลือก"
   },
   "670419277288558500": {
      "message": "วิดีโอ/เสียง"
   },
   "6707173584987026005": {
      "message": "วันนี้"
   },
   "6710728478489145370": {
      "message": "ปิด"
   },
   "6713235295664405475": {
      "message": "ใน|ถึง"
   },
   "6715985122107380503": {
      "message": "การบันทึก"
   },
   "6726462693927865256": {
      "message": "รายละเอียด"
   },
   "6726879257388338969": {
      "message": "พิมพ์"
   },
   "6732800471045353930": {
      "message": "มีการแชร์โน้ตนี้กับผู้อื่นถึงจำนวนสูงสุดแล้ว"
   },
   "673551770550324419": {
      "message": "พอดีกับความกว้าง"
   },
   "6747528043814108113": {
      "message": "สลับเป็น$1​แล้ว"
   },
   "6749829802551750923": {
      "message": "ขึ้น"
   },
   "6750600017746655174": {
      "message": "ตัวเลือก"
   },
   "6750827506231593056": {
      "message": "สลับบัญชี"
   },
   "6755327423364814290": {
      "message": "สร้างโน้ตได้รวดเร็วยิ่งขึ้นด้วยแอป"
   },
   "6761622351199419182": {
      "message": "โน้ตในที่เก็บถาวร"
   },
   "6773222938695237983": {
      "message": "{NUM_ITEMS,plural, =0{Unused}=1{แชร์รายการนี้ใช่ไหม}other{แชร์รายการเหล่านี้ใช่ไหม}}"
   },
   "6778577079172085976": {
      "message": "ตรึงไว้"
   },
   "678660085936036852": {
      "message": "กำลังดำเนินการกับรูปภาพ..."
   },
   "6787580031482277539": {
      "message": "ไม่เลย"
   },
   "6798055902819777633": {
      "message": "แพนด้วยการแตะ"
   },
   "6801348618370627980": {
      "message": "สร้างป้ายกำกับ $1​ แล้ว"
   },
   "6815042072535422726": {
      "message": "ลบเสียงแล้ว"
   },
   "681598652078493281": {
      "message": "เรียนรู้เพิ่มเติม"
   },
   "6822520214440117457": {
      "message": "ที่ทำงาน"
   },
   "6831650827360444197": {
      "message": "ไม่ได้แชร์โน้ต"
   },
   "6833062695195555756": {
      "message": "เปิดเมนูตัวเลือกของยางลบ"
   },
   "6833760103261954639": {
      "message": "เกิดปัญหาในการโหลดหน้านี้ กำลังลองใหม่..."
   },
   "687402923448150707": {
      "message": "ยกเลิกการเลือกแล้ว"
   },
   "689017442055275529": {
      "message": "กลุ่มครอบครัวของ $1​"
   },
   "6891563484025164308": {
      "message": "ก่อนหน้า"
   },
   "6898823203505321799": {
      "message": "รายละเอียด"
   },
   "6904351530369058983": {
      "message": "เจ้าของ"
   },
   "691041991673354191": {
      "message": "นำตัวฉันเองออก"
   },
   "6918505531548047245": {
      "message": "ปากกาไฮไลต์"
   },
   "6921237745237410511": {
      "message": "เพิ่มความคิดเห็น"
   },
   "6922953828399110511": {
      "message": "ปิดโปรแกรมดูเอกสาร"
   },
   "6934284829319777412": {
      "message": "ลักษณะการทำงานของรายการ"
   },
   "693770783324368110": {
      "message": "เลิกตรึงและทิ้งโน้ตแล้ว"
   },
   "695253297035211081": {
      "message": "ล้างถังขยะ"
   },
   "6979766453743005049": {
      "message": "ลากและวางสิ่งต่างๆ ลงในรายการเพื่อจัดเรียงใหม่และเยื้องรายการย่อย"
   },
   "6980199665979997122": {
      "message": "กู้คืน"
   },
   "6982321568096234183": {
      "message": "ดาวน์โหลดเสียง ($1​)"
   },
   "6982682101118067511": {
      "message": "กำลังจัดระเบียบ..."
   },
   "7005745151564974365": {
      "message": "แป้นพิมพ์ลัด"
   },
   "701276785305022936": {
      "message": "เอกสารเสียหาย โปรดตรวจสอบว่าไฟล์เป็นรูปแบบล่าสุด"
   },
   "7017485862232001373": {
      "message": "เพิ่ม \"$1​\" ไปที่ $2​ แล้ว"
   },
   "7019002927048576918": {
      "message": "ตัวกรองการค้นหา $1​"
   },
   "7030308038380934896": {
      "message": "คัดลอกไปที่ Google เอกสารไม่สำเร็จ"
   },
   "7050021021988648361": {
      "message": "คัดลอก URL"
   },
   "7050898523853841537": {
      "message": "ตัวเลือกความถี่"
   },
   "705714112650622350": {
      "message": "เกิดปัญหาในการเพิ่มรายการใน Google ไดรฟ์"
   },
   "7059437903473652416": {
      "message": "เล่นวิดีโอ YouTube $1​"
   },
   "7066744251212631722": {
      "message": "เหลืองมะนาว"
   },
   "7084324152376766809": {
      "message": "$1​ วันที่ผ่านมา"
   },
   "7084991134824194740": {
      "message": "เตือนฉัน"
   },
   "7086801490719148597": {
      "message": "ไม่เลือกรายการนี้"
   },
   "7094548885298700726": {
      "message": "น้ำตาลเข้ม"
   },
   "7102649289752747375": {
      "message": "ส่งความเห็น"
   },
   "7121259585839664942": {
      "message": "ยกเลิก"
   },
   "7126326627883991568": {
      "message": "ลบภาพวาดปัจจุบัน"
   },
   "7126535013613878060": {
      "message": "ตรึงโน้ตสำคัญไว้ด้านบน"
   },
   "7135182401951359795": {
      "message": "ระบบจะโอนการเป็นเจ้าของให้คุณ"
   },
   "7141983486405549971": {
      "message": "Insert"
   },
   "7145753028985071097": {
      "message": "กำลังจัดเรียงโน้ตใหม่"
   },
   "7146242673022399081": {
      "message": "Text"
   },
   "7148992630785407972": {
      "message": "ไฟล์นี้ได้รับการป้องกันด้วยรหัสผ่านและไม่สามารถแสดงตัวอย่างได้"
   },
   "7153847618034547771": {
      "message": "เปิดใช้"
   },
   "7161134329606048317": {
      "message": "ปิด"
   },
   "7164532930742017984": {
      "message": "ทุกคนที่มีลิงก์"
   },
   "7166989725427500881": {
      "message": "เลือกโน้ตที่อยู่ในถังขยะ"
   },
   "7174409400206281023": {
      "message": "พบการแก้ไขที่ขัดแย้งกัน"
   },
   "7181961085183734135": {
      "message": "ไฟล์นี้ปิดการพิมพ์ไว้"
   },
   "7190398092435016951": {
      "message": "{count,plural, =1{โน้ตที่ลบจะไม่ปรากฏให้ทุกคนที่ได้รับแชร์โน้ตเห็น}other{โน้ตที่ลบจะไม่ปรากฏให้ทุกคนที่ได้รับแชร์โน้ตเห็น}}"
   },
   "7201188472754345797": {
      "message": "{NUM_ITEMS,plural, =0{unused plural form}=1{ผู้คนจะสูญเสียสิทธิ์เข้าถึงไฟล์นี้หากอยู่นอก \"{DESTINATION_DOMAIN}\"}other{ผู้คนจะสูญเสียสิทธิ์เข้าถึงไฟล์นี้หากอยู่นอก \"{DESTINATION_DOMAIN}\"}}"
   },
   "7207109722898253285": {
      "message": "เก็บรายการที่เลือก"
   },
   "7218693060378095915": {
      "message": "ใหม่"
   },
   "722264179594523168": {
      "message": "ยกเลิก"
   },
   "7225445911355686176": {
      "message": "เลือกโน้ตที่เก็บถาวร"
   },
   "722702934847795304": {
      "message": "Project"
   },
   "7231231875581131930": {
      "message": "{NUM_ITEMS,plural, =0{Unused}=1{รายการนี้จะไม่สามารถย้ายกลับไปที่ \"{TEAM_DRIVE_NAME}\" ดังนั้นคุณจะไม่สามารถเลิกทำการดำเนินการนี้ได้}other{อย่างน้อย 1 รายการจะไม่สามารถย้ายกลับไปที่ \"{TEAM_DRIVE_NAME}\" ดังนั้นคุณจะไม่สามารถเลิกทำการดำเนินการนี้ได้}}"
   },
   "723223692006219983": {
      "message": "พอยต์"
   },
   "7247530225058410142": {
      "message": "$2​ $1​"
   },
   "7247965266239591227": {
      "message": "มีปัญหาในการแยกข้อมูล \"$1​\""
   },
   "7251490702980298031": {
      "message": "เปิดตัวเลือกสีและขนาดของปากกาไฮไลต์"
   },
   "7265183966796883739": {
      "message": "ซ่อนความคิดเห็นที่ได้ข้อยุติแล้ว"
   },
   "7278398674737413598": {
      "message": "ไม่สามารถแปลงเอกสารได้"
   },
   "7278859550373246865": {
      "message": "{count,plural, =1{เก็บโน้ตแล้ว}other{เก็บโน้ต # รายการแล้ว}}"
   },
   "7290932540630116546": {
      "message": "ตั้งการช่วยเตือนแล้ว $1​"
   },
   "7295254213841803546": {
      "message": "หากยกเลิกการเปลี่ยนแปลง ระบบจะไม่บันทึกการเปลี่ยนแปลง"
   },
   "7299749713933143099": {
      "message": "ม่วง"
   },
   "7306962184871750459": {
      "message": "การเป็นเจ้าของจะโอนจาก \"$4​\" ใน $3​ ให้ \"$2​\" ใน $1​"
   },
   "7330497278645626593": {
      "message": "ลองใช้"
   },
   "7337660181466605745": {
      "message": "ไม่สามารถอัปเดต \"$1​\" ในไดรฟ์"
   },
   "7342923890755029722": {
      "message": "ปิด"
   },
   "7344507440412470266": {
      "message": "ขยายการเลือกแล้ว"
   },
   "734478884582426793": {
      "message": "Compressed Archive"
   },
   "7353547650196788656": {
      "message": "แดง"
   },
   "7364571366369083618": {
      "message": "Video"
   },
   "7376703418960184879": {
      "message": "สำเนา"
   },
   "7377239345926788722": {
      "message": "การทำงาน"
   },
   "7379369644162401367": {
      "message": "นำออก"
   },
   "7381817875028728077": {
      "message": "ไม่เป็นไร"
   },
   "7382688299146249119": {
      "message": "ดาวน์โหลดรายการ"
   },
   "7388342865555961406": {
      "message": "ใน $1​ วัน"
   },
   "7393771571081973549": {
      "message": "C"
   },
   "7420117636241237177": {
      "message": "แยกข้อความจาก $1​ ไปไว้ในบัญชีอีเมลของคุณโดยอยู่ในป้ายกำกับ \"นำเข้า: $2​\""
   },
   "7426603384368095928": {
      "message": "โปรดโหลดหน้าเว็บซ้ำ เพื่อลงชื่อเข้าใช้อีกครั้งและทำงานต่อ"
   },
   "7427333772418801813": {
      "message": "ขยายปุ่มอีก $1​ รายการแล้ว"
   },
   "7429084719905985261": {
      "message": "Objective C"
   },
   "7432956605646331928": {
      "message": "SQL"
   },
   "7440735091552109962": {
      "message": "$2​ (แก้ไขเมื่อ $1​)"
   },
   "7441891675459021164": {
      "message": "กำลังบันทึกลงในไดรฟ์"
   },
   "744753705925710199": {
      "message": "ขออภัย เราไม่สามารถให้อนุญาตแอปนี้สำหรับไฟล์ทั้งหมดที่คุณพยายามเปิด โปรดลองอีกครั้ง"
   },
   "7452116603589558390": {
      "message": "ยกเลิกการเลือกโน้ตที่ตรึงไว้"
   },
   "7453297286571818554": {
      "message": "คัดลอกไปที่ Google เอกสาร"
   },
   "7453307802804717178": {
      "message": "ฟ้าอ่อน"
   },
   "7458942806393710991": {
      "message": "ยกเลิกการเลือกโน้ตที่เก็บถาวร"
   },
   "7464780237502381438": {
      "message": "เชื่อมต่อแอปเพิ่มเติม"
   },
   "7468842863971844562": {
      "message": "รายการใหม่"
   },
   "7469895656894091562": {
      "message": "อีเมลนี้ไม่ถูกต้อง"
   },
   "7482924911694634213": {
      "message": "{weekNumber,plural, =1{เกิดซ้ำทุกเดือนใน{day}แรกของเดือน}=2{เกิดซ้ำทุกเดือนใน{day}ที่ 2 ของเดือน}=3{เกิดซ้ำทุกเดือนใน{day}ที่ 3 ของเดือน}=4{เกิดซ้ำทุกเดือนใน{day}ที่ 4 ของเดือน}other{เกิดซ้ำทุกเดือนใน{day}สุดท้ายของเดือน}}"
   },
   "7483088916037874359": {
      "message": "ไฟล์ใหญ่เกินไป "
   },
   "7488945223835574498": {
      "message": "Postscript"
   },
   "7503234138288940590": {
      "message": "ค้นหา"
   },
   "7507827375601925075": {
      "message": "ย้ายโน้ตไปยังตำแหน่งถัดไป/ก่อนหน้า"
   },
   "7516769578943800930": {
      "message": "เลือกแล้ว"
   },
   "7528204871156404767": {
      "message": "Safari"
   },
   "7528441140724145783": {
      "message": "แก้ไขป้ายกำกับ"
   },
   "7529683448345488779": {
      "message": "รหัสผ่านที่ป้อนไม่ถูกต้อง โปรดป้อนรหัสผ่านอื่น"
   },
   "7530677128711603655": {
      "message": "ผลการค้นหาสำหรับ \"$1​\""
   },
   "7557371320043913847": {
      "message": "คุณใช้ Google Assistant เพื่อสร้างโน้ตหรือรายการตรวจสอบใหม่ใน Keep ได้แล้วตอนนี้"
   },
   "7564771400033548584": {
      "message": "{selectedCount,plural, =1{เลือกไว้ # รายการ}other{เลือกไว้ # รายการ}}"
   },
   "7565383798249439151": {
      "message": "ใน $1​ วัน"
   },
   "7565795669925550891": {
      "message": "แชร์จาก"
   },
   "7579280421767578228": {
      "message": "การเตือนความจำวันไหนสักวัน"
   },
   "7585826646011739428": {
      "message": "แก้ไข"
   },
   "7586291841734385643": {
      "message": "เปิดในแท็บใหม่"
   },
   "7587936635257676112": {
      "message": "เพิ่ม $1​ แล้ว"
   },
   "7598582624136632660": {
      "message": "เปิดแถบค้นหา/ค้นหาถัดไป"
   },
   "7598850438299201663": {
      "message": "กำลังเปิด \"$1​\"..."
   },
   "7599358608613738069": {
      "message": "ลบ"
   },
   "7604275940271852148": {
      "message": "แตกข้อมูลไปยังบัญชีอีเมลของคุณ"
   },
   "7604400308311739073": {
      "message": "ตรึง"
   },
   "7610628906656867728": {
      "message": "เก็บ"
   },
   "7610654194202731772": {
      "message": "ลบ"
   },
   "7624042048123264803": {
      "message": "เปิดโน้ต"
   },
   "7629685876277801112": {
      "message": "เกิดปัญหาในการแสดงไฟล์แผนที่นี้"
   },
   "7630069597298444649": {
      "message": "กด / เพื่อโฟกัสที่ช่องค้นหา"
   },
   "7630723924002267143": {
      "message": "เปิดใช้แป้นพิมพ์ลัด"
   },
   "7631302417932873160": {
      "message": "สแกนหาไวรัสในไฟล์ไม่ได้"
   },
   "7648759818896108920": {
      "message": "+$1​"
   },
   "7649506133540465463": {
      "message": "ไม่สามารถเลิกการดำเนินการได้"
   },
   "7653702763016575386": {
      "message": "น้ำเงิน"
   },
   "7656983816661099886": {
      "message": "สิ่งของ"
   },
   "7659047104232758352": {
      "message": "นั่น|นี่"
   },
   "7669677145513127809": {
      "message": "ย้ายระหว่างไดรฟ์ของทีมใช่ไหม"
   },
   "7669846901402551021": {
      "message": "วันนี้"
   },
   "7690349821507417537": {
      "message": "นำรายการออกแล้ว, $1​"
   },
   "7690355160889785521": {
      "message": "เขียว"
   },
   "7691521283331762131": {
      "message": "โน้ตที่คุณเก็บถาวรจะปรากฏที่นี่"
   },
   "7709557808259730054": {
      "message": "การอนุมัติ"
   },
   "7709889936233398701": {
      "message": "นำออก"
   },
   "7715892737835649602": {
      "message": "คุณยังเพิ่มป้ายกำกับได้โดยพิมพ์ \"#\""
   },
   "772000107335590599": {
      "message": "ใน $1​ นาที"
   },
   "7724602581120994002": {
      "message": "สีส้ม"
   },
   "7728066040934031356": {
      "message": "ม่วง"
   },
   "7734578122414851725": {
      "message": "PHP"
   },
   "7735981667219692675": {
      "message": "{resultCount,plural, =1{ผลการค้นหา # รายการ}other{ผลการค้นหา # รายการ}}"
   },
   "774390292128857049": {
      "message": "ค้นหา"
   },
   "7751981235297474273": {
      "message": "เลิกทำ"
   },
   "7754093419850121316": {
      "message": "⌘"
   },
   "7757440777278143092": {
      "message": "เทาเข้ม"
   },
   "7772544658778579390": {
      "message": "ค้นหาในเอกสาร"
   },
   "777546328624962090": {
      "message": "ไม่สามารถอัปโหลดไฟล์นี้ได้ เรายอมรับเฉพาะไฟล์ $1​ ที่ขนาดเล็กกว่า $2​ MB และ $3​ ล้านพิกเซล"
   },
   "778181404304502404": {
      "message": "ซูมออกจากรายการ"
   },
   "7791050524692390574": {
      "message": "สี"
   },
   "7800318069267901681": {
      "message": "แก้ไข"
   },
   "7814778057875152792": {
      "message": "เกิดปัญหาในการย้ายไฟล์แนบไปยังโฟลเดอร์ที่เลือกใน Google ไดรฟ์"
   },
   "7819314041543176992": {
      "message": "ปิด"
   },
   "7821512290975371360": {
      "message": "ชมพูเจิดจ้า"
   },
   "7828886646639771557": {
      "message": "จดโน้ต…"
   },
   "7830513726270865588": {
      "message": "ปฏิทิน"
   },
   "7842164552344536314": {
      "message": "กำลังจัดระเบียบ..."
   },
   "7844842290699524598": {
      "message": "จำนวนป้ายกำกับถึงขีดจำกัดแล้ว โปรดลบป้ายที่มีอยู่ออกเพื่อเพิ่มป้ายใหม่"
   },
   "7849249492061822610": {
      "message": "กดเครื่องหมายคำถามเพื่อแสดงป๊อปอัปความช่วยเหลือ"
   },
   "785840448809859989": {
      "message": "ตัวเลือกเวลา"
   },
   "7865240075542402013": {
      "message": "เพิ่มดาว"
   },
   "7868324478160174739": {
      "message": "น้ำเงิน"
   },
   "7872546153972922699": {
      "message": "ทำเครื่องหมายรายการเมื่อคุณทำเสร็จแล้ว"
   },
   "7873060817438017568": {
      "message": "$2​ · $1​"
   },
   "7873698934773957560": {
      "message": "ไม่มี"
   },
   "787773550893657271": {
      "message": "เปิดภาพวาดก่อนหน้าแล้ว"
   },
   "7888520165977111723": {
      "message": "ย้ายไปที่ไดรฟ์ของทีมใช่ไหม"
   },
   "7895643887742936844": {
      "message": "อัฒภาค (;)"
   },
   "7906726367011430855": {
      "message": "เชื่อมต่อ"
   },
   "7910887984113996757": {
      "message": "เปิดการแชร์"
   },
   "7911416166208830577": {
      "message": "ความช่วยเหลือ"
   },
   "7922692430438844436": {
      "message": "แตกข้อมูล"
   },
   "792315196550007047": {
      "message": "ไม่มีผลลัพธ์ที่ตรงกัน"
   },
   "7924606175376623897": {
      "message": "กด F เพื่อสลับโน้ตสำหรับตรึงหรือเลิกตรึง"
   },
   "7934833136974560675": {
      "message": "ลองอีกครั้ง"
   },
   "7943657844420237650": {
      "message": "OpenOffice Impress"
   },
   "7946114032014914338": {
      "message": "{repeatSentence} {endSentence}"
   },
   "7947001788143789176": {
      "message": "กำลังโหลด…"
   },
   "7959130747647079558": {
      "message": "{selectedCount,plural, =1{เลือกโน้ตไว้ # รายการ}other{เลือกโน้ตไว้ # รายการ}}"
   },
   "7976461426527138085": {
      "message": "รายการ"
   },
   "7991475666499751798": {
      "message": "ทำเครื่องหมายการช่วยเตือนว่าเสร็จสิ้นแล้ว"
   },
   "7996360883730444101": {
      "message": "ขออภัย เกิดข้อผิดพลาดขณะเปิดไฟล์นี้ โปรดลองอีกครั้ง"
   },
   "7998118521140187915": {
      "message": "ซ่อนความคิดเห็นที่แก้ไขปัญหาแล้ว"
   },
   "8003252582874834655": {
      "message": "การย้ายรายการไปไว้ในไดรฟ์ของทีมจะเปลี่ยนสิทธิ์เข้าถึงและการเป็นเจ้าของ"
   },
   "8010075936095394680": {
      "message": "เวอร์ชันของไฟล์เก่าเกินไป โปรดตรวจสอบว่าไฟล์เป็นรูปแบบล่าสุด "
   },
   "8011497727123874703": {
      "message": "ปุ่มโฟลเดอร์ $1​"
   },
   "8013687642711017862": {
      "message": "{NUM_ITEMS_1,plural, =0{unused plural form}=1{คุณกำลังย้าย 1 รายการออกจากโฟลเดอร์ที่แชร์ ซึ่งจะทำให้คนอื่นเสียสิทธิ์การเข้าถึง}other{คุณกำลังย้าย {NUM_ITEMS_2} รายการออกจากโฟลเดอร์ที่แชร์ ซึ่งจะทำให้คนอื่นเสียสิทธิ์การเข้าถึง}}"
   },
   "8019402848412685977": {
      "message": "เปลี่ยนชื่อ \"$2​\" เป็น \"$1​\" แล้ว"
   },
   "802668096552856965": {
      "message": "{checkedItemCount,plural, =1{รายการที่เสร็จสมบูรณ์แล้ว # รายการ}other{รายการที่เสร็จสมบูรณ์แล้ว # รายการ}}"
   },
   "8043514121228710092": {
      "message": "เพิ่มรูปภาพ"
   },
   "8044700199531805239": {
      "message": "$3​$1​$2​ เชื่อมต่อแล้ว"
   },
   "8046884224424523922": {
      "message": "{NUM_ITEMS_1,plural, =0{unused plural form}=1{ย้าย {NUM_ITEMS_2} ไฟล์จาก {XXX_1} ไปที่ {XXX_2} แล้ว}other{ย้าย {NUM_ITEMS_2} ไฟล์จาก {XXX_3} ไปที่ {XXX_4} แล้ว}}"
   },
   "8063817953234049242": {
      "message": "เครื่องมือเลือก"
   },
   "8066398070826666542": {
      "message": "{count,plural, =1{เสร็จสมบูรณ์แล้วอีก # รายการ}other{เสร็จสมบูรณ์แล้วอีก # รายการ}}"
   },
   "8069384932934428393": {
      "message": "ใน $1​ นาที"
   },
   "807840433749698811": {
      "message": "ฟ้าอมเขียว"
   },
   "8080583426915938264": {
      "message": "แอปในคอมพิวเตอร์ของคุณ"
   },
   "8085493757603803516": {
      "message": "แก้ไขรายการที่เลือก"
   },
   "8090743714060857028": {
      "message": "ผู้ดูไม่สามารถดาวน์โหลด"
   },
   "8095838445486198080": {
      "message": "{FILE_SIZE,plural, =0{0 ไบต์}=1{1 ไบต์}other{# ไบต์}}"
   },
   "8104421162933956065": {
      "message": "โน้ต"
   },
   "8111632928339277375": {
      "message": "{NUM_FOLDERS,plural, =1{ย้ายจาก 1 โฟลเดอร์}=2{ย้ายจากทั้ง 2 โฟลเดอร์}other{ย้ายจากทั้ง # โฟลเดอร์}}"
   },
   "8125425371755035523": {
      "message": "เลิกทำ"
   },
   "8133866583554546341": {
      "message": "$1​ $2​"
   },
   "8139785559888164453": {
      "message": "เรียนรู้เพิ่มเติม"
   },
   "8144512434938656483": {
      "message": "หรือ"
   },
   "8149439558305434788": {
      "message": "$1​ , $2​"
   },
   "8159493406018222636": {
      "message": "ส่งความคิดเห็น"
   },
   "8163781449224244510": {
      "message": "เพิกถอนการเลือกแล้ว"
   },
   "8174654098152723289": {
      "message": "แก้ไขคำอธิบาย"
   },
   "818217888086545352": {
      "message": "เหลือง"
   },
   "8189126656205301402": {
      "message": "คัดลอกไปยัง Google เอกสาร"
   },
   "8193677552005249631": {
      "message": "รายการดาวน์โหลดแอป"
   },
   "8194941811853358224": {
      "message": "เกิดปัญหาในการนำดาวออกจาก \"$1​\""
   },
   "8208179689358649003": {
      "message": "กด E เพื่อเก็บโน้ต"
   },
   "821942580510564685": {
      "message": "โปรดป้อนรหัสผ่านของเอกสารนี้เพื่อดู"
   },
   "8224193807932432983": {
      "message": "การทำงาน"
   },
   "8225614702924834215": {
      "message": "ตัวเลือกเพิ่มเติม"
   },
   "8231449936104909428": {
      "message": "มีปัญหาในการย้าย \"$1​\" ไปยังโฟลเดอร์ที่เลือกในไดรฟ์"
   },
   "8233945959714786736": {
      "message": "ก่อนหน้า"
   },
   "8242655297101700529": {
      "message": "ไดรฟ์ของฉัน"
   },
   "8273434617910595878": {
      "message": "ลง"
   },
   "8281141013543828574": {
      "message": "Raw Image"
   },
   "8292708563843446267": {
      "message": "\"$1​\" จะเป็นเจ้าของรายการ"
   },
   "8304474373444239435": {
      "message": "ตอบโดย $1​"
   },
   "8305505634689906340": {
      "message": "ค้นหาภายใน \"$1​\""
   },
   "8322416564157128458": {
      "message": "การแชร์"
   },
   "8323603365638981303": {
      "message": "คลิกปุ่ม \"ภาพวาดใหม่\" ที่ด้านบน"
   },
   "8337582740675387693": {
      "message": "Java"
   },
   "8342620486324515462": {
      "message": "ปิด"
   },
   "837692854094319105": {
      "message": "ไม่สามารถแชร์กับผู้ใช้ต่อไปนี้ได้เนื่องจากผู้ดูแลระบบของผู้ใช้เหล่านี้ปิดการแชร์กับโดเมนของตน"
   },
   "8379952094517631162": {
      "message": "ไม่"
   },
   "8409190394690387796": {
      "message": "เพิ่มความคิดเห็น"
   },
   "840961447118927153": {
      "message": "{count,plural, =1{สีปัจจุบันคือ$1​ เลือกสีอื่นเพื่อใช้กับโน้ต}other{สีปัจจุบันคือ$1​ เลือกสีอื่นเพื่อใช้กับโน้ต}}"
   },
   "8412098268689886334": {
      "message": "รวม"
   },
   "8412733496413412439": {
      "message": "ออฟไลน์"
   },
   "8422875188929347819": {
      "message": "การแชร์"
   },
   "84334343973701810": {
      "message": "Home"
   },
   "8452647597930138120": {
      "message": "ไฮไลต์เซลล์เพื่อแสดงความคิดเห็น"
   },
   "8453627484113670693": {
      "message": "ส้มอ่อน"
   },
   "8467894483369467251": {
      "message": "Flash"
   },
   "8471029293590878384": {
      "message": "หยุดชั่วคราว"
   },
   "8493378997610580289": {
      "message": "แป้นพิมพ์ลัดเพิ่มเติม"
   },
   "8505989225387082493": {
      "message": "เพิ่มป้ายกำกับ"
   },
   "8509270263487836281": {
      "message": "ลงชื่อเข้าใช้"
   },
   "8517148045938431718": {
      "message": "แก้ไขข้อผิดพลาด"
   },
   "8535303351837089357": {
      "message": "คุณสามารถเลิกทำและทำซ้ำการเปลี่ยนแปลงได้โดยใช้ {modifierKey}+Z และ {modifierKey}+Y"
   },
   "8559513397356310933": {
      "message": "เพิ่มรายการใหม่ไว้ที่ด้านล่าง"
   },
   "8562196940800756925": {
      "message": "ปากกาเมจิก"
   },
   "8587453636009362658": {
      "message": "นำป้ายกำกับออก"
   },
   "8589423377647285975": {
      "message": "$1​ $2​ รายการ $3​"
   },
   "8595175575778060149": {
      "message": "เพิ่มเติม"
   },
   "8596279649507974639": {
      "message": "ย้ายมาที่นี่"
   },
   "8602525917014156029": {
      "message": "สถานที่"
   },
   "8611058223830804795": {
      "message": "ย้ายรายการที่ทำเครื่องหมายลงไปด้านล่าง"
   },
   "8616342546716995946": {
      "message": "รับทราบ"
   },
   "8621067185485606452": {
      "message": "ECMAScript"
   },
   "8621178077822096827": {
      "message": "แทรกรายการแล้ว, $1​"
   },
   "8626694988569301667": {
      "message": "ภาพวาดไม่พร้อมใช้งาน"
   },
   "8637215430007224613": {
      "message": "เปิดภาพวาดถัดไปแล้ว"
   },
   "8652657235429996594": {
      "message": "เร็วๆ นี้"
   },
   "8660016472468563221": {
      "message": "ทวิภาค (:)"
   },
   "8663507590720636709": {
      "message": "$1​ + อีก $2​"
   },
   "8663993454460982287": {
      "message": "ซ่อนช่องทำเครื่องหมายแล้ว"
   },
   "8674222789100049233": {
      "message": "ปิด"
   },
   "86815590954366945": {
      "message": "รายการเนื้อหาที่เก็บไว้"
   },
   "8708723278154759600": {
      "message": "เก็บโน้ตแล้ว"
   },
   "8726038895018570620": {
      "message": "ไปที่ลิงก์"
   },
   "8734569874711220205": {
      "message": "เมนูการนำทาง"
   },
   "8738345098829705526": {
      "message": "ขนาด 12"
   },
   "8773943264600860531": {
      "message": "Internet Explorer"
   },
   "8775097441636640256": {
      "message": "$2​ - $1​"
   },
   "8781837301864053001": {
      "message": "Rich Text"
   },
   "8786673003584562680": {
      "message": "Pg-Up"
   },
   "8790687303221198259": {
      "message": "แอป Chrome"
   },
   "8792038552136453044": {
      "message": "อ๊ะ! เกิดข้อผิดพลาดบางอย่าง"
   },
   "8793166064242077041": {
      "message": "เกิดปัญหาในการแสดงรูปภาพนี้"
   },
   "8797656338249040679": {
      "message": "$2​ติดตั้งส่วนขยาย Google Keep ใน Chrome$1​เพื่อบันทึกข้อมูลสำคัญไว้ใน Keep เพียงคลิกเดียว"
   },
   "8822326207328431952": {
      "message": "ไม่สามารถอัปโหลดรูปได้"
   },
   "8825353897919495748": {
      "message": "{NUM_ITEMS,plural, =0{unused plural form}=1{คุณแน่ใจหรือไม่ว่าต้องการย้ายไฟล์นี้}other{คุณแน่ใจหรือไม่ว่าต้องการย้ายไฟล์เหล่านี้}}"
   },
   "8845176264121061589": {
      "message": "ยกเลิกการทำเครื่องหมายรายการทั้งหมด"
   },
   "8852550049823214385": {
      "message": "แล้ว"
   },
   "8860658114732392347": {
      "message": "ลบการเตือนความจำ"
   },
   "8867634760949689122": {
      "message": "ไม่สามารถแปลงไฟล์เนื่องจากหมดเวลาในการแปลง โปรดลองอีกครั้งในภายหลัง"
   },
   "8868758864963683383": {
      "message": "ยกเลิกการเลือกโน้ต"
   },
   "8869202143464930500": {
      "message": "โอนการเป็นเจ้าของให้ $1​ ใช่ไหม"
   },
   "887001400549949730": {
      "message": "เปิดในหน้าต่างใหม่"
   },
   "8889019648958415451": {
      "message": "ไฟล์ที่ไม่รู้จัก"
   },
   "8903612093856047007": {
      "message": "ผู้ทำงานร่วมกัน"
   },
   "8905995985388209337": {
      "message": "ยอมรับ"
   },
   "8917554093651202032": {
      "message": "เล่น $1​"
   },
   "8919660666733306860": {
      "message": "Image"
   },
   "8923591894816841670": {
      "message": "เลื่อนการเลือกลงแล้ว"
   },
   "8925842014466254066": {
      "message": "กำลังคัดลอกไปที่ Google เอกสาร"
   },
   "8930959387403789939": {
      "message": "เตือนความจำ"
   },
   "8931267220766224111": {
      "message": "เปิดการช่วยเตือนของ Google Keep ไหม คุณอาจต้องอนุญาตให้มีการแจ้งเตือนของเบราว์เซอร์"
   },
   "8938626240031421092": {
      "message": "สลับช่องทำเครื่องหมาย"
   },
   "8943760679396635042": {
      "message": "กำลังแสดง $1​"
   },
   "8962132866274125834": {
      "message": "ทำซ้ำ"
   },
   "896590342186332268": {
      "message": "ขนาด 16"
   },
   "8975305711699693093": {
      "message": "ซ่อนคอลัมน์ความคิดเห็น"
   },
   "8978442832029227748": {
      "message": "Google Jamboard"
   },
   "8979104019474011578": {
      "message": "{every,plural, =1{เกิดซ้ำทุกสัปดาห์}other{เกิดซ้ำทุก # สัปดาห์}}"
   },
   "8979615310931291676": {
      "message": "แก้ไขเมื่อ $1​"
   },
   "8988925599985431446": {
      "message": "เลิกตรึง"
   },
   "8990769651805334695": {
      "message": "เปิด"
   },
   "900086393693234779": {
      "message": "บ้าน"
   },
   "9003585743562048321": {
      "message": "ซิงค์ความคิดเห็นไม่ได้เนื่องจากข้อผิดพลาดของเครือข่าย"
   },
   "9012753183662045049": {
      "message": "ป้อนชื่อป้ายกำกับให้สั้นลง"
   },
   "9012809035908808124": {
      "message": "กด $1​ + G เพื่อสลับระหว่างมุมมองแบบรายการและแบบตาราง"
   },
   "9021945828354340363": {
      "message": "{count,plural, =1{โน้ตนี้จะไม่แชร์กับคุณอีกต่อไป}other{โน้ตเหล่านี้จะไม่แชร์กับคุณอีกต่อไป}}"
   },
   "9024023699330078373": {
      "message": "การเปิดรายการนี้จะเพิ่มรายการไปที่ไดรฟ์ของคุณ"
   },
   "9058308423774656474": {
      "message": "Hangul Word Processor"
   },
   "9063863448028905602": {
      "message": "นำออกจากผลลัพธ์"
   },
   "9072994494820207560": {
      "message": "รายการที่ทำเครื่องหมายแล้ว"
   },
   "9085138628465656064": {
      "message": "ลงชื่อเข้าใช้"
   },
   "9094248058931620597": {
      "message": "ยุบแผงรายละเอียดแล้ว"
   },
   "911586799466052745": {
      "message": "OpenOffice Draw"
   },
   "911698676339750373": {
      "message": "กลุ่มครอบครัว"
   },
   "9121915169985572840": {
      "message": "เปลี่ยนสี"
   },
   "9124422680181020503": {
      "message": "ลบภาพวาดแล้ว"
   },
   "9129734193759025482": {
      "message": "พรุ่งนี้"
   },
   "9131268871618792263": {
      "message": "{NUM_ITEMS,plural, =0{unused plural form}=1{unused plural form}other{สมาชิกในไดรฟ์ของทีมจะเสียสิทธิ์การเข้าถึง เว้นแต่ว่าจะมีการแชร์รายการเหล่านี้ให้}}"
   },
   "9149141099919589043": {
      "message": "ค่าที่คั่นด้วยเครื่องหมายจุลภาค"
   },
   "9155213204821633067": {
      "message": "ยกเลิกการเลือก $1​ แล้ว"
   },
   "9180910903828232576": {
      "message": "{NUM_ITEMS_1,plural, =0{unused plural form}=1{เพิ่ม {NUM_ITEMS_2} โฟลเดอร์ไปที่ {XXX_1} แล้ว}other{เพิ่ม {NUM_ITEMS_2} โฟลเดอร์ไปที่ {XXX_2} แล้ว}}"
   },
   "9197837492705576727": {
      "message": "ไปที่รายการถัดไป"
   },
   "919969969251998566": {
      "message": "แตกไฟล์ที่บีบอัดนี้ลงในบัญชีอีเมลของคุณ"
   },
   "9203454763088526300": {
      "message": "ไม่พบข้อความ"
   },
   "9213031420087755232": {
      "message": "ล้างข้อมูลบนหน้า"
   },
   "9220412150349575379": {
      "message": "นิ้ว"
   },
   "938074023403688885": {
      "message": "นำออก"
   },
   "951963820437151566": {
      "message": "Google Sites"
   },
   "960732173870658714": {
      "message": "เอกสาร Google Keep"
   },
   "969509857504028202": {
      "message": "การย้ายไฟล์ออกจากไดรฟ์ของทีมจะเปลี่ยนสิทธิ์เข้าถึงและการเป็นเจ้าของ"
   },
   "976103457024703736": {
      "message": "ไม่สามารถเปิด \"$1​\""
   },
   "985197728509875956": {
      "message": "Chemical Model"
   },
   "991852286447868510": {
      "message": "กำลังค้นหา $1​"
   },
   "99635082918315028": {
      "message": "จับข้อความจากรูปภาพแล้ว"
   },
   "996381410993745580": {
      "message": "Photoshop"
   },
   "996406443443155276": {
      "message": "เปิด \"$1​\" ไม่ได้"
   },
   "appDesc": {
      "description": "App description",
      "message": "เก็บไอเดียดีๆ ทุกทีที่คิดได้ พร้อมแชร์ความคิดนั้นกับเพื่อนๆ และครอบครัวได้ทันที"
   },
   "appName": {
      "description": "App name",
      "message": "Google Keep - โน้ตและรายการ"
   },
   "shortName": {
      "description": "App short name",
      "message": "Google Keep"
   }
}
