%YAML 1.1
%TAG !u! tag:unity3d.com,2011:
--- !u!114 &11400000
MonoBehaviour:
  m_ObjectHideFlags: 0
  m_CorrespondingSourceObject: {fileID: 0}
  m_PrefabInstance: {fileID: 0}
  m_PrefabAsset: {fileID: 0}
  m_GameObject: {fileID: 0}
  m_Enabled: 1
  m_EditorHideFlags: 0
  m_Script: {fileID: 11500000, guid: 787d610b11404e56bc92ba174890a468, type: 3}
  m_Name: CrossBuildingGhostData
  m_EditorClassIdentifier: 
  <Label>k__BackingField: Cross
  <Icon>k__BackingField: {fileID: 7482667652216324306, guid: 51cc949528a8abf4b85593fa8b5ab33a, type: 3}
  <IconTint>k__BackingField: {r: 0.9960785, g: 0.75294125, b: 0, a: 1}
  <BuildingPrefab>k__BackingField: {fileID: 3963908977418127580, guid: 7627bd4bced90b14fbb459ba6dcb7693, type: 3}
  <BuildingGhost>k__BackingField: {fileID: 7355055891099941678, guid: d4e276971f2e7374d91ff25118b0b0fa, type: 3}
