%YAML 1.1
%TAG !u! tag:unity3d.com,2011:
--- !u!1 &4129952294408020194
GameObject:
  m_ObjectHideFlags: 0
  m_CorrespondingSourceObject: {fileID: 0}
  m_PrefabInstance: {fileID: 0}
  m_PrefabAsset: {fileID: 0}
  serializedVersion: 6
  m_Component:
  - component: {fileID: 7295173871046319942}
  - component: {fileID: 4129952294408020195}
  m_Layer: 0
  m_Name: Building Ghost Container
  m_TagString: Untagged
  m_Icon: {fileID: 0}
  m_NavMeshLayer: 0
  m_StaticEditorFlags: 0
  m_IsActive: 1
--- !u!4 &7295173871046319942
Transform:
  m_ObjectHideFlags: 0
  m_CorrespondingSourceObject: {fileID: 0}
  m_PrefabInstance: {fileID: 0}
  m_PrefabAsset: {fileID: 0}
  m_GameObject: {fileID: 4129952294408020194}
  m_LocalRotation: {x: -0, y: -0, z: -0, w: 1}
  m_LocalPosition: {x: 0, y: 0, z: 0}
  m_LocalScale: {x: 1, y: 1, z: 1}
  m_ConstrainProportionsScale: 0
  m_Children: []
  m_Father: {fileID: 0}
  m_RootOrder: 0
  m_LocalEulerAnglesHint: {x: 0, y: 0, z: 0}
--- !u!114 &4129952294408020195
MonoBehaviour:
  m_ObjectHideFlags: 0
  m_CorrespondingSourceObject: {fileID: 0}
  m_PrefabInstance: {fileID: 0}
  m_PrefabAsset: {fileID: 0}
  m_GameObject: {fileID: 4129952294408020194}
  m_Enabled: 1
  m_EditorHideFlags: 0
  m_Script: {fileID: 11500000, guid: 5ced956387cd41e69df0ef3335cd4ace, type: 3}
  m_Name: 
  m_EditorClassIdentifier: 
  <BuildingPrefab>k__BackingField: {fileID: 0}
  <Ghost>k__BackingField: {fileID: 0}
  terrainTilemap: {fileID: 0}
  placementGrid: {fileID: 0}
  placementTile: {fileID: 0}
  invalidPlacementTile: {fileID: 0}
  placementTilemapRadius: 0
  obstacleLayerMask:
    serializedVersion: 2
    m_Bits: 0
  additionalRules: []
