<?xml version="1.0" encoding="utf-8"?>
<svg width="1280" height="640" xmlns="http://www.w3.org/2000/svg">
	<defs>
		<pattern id="grid" width="7.142%" height="14.285%" patternUnits="userSpaceOnUse">
			<path d="M 0 91 L 91 0" fill="none" stroke="#41063F " stroke-dasharray="2,2" stroke-width="2"/>
			<path d="M 0 0 L 91 91" fill="none" stroke="#41063F " stroke-dasharray="2,2" stroke-width="2"/>
		</pattern>
	</defs>
	<rect width="100%" height="100%" fill="url(#grid)" />
</svg>