id,Дата_рождения,Университет,Факультет,Город_рождения,Семейное_положение,Пол,Имя,Фамилия,Город_проживания,Тип обучения,Отношение_к_алкоголю,Главное_в_жизни,Главное_в_людях,Отношение_к_курению,Статус обучения
838812643,1.1.2000,ОмА МВД России (бывш. ОВШМ МВД СССР),Общеюридический факультет,,Не указано,Мужской,Слава,Макс,Омск,,,,,,
838803882,10.12.1985,,,,Не указано,Мужской,Сахил,Сахил,Омск,,,,,,
838802208,26.1.1976,ОмГПУ,Факультет естественно-научного образования,,Не указано,Женский,Ольга,Ольга,Омск,Очное отделение,,,,,
838799142,2.2.1949,,,,Не указано,Мужской,Юра,Лавриненко,Омск,,,,,,
838794800,23.11.2000,,,,Не указано,Женский,Людмила,Перова,Омск,,,,,,
838790535,5.5.1967,,,,Не указано,Женский,Ирина,Соловей,Омск,,,,,,
838785669,11.4.1983,,,,Не указано,Мужской,Дмитрий,Лукин,Омск,,,,,,
838784204,22.7.1941,,,,Не указано,Мужской,Карл,Маркс,Омск,,,,,,
838782669,9.12.1954,,,,Не указано,Мужской,Валерий,Кручинкин,Омск,,,,,,
838763573,23.7.2000,ОмГПУ,"Факультет экономики, менеджмента, сервиса и туризма",,Не указано,Мужской,Егор,Пашкевич,Омск,,,,,,
838753629,30.3.2002,,,,Не указано,Женский,Карина,Гаврусева,Омск,,,,,,
838748126,2.4.1982,,,,Не указано,Женский,Марина,Ку,Омск,,,,,,
838747966,29.10.2004,,,г. Омск,Не указано,Женский,Алина,Марченко,Омск,,,,,,
838742771,10.5.1992,,,,Не указано,Мужской,Студия-Печати,Марка,Омск,,,,,,
838740206,5.5.1970,ОмГПУ,Филологический факультет,,Не указано,Женский,Alena,Tipsina,,,,,,,
838738211,10.12.1971,,,,Не указано,Женский,Марина,Лог,Омск,,компромиссное,0.0,юмор и жизнелюбие,резко негативное,
838731242,9.1.1965,ОмГМУ (бывш. ОмГМА),,,Не указано,Мужской,Александр,Рубцов,Омск,,,,,,
838730988,6.1.2000,,,,Не указано,Женский,София,Белоусова,Омск,,,,,,
838727728,14.12.2009,,,,Не указано,Мужской,Никита,Вунш,Омск,,,,,,
838723859,23.2.1959,,,,Не указано,Мужской,Сергей,Москаленко,Омск,,,,,,
838723313,21.6.1999,,,,Не указано,Мужской,Артём,Розов,Омск,,,,,,
838719139,1.7.1993,ОмГАУ,,,Не указано,Мужской,Владимир,Войтюк,Омск,,,,,,
838713703,15.6.1995,,,,Не указано,Женский,Твоя,Королева,Омск,,,,,,
838712719,6.8.1954,,,,Не указано,Женский,Наталья,Захарова,Омск,,,,,,
838709615,23.8.2002,,,Омск,Не указано,Женский,Елизавета,Харватова,Омск,,,,,,
838709444,6.1.1987,,,,Не указано,Мужской,Максим,Урусов,Омск,,,,,,
838708502,23.2.1988,ОмГМУ (бывш. ОмГМА),Лечебный факультет,,Не указано,Мужской,Ахмад,Имунов,Омск,,,,,,
838702269,25.9.2009,,,,Не указано,Мужской,Егор,Тананов,Омск,,,,,,
838701841,10.9.1960,,,,Не указано,Мужской,Александр,Мирко,Омск,,,,,,
838701334,18.10.1969,,,,Не указано,Мужской,Игорь,Митясов,Омск,,,,,,
838697805,12.3.1998,,,,,Женский,Оксана,Ефимова,Омск,,,,,,
838693351,31.12.1986,,,,Не указано,Женский,Моника,Ротт,Омск,,,,,,
838693276,21.2.1966,Финуниверситет при Правительстве РФ ОФ (бывш. ВЗФЭИ),Факультет экономики,,Не указано,Мужской,Иван,Рейник,Омск,,,,,,
838691784,17.6.1983,,,,Не указано,Мужской,Алексей,Васильев,Омск,,,,,,
838691322,18.5.1982,,,,Не указано,Женский,Елена,Швейцер,Омск,,,,,,
838691140,10.9.1964,,,,Не указано,Мужской,Егор,Летов,Омск,,,,,,
838690046,8.5.1976,,,,Не указано,Женский,Оля,Корючина,Омск,,,,,,
838688489,7.11.1956,,,,Не указано,Женский,Валентина,Дьяченко,Омск,,,,,,
838688446,21.1.1984,,,,Не указано,Женский,Nasty,Nasty,Омск,,,,,,
838688284,31.1.1972,,,,Не указано,Женский,Жанар,Успанова,Омск,,,,,,
838686268,4.1.1963,"СибАДИ
",Факультет «Автомобильный транспорт»,,Женат / замужем,Мужской,Константин,Минцев,,,,,,,
838683320,19.5.1975,"ОмУДТ (бывш. ОГИС, ОмТИ)",Экономический факультет,,Не указано,Женский,Анна,Муромцева,,Очное отделение,компромиссное,,доброта и честность,негативное,Выпускница (специалист)
838680750,22.12.1999,,,,Не указано,Мужской,Андрей,Кирилл,Омск,,,,,,
838679819,,,,,,Мужской,Alexander,Incognito,Омск,,,,,,
838678428,11.1.1991,ОАБИИ ВА МТО,1-й инженерный факультет,,Не указано,Мужской,Дмитрий,Мальцев,Омск,,,,,,
838677110,12.8.1991,НГАУ,,Омск,Не женат / не замужем,Мужской,Антон,Анатольевич,,,,,,,
838674343,22.4.2000,,,,Не указано,Мужской,Кирилл,Олейник,Омск,,,,,,
838669648,1.12.1996,,,,Не указано,Мужской,Герман,Вердук,Омск,,,,,,
838668124,1.1.1991,,,,Не указано,Женский,Агаар,Бойдус,Омск,,,,,,
838663856,19.12.1988,,,,Не указано,Женский,Евгения,Подорван,Омск,,,,,,
838661054,22.8.2003,,,,,Женский,Milana,Nekrasova,Омск,,,,,,
838659687,19.11.1968,,,,,Женский,Оксана,Михальцова,Омск,,,,,,
838656065,1.7.1961,ОмГТУ,,,Не указано,Мужской,Владимир,Ганичев,Омск,,,,,,
838654449,3.12.1987,,,,Не указано,Женский,Оля,Красивая,Омск,,,,,,
838654441,16.3.1978,,,Омск,Не указано,Мужской,Юра,Плотников,Омск,,,,,,
838651112,20.10.2002,,,Омск,Не указано,Женский,Алина,Анорина,,,,,,,
838647413,26.6.1991,,,,Не указано,Женский,Елизавета,Антипова,Омск,,,,,,
838644916,10.10.1997,,,,Не указано,Женский,Екатерина,Бакирова,Омск,,,,,,
838638822,12.12.1991,,,,,Женский,Наталья,Авдеева,Омск,,,,,,
838638486,,,,,,Женский,Оскорпена,Богданова,Омск,,,,,,
838637480,15.12.1986,,,,Не указано,Мужской,Кирил,Лантух,Омск,,,,,,
838633845,10.7.2000,,,,Не указано,Мужской,Bublik,Suslik,Омск,,,,,,
838632260,4.5.2004,,,,Не указано,Мужской,キリル,・マクシモフ,,,,,,,
838631880,12.6.2008,,,Омск,Всё сложно,Женский,Клеопа,Котова,Омск,,нейтральное,саморазвитие,ум и креативность,нейтральное,
838631798,12.5.1988,ОмГПУ,,,Не указано,Мужской,Юрий,Тимошенко,Омск,,,,,,
838625054,13.10.1988,,,,Не указано,Мужской,Александр,Бурдаев,Омск,,,,,,
838624803,2.6.1974,,,,Не указано,Мужской,Сергей,Новиков,Омск,,,,,,
838618596,13.6.1985,,,,Не указано,Женский,Марина,Янычева,Омск,,,,,,
838617378,28.10.1993,ОмГАУ,Экономический факультет,,Не указано,Мужской,Давид,Соколов,Омск,,,,,,
838612795,1.1.2000,,,,Не указано,Мужской,Виктор,Лазерев,Омск,,,,,,
838612707,,,,,Не указано,Мужской,Шершень,Белый,Омск,,,,,,
838612642,21.5.1996,,,,Не женат / не замужем,Мужской,Юсик,Юлдашев,Омск,,,,,,
838610614,5.11.1969,"СибАДИ
",Факультет «Автомобильный транспорт»,,Не указано,Мужской,Андрей,Силантьев,Омск,Очное отделение,,,,,
838609154,,,,Омск,Влюблён / влюблена,Женский,Марита,Камплиш,Омск,,,,,,
838607635,23.8.1980,,,,Не указано,Женский,Ольга,Штерц,Омск,,,,,,
838604969,,,,,,Женский,Марина,Яловнарова,Омск,,,,,,
838604855,17.5.1982,,,,Не указано,Мужской,Денис,Козицкий,Омск,,,,,,
838602297,22.9.2008,,,,Не указано,Женский,Ксюша,Щуринова,Омск,,,,,,
838598900,26.7.1977,ОмГТУ,Факультет гуманитарного образования,,Не указано,Женский,Ирина,Масленникова,Омск,,,,,,
838597396,11.12.1978,,,,Не указано,Женский,Наталья,Калинина,Омск,,,,,,
838595035,27.1.1979,,,,Не указано,Мужской,Георгий,Власов,Омск,,,,,,
838585509,30.6.2000,,,,,Женский,Анна,Кирова,Омск,,,,,,
838585471,8.2.1967,,,,Не указано,Женский,Светлана,Иордан,Омск,,,,,,
838583104,15.7.2006,"СибАДИ
",Факультет «Экономика и управление»,Омск,В активном поиске,Женский,Аня,Краснова,Омск,,,,,,Студентка (специалист)
838579046,26.8.1961,,,,Не указано,Мужской,Владимир,Журбин,Омск,,,,,,
838578744,27.11.1960,,,,Не указано,Женский,Наталья,Гиззатулина,Омск,,,,,,
838575277,4.5.1980,,,,Не указано,Женский,Алена,Шейкина,Омск,,,,,,
838571306,16.1.1978,,,,Не указано,Мужской,Андрей,Голованов,Омск,,,,,,
838570200,11.10.1964,,,,Не указано,Женский,Татьяна,Павлова,Омск,,,,,,
838566277,22.4.1965,,,,Не указано,Женский,Татьяна,Ярош,Омск,,,,,,
838566200,29.11.1957,,,,Не указано,Женский,Людмила,Осипова,Омск,,,,,,
838564630,22.11.2009,,,,Не указано,Женский,Барабанова,Елизавета,Омск,,,,,,
838563659,16.3.1983,ОмГУ им. Ф. М. Достоевского,"Факультет теологии, философии и мировых культур (Социально-гуманитарный факультет)",,Не указано,Женский,Таня,Сорокоумова,Омск,,,,,,
838561228,8.7.2002,,,,Не указано,Женский,Алина,Яблокина,Омск,,,,,,
838559127,29.8.1961,,,,Не указано,Мужской,Владимир,Румянцев,Омск,,,,,,
838559059,10.1.1982,,,,Не указано,Женский,Ольга,Дрючина,Омск,,,,,,
838558835,5.3.1991,,,,Не указано,Женский,Анна,Тадевосян,Омск,,,,,,
838554744,,,,,,Женский,Ангелина,Милюк,Омск,,,,,,
838551709,9.9.2004,ОмГПУ,Факультет искусств,,Не указано,Женский,Александра,Миланич,Омск,,,,,,
838542347,1.1,,,,,Мужской,Максимка,Кто,Омск,,,,,,
838541775,1.4.1988,РГППУ (ОФ),Факультет высшего образования,,Не указано,Мужской,Андрей,Фомых,Омск,Очное отделение,,,,,
838539795,21.8.1989,ОмГУ им. Ф. М. Достоевского,,,Не указано,Женский,Таня,Анисимова,Омск,,,,,,
838538909,9.3,,,,Не указано,Мужской,Arty,Uyfgfsefsfsfgeorgeajdjamjamesleo,Омск,,,,,,
838532878,19.11.1998,,,,Не указано,Мужской,Kompanesc,Kompa,Омск,,,,,,
838522617,24.8.2004,,,,Не указано,Женский,Елизавета,Меркулова,Омск,,,,,,
838513259,31.10.1963,,,,Не указано,Женский,Наталия,Максимова,Омск,,,,,,
838507159,11.11.2002,,,Омск,В активном поиске,Женский,Анна,Савина,Омск,,нейтральное,,доброта и честность,нейтральное,
838505268,17.4.1993,,,,Не указано,Женский,Анастасия,Валерьевна,Омск,,,,,,
838504690,4.9.1977,,,,Не указано,Женский,Наталья,Русакова,Омск,,,,,,
838504428,14.5.2000,Омский филиал РАНХиГС,Кафедра экономики и управления,,Не указано,Мужской,Avenger,Sdg-Sx,Омск,,,,,,
838501712,11.2.2002,,,,Не указано,Мужской,Адам,Синкап,Омск,,,,,,
838501121,15.1.1987,,,,Не указано,Мужской,Жас,Жас,Омск,,,,,,
838499520,6.8,ОИВТ (ф) СГУВТ (бывш. НГАВТ),Технический факультет,,Не женат / не замужем,Мужской,Андрей,Фабрициус,,,,,,,
838494428,26.12.2004,,,,Не указано,Женский,Диана,Колесникова,Омск,,,,,,
838493986,8.1.1989,,,,Не указано,Мужской,Марат,Шакпаков,Омск,,,,,,
838491379,22.9.2009,,,,,Женский,Aleksandra,Lyuft,Омск,,,,,,
838484945,20.5.1965,,,,Не указано,Женский,Марина,Третьякова,Омск,,,,,,
838481385,20.9.2008,,,,Не указано,Женский,Ксения,Ширшова,Омск,,,,,,
838480778,12.12.1988,,,,Не указано,Мужской,Tczyan,Li,Омск,,,,,,
838476678,5.5.1988,ОмГПУ,Факультет иностранных языков,Сочи,В активном поиске,Мужской,Михаил,Новиков,Омск,,,,,,
838471271,24.2.2004,,,Омск,Не указано,Мужской,Алексей,Чиянов,,,,,,,
838470689,29.3.1987,,,,Не указано,Женский,Аленчик,Фед,Омск,,,,,,
838464688,17.9.1954,,,,Не указано,Женский,Таисия,Шуваева,Омск,,,,,,
838464497,22.9.2002,ОмГУ им. Ф. М. Достоевского,Факультет математики и информационных технологий,,Не указано,Мужской,Сергей,Игнатьев,Омск,,,,,,
838463987,9.12.1969,,,,Не указано,Мужской,Самат,Омаров,Омск,,,,,,
838462763,31.1.1994,,,,Не указано,Мужской,Иван,Соболев,Омск,,,,,,
838460582,11.12.2006,,,,Не указано,Мужской,Стас,Нейман,Омск,,,,,,
838460011,9.4.1958,,,,Не указано,Женский,Бочанцева,Людмила,Омск,,,,,,
838457912,17.9.1976,,,,Не указано,Женский,Татьяна,Русанова,Омск,,,,,,
838454888,9.4.2002,,,,Не указано,Мужской,Максим,Гофман,Омск,,,,,,
838448180,25.9.1991,,,,Не указано,Мужской,Александр,Сивков,Омск,,,,,,
838445152,4.6.2008,,,,Не указано,Мужской,Kirill,German,,,,,,,
838443085,2.1.1980,,,,Не указано,Мужской,Qwerty,Qaz,Омск,,,,,,
838439742,20.12.1996,,,,Не указано,Мужской,Айдар,Гизатуллин,Омск,,,,,,
838438468,3.11.1987,,,,Не указано,Женский,Ольга,Гиндер,Омск,,,,,,
838437652,16.4.1956,СибГУФК,,,Не указано,Мужской,Сергей,Серебряков,Омск,,,,,,
838437167,25.12.1986,,,,Не указано,Мужской,Александр,Волков,Омск,,,,,,
838436975,5.9.2008,,,,Не указано,Мужской,Яромир,Соловьёв,Омск,,,,,,
838430559,31.5.2009,,,,Не указано,Мужской,Пивкин,Назар,Омск,,,,,,
838430275,10.7.2008,,,,Не указано,Женский,Алина,Мясникова,Омск,,,,,,
838428108,15.11.1974,"СибАДИ
",Инженерно-строительный институт,,Не указано,Мужской,Алексей,Соломкин,,Очное отделение,,,,,
838427715,2.4.1962,,,,Не указано,Мужской,Тулеген,Барсуков,Омск,,,,,,
838425948,30.8.1964,,,,Не указано,Женский,Елена,Чернявская,Омск,,,,,,
838422744,23.5.1995,,,,Не указано,Мужской,Егор,Самойлов,Омск,,,,,,
838421995,11.11.2008,,,,Не указано,Женский,Дарья,Сотникова,Омск,,,,,,
838421954,3.11.1957,ОмГАУ,Экономический факультет,,Не указано,Женский,Надежда,Ревякина,Омск,,,,,,
838420086,7.7.1995,,,,Не указано,Мужской,Александр,Васильевич,Омск,,,,,,
838417028,4.2.2009,,,,Не указано,Женский,Милана,Неустроева,Омск,,,,,,
838416982,31.3.1954,,,,Не указано,Женский,Тамара,Иванова,Омск,,,,,,
838414903,16.12.2007,,,,Не указано,Мужской,Юрий,Степанов,Омск,,,,,,
838403106,17.10.1962,,,,Не указано,Женский,Ирина,Неделько,Омск,,,,,,
838398644,1.1.1958,"ОмУДТ (бывш. ОГИС, ОмТИ)",,,Не указано,Женский,Мария,Зажогина,Омск,,,,,,
838396803,22.11.1933,,,,Не указано,Мужской,Владимир,Иванов,Омск,,,,,,
838396364,13.11.1972,,,,Не указано,Мужской,Андрей,Трочинский,Омск,,,,,,
838396185,7.5.1992,,,,Не указано,Женский,Настюша,Гарейс,Омск,,,,,,
838395850,1.9.2004,"ОмГУПС
",Институт наземных транспортных систем,,Не указано,Мужской,Кирилл,Алтухов,Омск,,,,,,
838393362,5.1.1984,,,,Не указано,Мужской,Кирил,Степанов,Омск,,,,,,
838392345,30.4.2002,,,,Не указано,Мужской,Артём,Крест,Омск,,,,,,
838384122,18.4.1955,"СибАДИ
",Факультет «Автомобильные дороги и мосты»,,Не указано,Мужской,Андрей,Телевной,Омск,,,,,,
838378478,5.8.1969,ОмГМУ (бывш. ОмГМА),Педиатрический факультет,,Не указано,Женский,Елена,Граф,Омск,,,,,,
838376530,,,,,,Мужской,Iliyaz,Kaldybaev,Омск,,,,,,
838372750,29.4.1959,,,,Не указано,Женский,Светлана,Борзенко,Омск,,,,,,
838370593,1.3.1999,ОмГАУ,"Факультет агрохимии, почвоведения, экологии, природообустройства и водопользования",,Не указано,Мужской,Болат,Назар,Омск,,,,,,
838369322,16.11.1972,,,,Не указано,Мужской,Александр,Чардынцев,Омск,,,,,,
838366627,3.8.2005,"ОмГУПС
",Институт менеджмента и экономики,,Не указано,Мужской,Bogdan,Terekhov,Омск,,,,,,
838365975,10.8.2000,,,,Не указано,Мужской,Андрей,Клейм,Омск,,,,,,
838360151,6.6.1994,ОмГАУ,Экономический факультет,,Не указано,Женский,Анжелика,Новикова,Омск,,нейтральное,семья и дети,смелость и упорство,нейтральное,
838359957,,,,Омск,В активном поиске,Женский,Мужской-Клуб,Омск,Омск,,,,,,
838359579,1.2.1981,,,,Не указано,Женский,Светлана,Ирхина,Омск,,,,,,
838358920,20.3.1984,ОмГАУ,Экономический факультет,,Не указано,Женский,Елена,Макаренкова,Омск,,,,,,
838355195,15.10.1975,,,,Не указано,Мужской,Игорь,Волченко,Омск,,,,,,
838353636,20.3.2003,,,,Не указано,Женский,Алина,Логинова,Омск,,,,,,
838351387,1.7.1980,,,,Не указано,Женский,Гульнара,Садвакасова,Омск,,,,,,
838350725,3.6.2009,,,,Не указано,Женский,Дарья,Побыванец,Омск,,,,,,
838350291,1.1.2000,,,,Не указано,Женский,Гламур,Работа,Омск,,,,,,
838349777,2.10.1973,,,,Не указано,Женский,Ирина,Дорошенко,Омск,,,,,,
838349096,25.12.1975,,,,Не указано,Женский,Таня,Котису,Омск,,,,,,
838344231,22.1.2007,,,Советская Гавань,Влюблён / влюблена,Мужской,Danya,Obuhov,,,резко негативное,карьера и деньги,доброта и честность,нейтральное,
838343443,29.10.2004,,,,Не указано,Женский,Хрусия,Чемольдинова,Омск,,,,,,
838342088,3.2.1991,"ИПЭК
",Факультет права и экономики,,Не указано,Женский,Мольская,Анастасия,Омск,,,,,,
838335263,5.7.2000,,,Элиста,Не указано,Мужской,Эрик,Шамирян,Омск,,,,,,
838332967,19.12.1965,ОмГМУ (бывш. ОмГМА),Лечебный факультет,,Не указано,Мужской,Юрий,Бабыкин,Омск,,,,,,
838331629,13.12.2007,,,Казань,Не указано,Женский,Akmal,Hamal,Омск,,,,,,
838330798,24.3.1982,ОмГПУ,"Факультет математики, информатики, физики и технологии",,Не указано,Женский,Светлана,Побережник,Омск,,,,,,
838329185,10.8.1959,,,,Не указано,Женский,Валентина,Белозерова,Омск,,,,,,
838324572,25.7.1973,,,,Не указано,Женский,Наталья,Гофман,Омск,,,,,,
838323933,25.6.1985,,,,Не указано,Мужской,Сергей,Петров,Омск,,,,,,
838323835,13.4.1943,,,,Не указано,Мужской,Анатолий,Чебунин,Омск,,,,,,
838321698,1.11.1988,ОмГТУ,,,Не указано,Мужской,Дмитрий,Сокур,Омск,,,,,,
838320723,28.2.1984,,,,Не указано,Женский,Ирина,Абшилава,Омск,,,,,,
838320397,9.12.1989,ОмГТУ,Факультет экономики и управления,,Не указано,Женский,Анастасия,Мартенс,Омск,,,,,,
838319680,18.4.1988,,,,Не указано,Мужской,Sergo,Serg,Омск,,,,,,
838319587,28.2.1976,,,,Не указано,Женский,Надежда,Мерсанова,Омск,,,,,,
838319577,22.5.1993,,,Омск,Всё сложно,Мужской,Development,Profile,Омск,,,,,,
838316465,3.6.2000,"СибАДИ
",Факультет «Автомобильные дороги и мосты»,,Не указано,Женский,Ольга,Козубович,Омск,,,,,,
838313127,15.12.1984,,,,Не указано,Мужской,Иван,Любич,Омск,,,,,,
838312954,23.3.1993,СКИТУ (филиал) МГУТУ им. К. Г. Разумовского (бывш. РосЗИТиЛП),,,Не указано,Мужской,Арсений,Безруков,Омск,,,,,,
838310054,,,,Омск,Не указано,Мужской,Дмитрий,Иванов,Омск,,,,,,
838309964,28.5.1985,"ИПЭК
",,,Не указано,Мужской,Сергей,Терещенко,Омск,,,,,,
838309693,24.8.2008,,,,Не указано,Мужской,No,Name,Омск,,,,,,
838308758,11.2.1956,,,,Не указано,Женский,Ольга,Старовойтова,Омск,,,,,,
838306295,13.7.1961,,,,Не указано,Мужской,Вов,Вов,Омск,,,,,,
838306212,22.6.1947,ОмГПУ,Географический факультет,,Не указано,Женский,Екатерина,Губарева,Омск,,,,,,
838305327,21.2.1999,,,,,Женский,Дарья,Мильке,Омск,,,,,,
838304944,6.12.1963,,,Омск,Не указано,Мужской,Сергей,Лозюк,Омск,,,,,,
838294411,25.3.2001,,,,Не указано,Женский,Улыпка,Сонца,Омск,,,,,,
838270542,15.5.2006,ОмГМУ (бывш. ОмГМА),,Омск,В активном поиске,Женский,Алина,Левицкая,Омск,,негативное,саморазвитие,доброта и честность,нейтральное,
838268404,3.3.1980,,,,Не указано,Женский,Пуговка,Прайд,Омск,,,,,,
838264458,11.11.1994,,,Омск,Влюблён / влюблена,Мужской,Artur,Aytbaev,Омск,,,,,,
838260899,10.8.2009,,,,Не указано,Мужской,Dragon,Lew,Омск,,,,,,
838259791,13.6.1967,,,,Не указано,Женский,Татьяна,Гринвальд,Омск,,,,,,
838255946,21.1.1947,,,,Не указано,Женский,Раиса,Кравчук,Омск,,,,,,
838254455,29.12.1959,СибГУФК,Факультет спорта,,Не указано,Мужской,Алексей,Михайлоф,Омск,,,,,,
838251753,15.1.2008,,,,Не указано,Женский,Shizod,Vnoski,Омск,,,,,,
838249101,12.2.2006,,,,Не указано,Мужской,Кирилл,Балиев,Омск,,,,,,
838245992,28.6.2001,,,Омс,Есть друг / есть подруга,Мужской,Александр,Гоферберг,,,,,,,
838243934,12.4.1998,ОмГПУ,Факультет естественно-научного образования,,Не указано,Женский,Алина,Забивина,Омск,,,,,,
838243652,12.11.2003,ОмГМУ (бывш. ОмГМА),Лечебный факультет,Омск,Не женат / не замужем,Мужской,Usman,Ali,,,,,,,
838242275,6.4.1985,,,,Не указано,Мужской,Виталя,Люлько,Омск,,,,,,
838240243,23.9.1974,ОмГПУ,Факультет психологии и педагогики,,Не указано,Женский,Елена,Агешкина,Омск,,,,,,
838228062,16.6.1994,ОмГПУ,,,Не указано,Женский,Вероника,Аулова,Омск,,,,,,
838226073,22.9,,,,,Женский,Наталия,Устинова,Омск,,,,,,
838225944,10.6.1972,,,,Не указано,Мужской,Сергей,Литвинов,Омск,,,,,,
838225492,18.8.2009,,,,Не указано,Мужской,Савелии,Симиненко,Омск,,,,,,
838225478,11.1.2009,,,Омск,Не указано,Мужской,Арлан,Акшопаев,Омск,,,,,,
838221743,28.6.1964,ОмГУ им. Ф. М. Достоевского,Экономический факультет,,Не указано,Мужской,Александр,Шуляков,Омск,,,,,,
838214400,17.3.1993,,,,Не указано,Мужской,Ваня,Ивлев,Омск,,,,,,
838213798,1.5.1994,,,Омск,Не указано,Мужской,Дубрава,Дверей,Омск,,,,,,
838213227,30.5,,,,,Мужской,Егор,Иванов,Омск,,,,,,
838212169,5.3.1980,,,,Не указано,Мужской,Александр,Александров,Омск,,,,,,
838209257,22.9.2009,,,,Не указано,Женский,Софья,Кочина,Омск,,,,,,
838208913,29.10.1987,ОмГАУ,Факультет технического сервиса в агропромышленном комплексе,,Не указано,Мужской,Евгений,Шишов,Павлодар,,,,,,
838207176,19.9.1990,СКИТУ (филиал) МГУТУ им. К. Г. Разумовского (бывш. РосЗИТиЛП),Факультет технологий и менеджмента,,Не указано,Женский,Екатерина,Никитина,Кемерово,,,,,,
838202174,1.4.1997,,,,Не указано,Женский,Айнагуль,Кожахметова,Омск,,,,,,
838201026,12.4.1981,,,,Не указано,Мужской,Дима,Никитин,Омск,,,,,,
838199723,8.8.1986,,,,Не указано,Женский,Любовь,Братишко,Омск,,,,,,
838199254,13.12.1978,,,,Не указано,Мужской,Евгений,Якушенко,Омск,,,,,,
838198110,10.9.1984,,,,Не указано,Женский,Татьяна,Кукушкина,Омск,,,,,,
838195043,25.2.1964,,,,Не указано,Женский,Ольга,Шмелева,Омск,,,,,,
838186690,30.12.2007,,,,Не указано,Женский,Вероника,Николаевна,Омск,,,,,,
838186560,1.4.1975,,,,Не указано,Женский,Бахытгуль,Хайдаркина,Омск,,,,,,
838183310,5.9.1967,,,,Не указано,Мужской,Владислав,Кротов,Омск,,,,,,
838177166,8.5.2008,,,,Не указано,Мужской,Андрей,Крючков,Омск,,,,,,
838176487,1.1.1967,ОмГПУ,Кафедра гуманитарного образования,,Не указано,Женский,Ольга,Беккер,Омск,,,,,,
838173595,27.2.1975,СибГУФК,"Факультет туризма, рекреации и реабилитации",,Не указано,Женский,Наталья,Садовская,,Очное отделение,,,,,Выпускница (специалист)
838173316,5.8.1953,,,,Не указано,Мужской,Владимир,Еремин,Омск,,,,,,
838173126,21.3.1983,,,,Не указано,Мужской,Николай,Пузырев,Омск,,,,,,
838172203,3.4.1986,,,,Не указано,Мужской,Александр,Воскресенский,Омск,,,,,,
838168097,5.5.2004,ИРСИД,Очный факультет,,Не указано,Женский,Светлана,Хлебникова,Омск,Очное отделение,,,,,
838164381,14.6.1974,СибГУФК,"Факультет циклических, сложнокоординационных видов спорта и единоборств",Омск,Не указано,Мужской,Владимир,Аксентищев,Санкт-Петербург,Очное отделение,,,,,Выпускник (магистр)
838159344,1.3.1977,,,,Не указано,Мужской,Юра,Любич,Омск,,,,,,
838146392,10.7.2001,,,,Не указано,Женский,Кристина,Игоревна,Омск,,,,,,
838141099,4.10.2009,,,,Не указано,Женский,Мария,Лерке,Омск,,,,,,
838139190,26.1.1982,ОмГПУ,"Факультет математики, информатики, физики и технологии",,Не указано,Женский,Наталья,Зиновьева,Омск,,,,,,
838138244,15.5.1995,,,,,Женский,Виктор,Косицын,Омск,,,,,,
838135592,15.10.1953,ОмГМУ (бывш. ОмГМА),Медико-профилактический факультет,,Не указано,Женский,Людмила,Кучугурная,Омск,,,,,,
838134407,11.2.1955,ОмГМУ (бывш. ОмГМА),Медико-профилактический факультет,,Не указано,Женский,Валентина-Ивановна,Стрелец,Омск,Очное отделение,,,,,
838133158,20.11,,,,,Мужской,Андрей,Савин,Омск,,,,,,
838130660,,,,,,Женский,Ирина,Дробинская,Омск,,,,,,
838130281,12.1.1988,,,,Не указано,Мужской,Станислав,Беккер,Омск,,,,,,
838127389,5.12.1948,,,,Не указано,Мужской,Анатолий,Микушов,Омск,,,,,,
838122445,11.1.1952,ОмГПУ,,,Не указано,Мужской,Николай,Мищук,Омск,,,,,,
838121759,23.2.1983,,,,Не указано,Женский,Людмила,Квардакова,Омск,,,,,,
838120843,27.7.2008,,,,Не указано,Мужской,Витя,Шулепов,Омск,,,,,,
838119957,3.3.1972,,,,Не указано,Мужской,Андрей,Голубев,Омск,,,,,,
838119883,27.12.1967,"СибАДИ
",Факультет «Автомобильный транспорт»,,Не указано,Мужской,Александр,Кашич,Омск,,,,,,
838119609,26.10.1954,,,,Не указано,Женский,Зинаида,Кастерина,Омск,,,,,,
838116948,15.11.1985,,,Омск,Не указано,Женский,Дарья,Максимова,Омск,,,,,,
838110756,17.7.1960,,,,Не указано,Женский,Ирина,Казачихина,Омск,,,,,,
838103236,3.5.2000,ОмГТУ,,,Не указано,Женский,Фаина,Ххх,Омск,,,,,,
838101941,6.6.2006,,,,Не указано,Женский,Люблю,Их-Всех,Омск,,,,,,
838098847,22.9,,,,Не указано,Женский,Юлия,Селезнева,Омск,,компромиссное,совершенствование мира,ум и креативность,компромиссное,
838095856,18.2.1969,,,,Не указано,Женский,Ирина,Лейс,Омск,,,,,,
838093013,11.11.1982,,,,Женат / замужем,Женский,Эрика,Ушаков,Омск,,,,,,
838092164,15.2.1978,,,,Не указано,Женский,Аделия,Лаврентьев,Омск,,резко негативное,саморазвитие,ум и креативность,резко негативное,
838084434,8.7.1960,,,,Не указано,Женский,Людмила,Романова,Омск,,,,,,
838083314,11.12.1970,,,,Не указано,Женский,Наталья,Чеснокова,Омск,,,,,,
838079968,,,,,,Женский,Вероника,Исакова,Омск,,,,,,
838078437,1.5.1975,,,,Не указано,Женский,Аю,Иващенко,Омск,,,,,,
838072658,29.5.1985,,,,Не указано,Мужской,Олег,Кошевой,Омск,,,,,,
838071164,8.3.1960,ОмГПУ,"Факультет начального, дошкольного и специального образования",,Не указано,Женский,Калия,Наурузова,,,,,,,
838068491,16.7.1975,,,,Не указано,Женский,Татьяна,Ивченко,Омск,,,,,,
838063598,5.12.1988,,,,Не указано,Женский,Наталья,Елистратова,Омск,,,,,,
838061081,7.5.1988,,,,Не указано,Мужской,Иван,Белавский,Омск,,,,,,
838059718,31.3,,,,,Женский,Анастасия,Ситалова,Омск,,,,,,
838059301,16.10.1959,,,,Не указано,Мужской,Александр,Шабанов,Омск,,,,,,
838055512,1.10.1971,,,,Не указано,Женский,Наталья,Кулешова,Омск,,,,,,
838052143,,,,,,Женский,Арнаш,Хасенова,Омск,,,,,,
838047998,14.8.1981,,,,Не указано,Женский,Юлия,Коробова,Омск,,,,,,
838042009,19.10.1986,,,,Не указано,Женский,Наталья,Ната,Омск,,,,,,
838037004,15.12.1978,,,,Не указано,Мужской,Василий,Тёркин,Омск,,,,,,
838031397,28.8.1947,,,,Не указано,Женский,Мария,Макарова,Омск,,,,,,
838024522,,,,,,Мужской,Qqqq,Qqqq,Омск,,,,,,
838012874,21.4.1985,,,,Не указано,Женский,Екатерина,Кац,Омск,,,,,,
838009887,,,,,Есть друг / есть подруга,Женский,Жанна,Куприянов,Омск,,,,,,
838009191,4.7.2006,,,,Не указано,Мужской,Данила,Титовец,Омск,,,,,,
838002476,13.12.2000,,,,Не указано,Мужской,Максим,Петрик,Омск,,,,,,
837992812,11.11.2009,,,Омск,Не указано,Женский,Алина,Братская,,,,,,,
837990976,3.4.2000,,,,Не указано,Мужской,Макс,Кочетков,Омск,,,,,,
837990277,16.12.2000,,,,Не указано,Мужской,Максим,Яндо,Омск,,,,,,
837988960,2.9.2005,,,Омск,Не указано,Женский,Амина,Карабалина,Омск,,,,,,
837988385,24.2.2000,,,,Не указано,Мужской,Дмитрий,Федоров,Омск,,,,,,
837985856,16.7.1960,ОВОКУ им. Фрунзе,2 батальон,,Не указано,Мужской,Эдуард,Синицын,Омск,,,,,,
837982372,14.6.2007,,,,Не указано,Мужской,Нурлан,Нагиев,Омск,,,,,,
837980373,7.5.1962,ОмИПП,Экономический факультет,,Не указано,Женский,Ирина,Липатова,Омск,,,,,,
837978704,17.8.2007,,,,Не указано,Мужской,Кирилл,Пантелеев,Омск,,,,,,
837974221,25.2.2005,,,,,Женский,Елизавета,Русакова,Омск,,,,,,
837974078,20.10.2000,"СибАДИ
",,,Не указано,Мужской,Данил,Юсупчик,Омск,,,,,,
837971915,25.8.1999,,,,Не указано,Мужской,Everynight,Ilieawake,Омск,,,,,,
837970835,3.10.2004,,,,Не указано,Мужской,Твой,Немец,Омск,,,,,,
837968973,6.11.1992,,,,Не указано,Мужской,Андрей,Андреев,Омск,,,,,,
837967590,27.4.1958,,,,Не указано,Женский,Людмила,Киселева,Омск,,,,,,
837963303,22.10.1990,,,Далматово,Женат / замужем,Мужской,Женёк,Коробков,Омск,,,,,,
837960954,30.9.1981,,,,Не указано,Мужской,Юрий,Панкратов,Омск,,,,,,
837960005,19.12.1970,,,,Не указано,Женский,Ольга,Коваленко,Омск,,,,,,
837959053,12.12.1992,"ИПЭК
",Факультет права и экономики,,Не указано,Женский,Татьяна,Мосичкина,Омск,,,,,,
837944356,3.9,,,,Не указано,Женский,Елена,Орлова,Омск,,,,,,
837938497,30.10.1966,,,,Не указано,Мужской,Владимир,Милюшков,Омск,,,,,,
837935988,31.8.1970,,,,Не указано,Мужской,Ринат,Мигранов,Омск,,,,,,
837934746,20.11.1967,,,,Не указано,Женский,Нина,Пиляева,Омск,,,,,,
837932999,26.3.1973,,,,Не указано,Женский,Ирина,Щербакова,Омск,,,,,,
837932504,16.7.2009,,,,Не указано,Женский,Маша,Микрюкова,Омск,,,,,,
837930305,6.8.2000,,,,Не указано,Мужской,Роман,Казаков,Омск,,,,,,
837929860,31.5.1983,,,,Не указано,Женский,Наталья,Климова,Омск,,,,,,
837916742,,,,,,Мужской,Женя,Игнатович,Омск,,,,,,
837915862,,,,,,Мужской,Яша,Кулешов,Омск,,,,,,
837909103,8.12.2009,,,,Не указано,Женский,Светлана,Семенчук,Омск,,,,,,
837902557,7.5.2003,,,,Не указано,Женский,Майя,Гончарова,Омск,,,,,,
837899488,23.3.2009,,,,Не указано,Женский,Мирослава,Золотухина,Омск,,нейтральное,карьера и деньги,юмор и жизнелюбие,нейтральное,
837897476,3.6.1961,,,,Не указано,Женский,Ирина,Даниленко,Омск,,,,,,
837891113,5.5.2009,,,,,Мужской,Максим,Трифонов,Омск,,,,,,
837888722,25.5.2000,,,,Не указано,Женский,Мила,Ярова,Омск,,,,,,
837886244,1.8.1977,СФГА (ОФ),"Кафедра психологии и общих гуманитарных дисциплин (Психологии, педагогики и права)",,Не указано,Мужской,Андрей,Шульц,Омск,,,,,,
837885318,26.12.1949,,,,Не указано,Женский,Светдана,Иванова,Омск,,,,,,
837876693,3.4.2005,,,,Не указано,Мужской,Андрей,Марков,Омск,,,,,,
837875947,29.7.1983,ОмА МВД России (бывш. ОВШМ МВД СССР),Факультет подготовки сотрудников полиции,Стрежевой,Женат / замужем,Мужской,Павел,Трошин,Томск,,,,,,
837875736,6.3.1989,,,,Не указано,Мужской,Кирилл,Сафронов,Омск,,,,,,
837873311,6.2.1973,СибГУФК,Факультет спорта,,Не указано,Мужской,Игорь,Горохов,Омск,,,,,,
837872053,13.7.1988,,,,Не указано,Мужской,Николай,Черников,Омск,,,,,,
837871406,19.1.2000,,,,Не указано,Мужской,Ferid,Bathory,,,,,,,
837869250,7.9.2007,,,,Не указано,Мужской,Глеб,Глебов,Омск,,,,,,
837867886,20.10.1953,,,,Не указано,Женский,Людмила,Геннадьевна,Омск,,,,,,
837863871,7.1.1967,,,,Не указано,Женский,Ирина,Резина,Омск,,,,,,
837861600,28.9.1982,,,,Не указано,Женский,Анна,Москвина,Омск,,,,,,
837860838,28.7.1961,,,,Не указано,Мужской,Александр,Сафронов,Омск,,,,,,
837859653,9.9.2003,,,,Не указано,Женский,Nail,Bliss,Омск,,,,,,
837857389,1.3.1982,,,,Не указано,Мужской,Александр,Герасименко,Омск,,,,,,
837856669,3.7.1954,,,,Не указано,Мужской,Виктор,Катесов,Омск,,,,,,
837854635,23.1,,,,,Мужской,Coca,Cola,Омск,,,,,,
837849820,12.3.1961,ОмГПУ,Факультет иностранных языков,,Не указано,Женский,Коновалова,Надежда,Омск,,,,,,
837848383,7.7.1973,,,,Не указано,Женский,Надежда,Полтавцева,Омск,,,,,,
837846681,24.7.2005,,,,Не указано,Мужской,Бошкатов,Иван,Омск,,,,,,
837842270,20.4.2005,,,,Не указано,Мужской,'katsuki,'bakugolucifer,,,,,,,
837840856,10.4.1970,,,,Не указано,Женский,Татьяна,Иванова,,,,,,,
837839591,1.1.2000,,,,Не указано,Женский,Супермаркет-Цветов,Клумба,Омск,,,,,,
837838258,19.2.1947,ОмГТУ,Радиотехнический факультет,,Не указано,Мужской,Василий,Мал,Омск,,,,,,
837828767,19.3.1990,,,,Не указано,Женский,Оксана,Зайцева,Омск,,,,,,
837825788,12.11.1988,ОмГПУ,Факультет иностранных языков,,Не указано,Мужской,Жуньтао,Пан,Москва,,,,,,
837824303,21.8.1962,,,,Не указано,Мужской,Вадим,Карепанов,Омск,,,,,,
837814851,14.7.1968,ОмГПУ,Филологический факультет,Новосибирск,Не указано,Женский,Елена,Елена,Новосибирск,,,,,,
837813127,10.9.1968,,,,Не указано,Женский,Татьяна,Удовенко,Омск,,,,,,
837809677,28.3.1971,,,,Не указано,Женский,Галина,Валуйская,Омск,,,,,,
837809670,12.8.1970,,,,Не указано,Женский,Наталья,Шулакова,Омск,,,,,,
837808696,4.11,,,,,Мужской,Артем,Беззатеев,Омск,,,,,,
837807388,6.3.1981,ОмГТУ,,,Не указано,Женский,Юлия,Кирпота,Омск,,,,,,
837804369,11.8.1963,,,,Не указано,Женский,Marina,Akimenko,Омск,,,,,,
837802639,28.1,"ОмУДТ (бывш. ОГИС, ОмТИ)",Экономический факультет,,Не указано,Женский,Елена,Еремкина,Омск,,,,,,
837801253,20.1.1993,,,,Не указано,Женский,Лера,Прокат,,,,,,,
837800533,17.4.2001,"СибАДИ
",,,Не указано,Мужской,Дмитрий,Тюрин,Омск,,,,,,
837799871,12.12.1991,МГУ,,,Не указано,Мужской,No,Name,Омск,,,,,,
837799552,31.3.2005,,,,Не указано,Женский,Василиса,Рыбина,Омск,,,,,,
837798725,6.8.2008,,,,Не указано,Женский,Анастасия,Александрова,Омск,,,,,,
837797585,4.2.2009,,,,Не указано,Мужской,Никита,Крайсвитний,Омск,,,,,,
837794580,22.2.1966,,,,Не указано,Женский,Алтынай,Буртебаева,Омск,,,,,,
837793702,7.7.2002,ОмА МВД России (бывш. ОВШМ МВД СССР),Общеюридический факультет,,Не указано,Мужской,Марталлер,Даниил,Омск,,,,,,
837791868,7.10.1998,,,,,Женский,Nastia,Nik,Омск,,,,,,
837790459,24.2.1983,,,,Не указано,Мужской,Владимир,Качесов,Омск,,,,,,
837787436,11.10.2006,,,,Не указано,Мужской,Вадим,Макеев,Омск,,,,,,
837786629,6.7.2000,,,,Не указано,Женский,Лиза,Рядовая,Омск,,,,,,
837785867,16.11,,,,Не указано,Женский,Анастасия,Стрельцова,Омск,,нейтральное,развлечения и отдых,доброта и честность,негативное,
837785667,6.11.1955,,,,Не указано,Женский,Светлана-Васильевна,Малихова,Омск,,,,,,
837784727,23.8.2000,,,,Не указано,Мужской,Андрей,Шмуйдин,Омск,,,,,,
837784544,12.5.2004,,,,Не указано,Мужской,Александр,Одиноков,Омск,,,,,,
837783299,21.6.1996,,,,Не указано,Мужской,Vladimir,Kaban,Омск,,,,,,
837781375,25.4.2005,,,,Не указано,Мужской,Кирилл,Латвин,Омск,,,,,,
837778801,12.3.1959,,,,Не указано,Женский,Любовь,Перчун,Омск,,,,,,
837777824,24.9.1994,ИРСИД,Очный факультет,,Не указано,Женский,Карина,Горошинская,,,,,,,
837773340,26.11.1971,ОмГУ им. Ф. М. Достоевского,Экономический факультет,,Не указано,Женский,Светлана,Дегтяренко,Москва,Очно-заочное отделение,,,,,Выпускница (специалист)
837765242,8.2.1985,,,,Не указано,Мужской,Лукас,Макс,Омск,,,,,,
837762242,13.1.2006,,,Омск,Не указано,Женский,Арина,Алиева,,,,,,,
837745418,5.5.2003,,,Татарск,Не женат / не замужем,Мужской,Denis,Koshedov,Омск,,,,,,
837745108,5.3.1969,ОмГУ им. Ф. М. Достоевского,Юридический факультет,,Не указано,Женский,Лада,Педанова,Омск,,,,,,
837742421,8.11.2000,,,,,Мужской,Антон,Корупцев,Омск,,,,,,
837742024,14.10.1955,,,,Не указано,Женский,Людмила,Винокурова,Омск,,,,,,
837741829,,,,,Не указано,Женский,Наращивание,Ресниц,Омск,,,,,,
837740107,31.7,,,,В активном поиске,Мужской,Кирилл,Разумовский,Омск,,,,,,
837738538,18.2.1997,,,,Не указано,Мужской,Иван,Степанов,Омск,,,,,,
837732983,9.11.2001,ОмГПУ,"Факультет начального, дошкольного и специального образования",,Не указано,Женский,Вика,Миячина,Омск,,,,,,
837729264,2.4.1995,ИРСИД,Очный факультет,Омск,В активном поиске,Женский,Виктория,Попова,Омск,,,,,,
837724482,16.4,,,,Не указано,Мужской,Varlan,Satte,Омск,,,,,,
837724262,26.1.1958,,,,Не указано,Женский,Людмила,Разливинская,Омск,,,,,,
837723364,25.3.2008,,,,Не указано,Женский,Светлана,Геймур,Омск,,,,,,
837723210,18.1.2009,,,,Не указано,Мужской,Илья,Бобиль,Омск,,,,,,
837722434,3.4.1964,,,,Не указано,Женский,Лариса,Иозева,Омск,,,,,,
837722373,23.6.2008,,,,Не указано,Женский,Эляя,Нагиева,Омск,,,,,,
837716766,18.12.1982,,,Омск,Не женат / не замужем,Женский,Елена,Елена,Омск,,,,,,
837716118,8.8.1988,ОмГТУ,,,Не указано,Мужской,Валерий,Веранда,Омск,,,,,,
837714745,6.4.2005,,,,Женат / замужем,Женский,Ксюшка,Мерц,,,,,,,
837712957,10.1.2009,,,,Не указано,Женский,Варвара,Бобиль,Омск,,,,,,
837712216,1.11.1983,,,,Не указано,Мужской,Максим,Шарков,Омск,,,,,,
837709802,5.6.2003,,,,Не указано,Мужской,Егор,Скребков,Омск,,,,,,
837709016,20.1.1994,,,,Не указано,Женский,Анастасия,Гондарук,Омск,,,,,,
837707485,10.12.2005,ОмГУ им. Ф. М. Достоевского,,,Не указано,Женский,Николь,Феоктистова,,,,,,,
837705306,22.7.2000,,,,Не указано,Мужской,Влад,Гурам,Омск,,,,,,
837704199,28.1.2005,,,Омск,Не указано,Женский,Анна,Хлыстова,Омск,,,,,,
837703731,18.2.1970,,,,Не указано,Мужской,Вячеслав,Круглий,Омск,,,,,,
837702303,20.4.2009,,,,,Женский,Виталина,Гайнцева,Омск,,,,,,
837702185,18.9.2006,ОмГТУ,,,Не указано,Женский,Алиса,Липина,Омск,,,,,,
837700640,13.6.1990,,,,Не указано,Мужской,Владимир,Холодченко,Омск,,,,,,
837697843,22.2.1967,ОмГУ им. Ф. М. Достоевского,Факультет филологии и медиакоммуникаций,,Не указано,Женский,Наталья,Станкевич,Омск,Очное отделение,,,,,
837697172,10.6.1948,,,,Не указано,Мужской,Николай,Шокуров,Омск,,,,,,
837696475,9.8.2005,,,,Не указано,Мужской,Никита,Авдеев,Омск,,,,,,
837696323,1.6,,,,,Мужской,Алекс,Гарленгов,Омск,,,,,,
837694752,17.6.1965,,,,Не указано,Женский,Анастасия,Кункель,Омск,,,,,,
837691400,19.2.2004,,,,Не указано,Мужской,Игорь,Коробейников,Омск,,,,,,
837689738,19.4.2003,,,,Не указано,Женский,Уля,Баженова,Омск,,,,,,
837688211,12.12.2004,,,,Не указано,Женский,Анастасия,Цветцих,Омск,,,,,,
837687851,6.5.1950,ОмГМУ (бывш. ОмГМА),,,Не указано,Мужской,Юрий,Игнатьев,Омск,,,,,,
837687030,7.12.1998,ОмГТУ,Нефтехимический институт,Омск,Не женат / не замужем,Мужской,Матвей,Трошин,Омск,,,,,,
837683853,10.11.2005,,,,Не указано,Мужской,Dadad,Dadadad,Омск,,,,,,
837682138,,,,,,Мужской,Кирилл,Кравченко,Омск,,,,,,
837678868,14.10.2005,,,,Не указано,Мужской,Alexander,Efremov,Омск,,,,,,
837677217,1.2,,,,,Мужской,Василий,Иванович,Омск,,,,,,
837676538,20.7.1951,"СибАДИ
",Факультет «Нефтегазовая и строительная техника»,,Не указано,Мужской,Валерий,Путятин,Омск,,,,,,
837672887,20.11.1980,ОмГТУ,,,Не указано,Мужской,Дмитрий,Рогозин,Омск,,,,,,
837667622,28.7.2009,,,,Не указано,Мужской,Евгений,Тужилин,Омск,,,,,,
837666990,25.10.2000,ОмГУ им. Ф. М. Достоевского,,,Не указано,Мужской,Никита,Громенко,Омск,,,,,,
837666324,27.6.2000,,,,Не указано,Мужской,Иван,Чапарян,Омск,,,,,,
837664514,26.2.1981,,,,Не указано,Мужской,Игорь,Кучумов,Омск,,,,,,
837663885,15.5.1988,,,,Не указано,Мужской,Serg,Deh,Омск,,,,,,
837663300,4.10.1987,,,,Не указано,Женский,Рита,Унрау,Омск,,,,,,
837662858,26.1.1963,,,,Не указано,Мужской,Сергей,Мельников,Омск,,,,,,
837662751,7.8.1969,"Университет «Синергия» ОФ (бывш. МФПУ, МФПА ОФ)",Экономика,,Не указано,Женский,Света,Черданцева,,Заочное отделение,,,,,
837662144,30.9.2009,,,,Не указано,Мужской,Максим,Синевич,Омск,,,,,,
837658464,10.11.2008,,,,Не указано,Мужской,Roblox,Roblix,Омск,,,,,,
837658360,10.9.2007,,,,Не указано,Женский,Полина,Мацакова,Омск,,,,,,
837652735,,,,,,Мужской,Константин,Пискун,Омск,,,,,,
837648607,9.11.2000,,,,Не указано,Мужской,Роман,Зайцев,Омск,,,,,,
837646458,12.10.1987,,,,Не указано,Мужской,Александр,Быстров,Омск,,,,,,
837642426,19.8.1977,,,,Не указано,Мужской,Михаил,Щербицкий,Омск,,,,,,
837640440,13.10.1980,,,,Не указано,Мужской,Дмитрий,Дмитрий,Омск,,,,,,
837640216,21.11.1990,,,,Не указано,Мужской,Артём,Зайцев,Омск,,,,,,
837639977,20.11.1987,,,,Не указано,Женский,Саша,Колпакова,Омск,,,,,,
837639487,25.9.1979,,,,Не указано,Женский,Ирина,Иванова,Омск,,,,,,
837634646,9.5.1976,,,,Не указано,Женский,Татьяна,Васюкович,Омск,,,,,,
837633861,28.1.1997,,,,Не указано,Мужской,Станислав,Боров,Омск,,,,,,
837633738,16.2.2005,ОмГМУ (бывш. ОмГМА),,,Не указано,Женский,Софья,Ёлгина,Омск,,,,,,
837624591,28.9.1999,ОФ СГА,Юриспруденция,Ак-Довурак,Помолвлен / помолвлена,Мужской,Хирлигбей,Саая,Ак-Довурак,,,,,,
837624516,30.1.1978,,,,Не указано,Женский,Оксана,Плиско,Омск,,,,,,
837623375,20.1.2000,,,,Не указано,Женский,Оля,Баркова,Омск,,,,,,
837623040,4.9.1974,ОмГУ им. Ф. М. Достоевского,Факультет математики и информационных технологий,,Не указано,Мужской,Сергей,Федоров,Омск,,,,,,
837622404,24.1.1960,,,,Не указано,Мужской,Александр,Гриненков,Омск,,,,,,
837619702,11.11.1974,,,,Не указано,Мужской,Александр,Яковенко,Омск,,,,,,
837617958,17.6.1999,,,,Не указано,Женский,Камалия,Соловьева,Омск,,,,,,
837616364,27.5.1973,,,,Не указано,Женский,Марина,Сидличенко,Омск,,,,,,
837616096,31.10.1984,,,,Не указано,Мужской,Александр,Ткаченко,Омск,,,,,,
837614220,,,,Омск,Не указано,Мужской,Александр,Чикаго,Омск,,,,,,
837611374,7.5.1960,,,,Не указано,Мужской,Владимир,Кудинов,Омск,,,,,,
837609823,31.1.2001,,,,Не указано,Женский,Мария,Фомина,Омск,,,,,,
837609462,7.8.1984,,,,Не указано,Мужской,Анатолий,Иванов,Омск,,,,,,
837609177,11.12.1993,,,,Не указано,Женский,Юлия,Макарова,Омск,,,,,,
837604416,23.9.1958,,,,Не указано,Мужской,Саша,Уразов,Омск,,,,,,
837603343,30.10.1985,,,,Не указано,Женский,Анна,Батенок,Омск,,,,,,
837601126,5.9.2005,,,,Не указано,Мужской,Кирилл,Поблагуев,Омск,,,,,,
837600266,2.1.1965,,,,Не указано,Мужской,Геннадий,Узлов,Омск,,,,,,
837599770,2.3.1941,,,,Не указано,Мужской,No,Name,Омск,,,,,,
837599066,17.11.2004,,,,Не указано,Женский,Мария,Яковлева,Омск,,,,,,
837598091,1.1.1967,,,,Не указано,Мужской,Иван,Мартынов,Омск,,,,,,
837597142,11.9.1961,,,,Не указано,Мужской,Анатолий,Саютинский,Омск,,,,,,
837596942,18.9.1986,,,Тара,Не указано,Мужской,Нариман,Ибрагимов,Омск,,,,,,
837596522,22.7.2005,ОмГПУ,"Факультет экономики, менеджмента, сервиса и туризма",,Не указано,Мужской,Матвей,Каргаполов,Омск,,,,,,
837592301,9.10.1982,,,,Не указано,Мужской,Олег,Пермяков,Омск,,,,,,
837591958,3.4.1963,"СибАДИ
",Факультет «Промышленное и гражданское строительство»,,Не указано,Женский,Татьяна,Чеснокова,Омск,,,,,,
837590676,22.6.1987,,,,Не указано,Женский,Анастасия,Иост-Дедун,Омск,,,,,,
837582056,18.9.1996,,, Омск,Не указано,Мужской,Art,Model,Омск,,,,,,
837579662,4.10.1996,,,Омск,Не указано,Мужской,Art,Model,Омск,,,,,,
837573422,1.11.2001,ОмГМУ (бывш. ОмГМА),Педиатрический факультет,,Не указано,Мужской,Игорь,Ахмедович,Омск,,,,,,
837562053,16.12.1988,,,,Не указано,Мужской,Мухаммад,Меликзода,Омск,,,,,,
837558766,14.11.1987,ОмГПУ,Центр магистерской подготовки,Сочи,Женат / замужем,Женский,Евгения,Грибанова,,Очное отделение,,,,,Выпускница (магистр)
837554952,7.10.2002,,,,Влюблён / влюблена,Женский,Ева,Шачнева,Омск,,,,,,
837554513,24.4.1965,ОмГПУ,Факультет естественно-научного образования,,Не указано,Женский,Лариса,Жарких,Омск,,,,,,
837549591,19.3.1988,,,,Не указано,Мужской,Миха,Неважно,Омск,,,,,,
837542819,10.8.1979,ОмГТУ,Факультет экономики и управления,,Не указано,Женский,Елена,Губина,Омск,,,,,,
837542570,15.12.1990,,,,Не указано,Мужской,Александр,Кузнецов,Омск,,,,,,
837538407,5.9.1982,,,,Не указано,Мужской,Саша,Прокурат,Омск,,,,,,
837536888,3.10.1998,,,,Не указано,Мужской,Кирилл,Уваров,Омск,,,,,,
837534617,14.4.1992,,,,Не указано,Мужской,Максим,Ильиных,Омск,,,,,,
837531637,27.7.1978,ОмРИ ,Факультет повышения квалификации и профессиональной переподготовки,,Не указано,Мужской,Ghost,Ghost,Омск,,,,,,
837530834,3.9.1957,ОмГУ им. Ф. М. Достоевского,Факультет культуры и искусств,,Не указано,Женский,Наталья,Князькина,Омск,,,,,,
837527651,20.3.2008,,,,Не указано,Мужской,Михаил,Гринюк,Омск,,,,,,
837526059,,,,,,Мужской,Евгений,Сердцев,Омск,,,,,,
837521412,4.7.1962,,,,Не указано,Мужской,Виктор,Липовка,Омск,,,,,,
837520655,25.11.2004,УрФЮИ,Юридический факультет,,Не указано,Мужской,Кирюха,Яковлев,Омск,,,,,,
837519024,22.12.1981,,,,Не указано,Женский,Вероника,Молодых,Омск,,,,,,
837516090,2.11.2009,,,,Не указано,Мужской,Андрей,Чепенюк,,,,,,,
837512043,12.9.1990,"ОмУДТ (бывш. ОГИС, ОмТИ)",Экономический факультет,,Не указано,Женский,Амина,Кирченко,Омск,,,,,,
837511621,4.12.1988,,,,Не указано,Женский,Лариса,Котёночкина,Омск,,,,,,
837511115,31.8.2007,ОмГАУ,Факультет ветеринарной медицины ИВМиБ,омск,Влюблён / влюблена,Женский,Аня,Савельева,Омск,,,,,,
837504022,10.9.1957,ОмГУ им. Ф. М. Достоевского,Химический факультет,,Не указано,Женский,Ирина,Власова,Омск,,,,,,
837503232,14.7.1999,,,,Не указано,Мужской,Jason,Statham,,,,,,,
837501679,,,,,Не указано,Женский,Ksenia,Lash,Омск,,,,,,
837499489,12.8.1988,,,,Не указано,Женский,Дарья,Гуреева,Омск,,,,,,
837498437,5.8.1970,,,,Не указано,Женский,Ирина,Попова,Омск,,,,,,
837496614,12.12.2000,,,,Не указано,Мужской,Рамиль,Омаров,Омск,,,,,,
837495293,22.1.1983,,,ОМСК,Женат / замужем,Женский,Наденька,Березина,Омск,,,,,,
837491921,4.6.2000,,,Омск,Всё сложно,Женский,Катя,Вишневская,Омск,,,,,,
837490531,6.1.1979,,,,Не указано,Женский,Мария,Степанова,Омск,,,,,,
837490166,12.7.1985,ОмГПУ,,,Не указано,Мужской,Фёдор,Андреев,Омск,,,,,,
837490073,7.9.1971,"СибАДИ
",Факультет «Экономика и управление»,,Не указано,Женский,Людмила,Емельянова,Омск,,,,,,
837483372,12.10.2005,,,,,Мужской,Егор,Левша,Омск,,,,,,
837482356,3.11.1998,,,,Не указано,Мужской,Сергей,Гиль,Омск,,,,,,
837482234,14.6.1994,,,,Не указано,Мужской,Мака,Худорожков,Омск,,,,,,
837481589,13.8.2005,,,,Не указано,Мужской,Кирилл,Ниязов,Омск,,,,,,
837481509,6.3.1975,,,,Не указано,Мужской,Константин,Шулус,Омск,,,,,,
837480530,9.5.1965,,,,Не указано,Мужской,Виктор,Сарнавский,Омск,,,,,,
837476748,18.3.2000,ОмГМУ (бывш. ОмГМА),Лечебный факультет,,Не указано,Мужской,Михаил,Евгеньчевич,Омск,,,,,,
837474730,23.1.2005,,,,Не указано,Мужской,Виктор,Клевич,Омск,,,,,,
837473409,15.6.1988,,,,Не указано,Женский,Александра,Мещерикова,Омск,,,,,,
837472025,14.12.1994,,,,Не указано,Мужской,Дениска,Зернов,Омск,,,,,,
837466331,,,,,,Мужской,Алекс,Маликов,Омск,,,,,,
837461647,2.1.1963,,,,Не указано,Мужской,Сергей,Кирносов,Омск,,,,,,
837459366,25.6.1965,,,,Не указано,Женский,Лена,Шамрай,Омск,,,,,,
837457729,24.5.2000,,,,Не указано,Женский,Алена,Степанова,Омск,,,,,,
837457634,23.7.1971,,,,Не указано,Женский,Пекалюк,Людмила,Омск,,,,,,
837456145,22.3.1961,,,,Не указано,Мужской,Сергей,Владимирович,Омск,,,,,,
837455219,30.12.1990,,,,Женат / замужем,Женский,Екатерина,Фралова,Омск,,,,,,
837454377,1.4.2002,,,Омск,Не указано,Женский,Елена,Хижнякова,Омск,,,,,,
837454368,,,,,,Женский,Алёна,Родионова,Омск,,,,,,
837452050,12.12.1957,,,,Не указано,Мужской,Леонид,Кравченко,Омск,,,,,,
837451905,19.10.2004,"ИПЭК
",Факультет права и экономики,,Не указано,Мужской,Колян,Шарик,Омск,,,,,,
837446134,1.9.2000,ОмГПУ,Факультет искусств,,Не указано,Женский,Nota,Bene,Омск,,,,,,
837445354,27.2.1965,,,,Не указано,Мужской,Юрий,Томашевский,Омск,,,,,,
837443403,5.1.1958,,,,Не указано,Мужской,Валерий,Литвяков,Омск,,,,,,
837442178,1.1.2000,,,,Не указано,Женский,Девочка,С-Характером,Омск,,,,,,
837437771,1.1.2000,Финуниверситет при Правительстве РФ ОФ (бывш. ВЗФЭИ),,,Не указано,Женский,Елизавета,Корса,Омск,,,,,,
837436936,12.12,,,,,Женский,Елена,Гулаева,Омск,,,,,,
837436539,11.2.1969,,,,Не указано,Женский,Нина,Агейченко,Омск,,,,,,
837435579,30.6.1978,"ОмГУПС
",Механический факультет,,Не указано,Мужской,Павел,Николаев,Омск,,,,,,
837434495,17.5.1984,,,,Не указано,Мужской,Алексей,Казимирский,Омск,,,,,,
837433842,5.2.1990,ОмГУ им. Ф. М. Достоевского,Факультет психологии,,Не указано,Женский,Кара,Игумнова,,Заочное отделение,нейтральное,карьера и деньги,власть и богатство,нейтральное,
837431143,10.10.1975,ОмГУ им. Ф. М. Достоевского,,,Не указано,Женский,Яна,Захарова,Омск,Очное отделение,,,,,
837428872,9.7.1967,ОмГАУ,,,Не указано,Женский,Гульнара,Ураловна,Омск,,,,,,
837428528,21.7.1981,,,,Не указано,Женский,Зулайхо,Алиева,Омск,,,,,,
837427761,6.4.1974,,,,Не указано,Мужской,Алиев,Дилшод,Омск,,,,,,
837426777,24.2.1964,,,,Не указано,Женский,Светлана,Котова,Омск,,,,,,
837426023,27.9.2000,,,,Не указано,Женский,Terians,Cat,Омск,,,,,,
837425470,19.12.1964,,,,Не указано,Мужской,Игорь,Тряско,Омск,,,,,,
837422927,28.4.1990,,,,Не указано,Мужской,Максим,Иванчук,Омск,,,,,,
837416706,13.8.1979,,,,Не указано,Мужской,Алексей,Ефимов,Омск,,,,,,
837409630,19.8.2009,,,,Не указано,Мужской,Степан,Гальцов,Омск,,,,,,
837406486,28.9.2007,,,,Не указано,Мужской,Виктор,Живаев,Омск,,,,,,
837401428,16.4.1994,,,,Не указано,Женский,Genchikomskiii,Genchik,Омск,,,,,,
837383397,5.12.2000,,,,Не указано,Мужской,Игорь,Куликов,Омск,,,,,,
837381890,14.4.2000,,,,,Женский,Марьяна,Франц,Омск,,,,,,
837380979,15.7.1989,,,,Не указано,Мужской,Сергей,Машков,Омск,,,,,,
837377982,17.2.1986,,,,Не указано,Мужской,Максим,Рогов,Омск,,,,,,
837372330,10.4.1988,ОмЭИ,Факультет экономики и управления,,Не указано,Женский,Ольга,Корноушенко,,,положительное,0.0,доброта и честность,нейтральное,
837365500,15.1.1991,,,,Не указано,Мужской,Мухаммед,Мухаммед,Омск,,,,,,
837363546,11.9.2001,,,,Не указано,Мужской,Гиря,Модный,Омск,,,,,,
837362038,20.12.1987,,,,Не указано,Мужской,Dmitry,Wayqalev,Омск,,,,,,
837361222,1.7.1983,,,,Не указано,Мужской,Ойбек,Абдимуталович,Омск,,,,,,
837359196,18.12.1987,ОмГПУ,"Факультет экономики, менеджмента, сервиса и туризма",,Не указано,Мужской,Денис,Марков,Омск,,,,,,
837355165,18.8.1990,,,омск,Не указано,Мужской,Арт,Ритуал,Омск,,,,,,
837350606,8.12.1983,,,,Не указано,Мужской,Истомина,Наталья,Омск,,,,,,
837343477,11.6.2000,,,,Не указано,Мужской,Егор,Мазуренко,Омск,,,,,,
837343373,15.5.1955,,,,Не указано,Мужской,Закат,Рассветный,Омск,,,,,,
837343171,20.8.1978,ОмГТУ,Машиностроительный институт,,Не указано,Мужской,Юрий,Струк,Омск,,,,,,
837339476,11.10.1993,,,,Не указано,Мужской,Арман,Кузин,,,,,,,
837335598,22.7.1961,,,,Не указано,Женский,Наталья,Рыбалова,Омск,,,,,,
837333848,26.1.1979,ОмГМУ (бывш. ОмГМА),Стоматологический факультет,,Не указано,Мужской,Евгений,Захаров,Курган,,,,,,
837332977,20.12.2007,,,,Не указано,Женский,Милана,Ковалевв,Омск,,,,,,
837332931,13.6.2000,,,,Не указано,Мужской,Степан,Терентьев,Омск,,,,,,
837323628,4.10.1980,,,,Не указано,Мужской,Глеб,Северов,Омск,,,,,,
837320099,27.11.1992,,,,,Мужской,Только,Ее,Омск,,,,,,
837319044,29.2.1996,,,,Не указано,Мужской,Gorilla,Roll,Омск,,,,,,
837309212,11.9.1984,,,,Не указано,Мужской,Вячеслав,Свиридов,Омск,,,,,,
837305127,13.7,,,,,Мужской,Артём,Колчин,Омск,,,,,,
837299870,6.6.2009,,,,Не указано,Мужской,Матвей,Дорохов,Омск,,,,,,
837298498,11.9.2004,,,,Не указано,Мужской,Vova,Ermakov,Омск,,,,,,
837297992,27.5.1989,,,,Не указано,Женский,Вера,Надеждина,Омск,,,,,,
837297541,29.12.2000,,,,Не указано,Мужской,Данил,Еремин,Омск,,,,,,
837297433,28.4.1993,,,,Не указано,Мужской,Егор,Стрелков,Омск,,,,,,
837296536,9.8.1952,,,,Не указано,Женский,Людмила,Томчик,Омск,,,,,,
837294498,5.12.1999,,,Омск,Не женат / не замужем,Женский,Александра,Фролова,Омск,,,,,,
837292177,26.2.1990,,,,Не указано,Мужской,Кай,Суд,Омск,,,,,,
837288554,12.10.1999,,,,Не указано,Мужской,Алексей,Алексей,Омск,,,,,,
837281624,6.7.1990,,,,Не указано,Мужской,Анатолий,Неизвестен,Омск,,,,,,
837278007,21.6.2005,"ИПЭК
",,,Не указано,Женский,Галя,Брылева,Омск,,,,,,
837276928,30.3.2003,,,,Не указано,Мужской,Влад,Игроман,Омск,,,,,,
837276923,24.6.1980,,,,Не указано,Мужской,Константин,Котов,Омск,,,,,,
837272485,5.9.2003,,,,Не указано,Мужской,Андрей,Васнецов,Омск,,,,,,
837265176,1.2.1995,,,,Не указано,Мужской,Работа,Омск,Омск,,,,,,
837257292,31.7.1962,,,,Не указано,Мужской,Анатолий,Демченко,Омск,,,,,,
837256841,8.12.1990,,,,Не указано,Мужской,Dj,Mega,Омск,,,,,,
837255226,26.5.2005,,,,Не указано,Женский,Дарья,Гаа,Омск,,,,,,
837254122,11.9.2001,,,,,Мужской,Евгений,Боксин,Омск,,,,,,
837253113,,,,,,Женский,Светлана,Васильевна,Омск,,,,,,
837250625,11.5.1987,,,Железногорск -Илимский Иркутская область,Не женат / не замужем,Женский,Танечка,Мастерица,Омск,,,,,,
837250108,23.8.1941,ОмГМУ (бывш. ОмГМА),Педиатрический факультет,,Не указано,Мужской,Валерий,Черяпкин,Омск,,,,,,
837248863,1.2.1995,,,,Не указано,Женский,Анастасия,Булатова,Омск,,,,,,
837246891,9.12.1982,,,,,Женский,Марина,Романенко,Омск,,,,,,
837245569,31.1.1982,,,,Не указано,Мужской,Евгений,Редькин,Омск,,,,,,
837244326,18.8.2000,,,,Не указано,Мужской,Мато,Ипип,Омск,,,,,,
837243596,10.9.2009,,,,Не указано,Мужской,Матвей,Авденин,Омск,,,,,,
837243169,25.5.1979,,,,Не указано,Женский,Эльвира,Макридина,Омск,,,,,,
837241622,11.7.1990,,,,,Женский,Раиса,Казанцева,Омск,,,,,,
837238717,10.5.2009,,,,Не указано,Мужской,Матвей,Васильев,Омск,,,,,,
837236205,1.12.1999,,,,Не указано,Женский,Александра,Можайская,Омск,,,,,,
837235663,21.6.2009,,,,Не указано,Женский,Светлана,Воробьева,Омск,,,,,,
837233705,25.5.2008,,,,Не указано,Женский,Оливия,Фишер,Омск,,,,,,
837228362,2.12.2000,"ИПЭК
",,,Не указано,Мужской,Базилик,Фикус,Омск,,,,,,
837226822,3.8.1993,,,,Не указано,Женский,Лина,Лебедева,Омск,,,,,,
837225767,23.10.2008,,,,Не указано,Мужской,Андрей,Замула,Омск,,,,,,
837221085,1.11.1968,"СибАДИ
",Факультет «Автомобильные дороги и мосты»,,Не указано,Мужской,Валерий,Волков,Омск,,,,,,
837220651,3.7.1961,ОмГТУ,,,Не указано,Женский,Ольга,Антонова,Омск,,,,,,
837217933,13.9,,,,,Мужской,Егор,Васьков,Омск,,,,,,
837215119,14.6.1978,,,,Не указано,Женский,Татьяна,Лысенко,Омск,,,,,,
837211702,10.5.1966,,,,Не указано,Женский,Марина,Прыгунова,Омск,,,,,,
837211083,20.10.1980,,,,Не указано,Мужской,Артем,Злой,Омск,,положительное,,доброта и честность,положительное,
837208847,1.4.1975,,,,Не указано,Женский,Коемлева,Александровна,Омск,,,,,,
837204916,4.5.2000,,,,Не указано,Мужской,Кетчуп,Пипв,Омск,,,,,,
837204534,1.10.1949,,,,Не указано,Женский,Валентина,Худякова,Омск,,,,,,
837202671,7.7.1977,ОмГА (бывш. ОГИ),Гуманитарный факультет,,Не указано,Мужской,Сергей,Горбачёв,Омск,,,,,,
837201918,5.1.2000,,,,Не указано,Мужской,Богдан,Захаров,Омск,,,,,,
837201772,8.2.2008,,,Омск,Не указано,Мужской,Евгений,Чепарёв,Омск,,,,,,
837200099,9.10.1970,,,,Не указано,Мужской,Сергей,Се,Омск,,,,,,
837199680,1.9.1975,,,,Не указано,Женский,Гульнара,Жарикова,Омск,,,,,,
837198617,,,,Омск,Женат / замужем,Мужской,Евгений,Идолюбов,Омск,,резко негативное,семья и дети,доброта и честность,резко негативное,
837198305,,,,Omsk,Не указано,Мужской,Ilias-Tekeev,Tattoo,Омск,,,,,,
837196023,15.10.2000,,,,Не указано,Женский,Виктория,Короткова,Омск,,,,,,
837195709,27.3.2008,,,,Не указано,Женский,Соня,Ходыкина,Омск,,,,,,
837194960,7.2.1981,,,,Есть друг / есть подруга,Мужской,Сергей,Коваленко,,,,,,,
837194950,28.4.1979,,,,Не указано,Мужской,Пётр,Никитенко,Омск,,,,,,
837184725,25.8.1987,,,,Не указано,Мужской,Круз,Кисикепл,Омск,,,,,,
837181078,,,,Минусинск,Не женат / не замужем,Женский,Евгения,Шмидт,Минусинск,,нейтральное,саморазвитие,доброта и честность,нейтральное,
837180433,1.1.1996,,,,Не указано,Мужской,Хитрый,Хитрый,Омск,,,,,,
837170746,11.2.1991,,,,Не указано,Мужской,Xayrislam,Xayrislam,Омск,,,,,,
837165734,26.10.2004,ОмГУ им. Ф. М. Достоевского,Экономический факультет,Омск,Не женат / не замужем,Женский,Екатерина,Пирсова,Омск,,,карьера и деньги,,нейтральное,Студентка (специалист)
837155404,5.7.1982,ОмГПУ,,,Не указано,Женский,Ольга,Тюшкевич,Омск,,,,,,
837152932,18.5.1964,,,,Не указано,Мужской,Иван,Серов,Омск,,,,,,
837145903,2.9.1982,,,,Не указано,Женский,Ольга,Чернявская,Омск,,,,,,
837144913,22.1.1999,ОмГУ им. Ф. М. Достоевского,,,Не указано,Женский,Zharkun,Insebaeva,Омск,,,,,,
837144708,26.6.1999,,,Angola Luanda,Не женат / не замужем,Мужской,Гелио-Ф,Мануел,Омск,,,,,,
837142572,3.5.2004,,,,Не указано,Мужской,Михаил,Гудяев,Омск,,,,,,
837140829,8.10.1999,,,,Не указано,Женский,Александра,Франц,Омск,,,,,,
837135003,9.3.1987,,,,Не указано,Мужской,Дмитрий,Абрамав,Омск,,,,,,
837134975,18.11.2000,,,,Не указано,Мужской,Asbin,Asperines,Омск,,,,,,
837132842,11.3.1970,"ОмГУПС
",Механический факультет,Омск,Не указано,Женский,Elena,Parchelli,Омск,,,,,,
837132648,4.1.1985,,,,Не указано,Женский,Василиса,Колесникова,Омск,,,,,,
837132084,21.12.2000,,,,Не указано,Женский,Геля,Еременко,Омск,,,,,,
837123339,16.3,ОмГАУ,Землеустроительный факультет,,Не указано,Мужской,Артём,Маркер,Липецк,,,,,,
837121711,19.5.1999,,,Чита,В активном поиске,Женский,Михаил,Воронов,,,положительное,семья и дети,доброта и честность,положительное,
837119503,15.9.2004,,,,Не указано,Мужской,Кирилл,Дьякин,Омск,,,,,,
837118604,13.11.2005,,,,Не указано,Мужской,Даниил,Богданов,Омск,,,,,,
837111539,20.2.1981,,,,Не указано,Женский,Олеся,Николаевна,Омск,,,,,,
837109032,29.7.2007,СКИТУ (филиал) МГУТУ им. К. Г. Разумовского (бывш. РосЗИТиЛП),Экономический факультет,,Не указано,Женский,Алиса,Шибанова,Омск,,,,,,
837108729,19.7.1973,"ОмГУПС
","Институт автоматики, телекоммуникаций и информационных технологий",,Не указано,Мужской,Василий,Кузнецов,Омск,Очное отделение,,,,,
837107331,20.1.1990,"СибАДИ
",Факультет «Автомобильный транспорт»,,Не указано,Мужской,Сергей,Нишонов,Омск,,,,,,
837106605,29.8.2000,"ИПЭК
",Факультет права и экономики,,Не указано,Женский,Свосм,Рмапгесв,Омск,,,,,,
837101325,11.6.1963,,,,Не указано,Женский,Валентина,Фещенко,Омск,,,,,,
837099228,15.1.1983,,,,Не указано,Мужской,Пономаренко,Сергеевич,Омск,,,,,,
837095737,23.3.1977,,,,Не указано,Мужской,Афтандил,Миралиев,Омск,,,,,,
837091077,14.7.1985,,,,Не указано,Женский,Алевтина,Акамова,Омск,,,,,,
837085994,30.5.1994,,,,Не указано,Мужской,Георгий,Марковкин,Омск,,,,,,
837077924,20.1.2004,,,,Не указано,Мужской,Степан,Зыков,Омск,,,,,,
837075139,1.5.1991,ОмА МВД России (бывш. ОВШМ МВД СССР),Следственный факультет,,Не указано,Женский,Ira,Ladushina,Омск,,,,,,
837073640,11.10.1968,,,,Не указано,Мужской,Валерий,Моисеев,Омск,,,,,,
837073156,9.9.1995,,,,Не указано,Женский,Виктория,Власова,Омск,,,,,,
837069701,30.1.2009,,,,Не указано,Мужской,Максим,Музыченко,Омск,,,,,,
837066367,1.1.1910,Омский филиал РАНХиГС,Кафедра экономики и управления,,Не указано,Мужской,Makis,Makis,Омск,,,,,,
837064765,,,,,,Женский,Анна,Алёшина,Омск,,,,,,
837063591,12.4.1991,,,,Не указано,Женский,Ирина,Донова,Омск,,,,,,
837062559,13.9.1986,,,,Не указано,Женский,Валентина,Горобченко,Омск,,,,,,
837060885,12.5.1986,,,,Не указано,Женский,Алена,Валенкова,Омск,,,,,,
837056516,5.8.2004,,,Омск,Влюблён / влюблена,Мужской,Лева,Шушеньков,Омск,,негативное,саморазвитие,доброта и честность,негативное,
837055818,4.9.1988,,,,Не указано,Мужской,Veles,Stalker,Омск,,,,,,
837045409,13.4.1987,,,,Не указано,Мужской,Александр,Ситников,Омск,,,,,,
837039555,10.8.2000,,,,Не указано,Мужской,Кирилл,Надеждин,Омск,,,,,,
837036178,11.5.1977,,,,Не указано,Женский,Татьяна,Шрейдер,Омск,,,,,,
837033871,1.1.2000,,,,Не указано,Женский,Вектор,Омск,Омск,,,,,,
837031262,11.12.2000,,,,Не указано,Мужской,Сергей,Иванов,Омск,,,,,,
837030922,3.5.1973,,,,Не указано,Женский,Галина,Щербова,Омск,,,,,,
837028047,6.11,ОмА МВД России (бывш. ОВШМ МВД СССР),,Омск,Не указано,Женский,No,Name,Омск,,,,,,
837028010,19.3.2009,,,,Не указано,Женский,Margo,Dunaeva,Омск,,,,,,
837026570,27.4.1968,,,,Не указано,Женский,Ольга,Карпова,Омск,,,,,,
837026466,7.9.1965,,,,Не указано,Мужской,Вячеслав,Мешков,Омск,,,,,,
837020937,14.3.1988,ОмГТУ,Факультет информационных технологий и компьютерных систем,Омск,Не указано,Мужской,Геннадий,Сосунов,Москва,,,,,,
837017373,26.5.2000,,,,Не указано,Женский,Арина,Кузьминых,Омск,,,,,,
837012910,12.9.2000,,,,Не указано,Женский,Елизавета,Стройлова,Омск,,,,,,
837011958,17.5.2000,,,,Не указано,Мужской,Ануар,Табулдинов,Омск,,,,,,
837010499,16.10.1990,,,,Не указано,Мужской,Иван,Белоглазов,Омск,,,,,,
837009420,18.7.1995,ИРСИД,Заочный факультет,,Не указано,Женский,Юлия,Зайцева,Омск,,,,,,
837008400,18.8.1958,ОмГМУ (бывш. ОмГМА),Лечебный факультет,,Не указано,Женский,Елена,Кноль,Омск,Очное отделение,,,,,
837002057,,,,,,Мужской,Виктор,Вереснюк,Омск,,,,,,
836996039,18.7.1990,,,,,Мужской,Григорий,Земельцев,Омск,,,,,,
836993803,23.6.2000,,,,,Мужской,Денис,Кубрин,Омск,,,,,,
836992928,29.5.2000,,,,Не указано,Женский,Лидия,Петрова,Омск,,,,,,
836991835,17.1.2000,,,,Не указано,Мужской,Кристина-Антон,Козуб,Омск,,,,,,
836989078,,ОмА МВД России (бывш. ОВШМ МВД СССР),Следственный факультет,,Не указано,Мужской,Адвокат-Михаил,Писарев,Салехард,,,,,,
836988609,9.3.1989,,,,Не указано,Мужской,Руслан,Бортко,Омск,,,,,,
836985554,19.9.2000,,,,Не указано,Мужской,Данил,Ферхов,Омск,,,,,,
836985366,30.5.1997,,,,Не указано,Мужской,Данил,Филин,Омск,,,,,,
836980427,8.10.1997,,,,,Женский,Виктория,Коннова,Омск,,,,,,
836979465,3.11.1980,ОмГПУ,"Факультет математики, информатики, физики и технологии",Омск,Женат / замужем,Женский,Люба,Филимонова,Омск,,,,,,
836971624,4.1.1960,ОмГПУ,Факультет естественно-научного образования,,Не указано,Женский,Елена,Шевяко,Омск,,,,,,
836967489,8.3.1998,ОмГМУ (бывш. ОмГМА),Педиатрический факультет,Омск,Не указано,Женский,Юлия,Титова,,Очное отделение,,,,,
836961635,10.8.1963,,,,Не указано,Мужской,Виктор,Байгачев,Омск,,,,,,
836960200,25.7.1990,,,,,Женский,Амина,Алиева,Омск,,,,,,
836958344,6.10.1999,,,,Не указано,Женский,Лора,Басаргина,Омск,,,,,,
836955043,29.7.1962,,,,Не указано,Женский,Татьяна-Александровна,Райхель,Омск,,,,,,
836954243,3.8.1974,,,,Не указано,Женский,Наталья,Рычкова,Омск,,,,,,
836951976,,,,,Не указано,Женский,Екатерина,Михайлова,Омск,,,,,,
836948650,9.5.1978,,,,Не указано,Женский,Елена,Рябина,Омск,,,,,,
836947540,18.1.2003,,,,Не указано,Женский,Полина,Сми,Омск,,,,,,
836945913,23.1.1970,,,,Не указано,Женский,Айгуль,Турлубаева,Омск,,,,,,
836944415,3.3.2006,,,,Не указано,Женский,Анна,Передера,Омск,,,,,,
836940655,30.7.1956,,,,Не указано,Женский,Лидия,Лидия,Омск,,,,,,
836940084,11.8.1999,,,,Не указано,Мужской,Ярослав,Хачатурян,Омск,,,,,,
836939255,7.2.1974,,,,Не указано,Мужской,Иван,Исаков,Омск,,,,,,
836922197,8.7.2009,,,,Не указано,Мужской,Никитос,Турмий,Омск,,,,,,
836902900,14.2.1981,,,,Не женат / не замужем,Женский,Аделия,Матвеев,Омск,,положительное,0.0,красота и здоровье,резко негативное,
836902521,5.11.1994,,,,,Мужской,Азер,Исмаилов,Омск,,,,,,
836897589,22.2.1963,,,,Не указано,Женский,Елена,Белкина,Омск,,,,,,
836895331,2.4.1990,,,Омск,В активном поиске,Женский,Надежда,Надежда,Омск,,,,,,
836887127,3.5.1950,,,,Не указано,Женский,Лариса,Довбня,Омск,,,,,,
836883441,20.7.1974,,,,Не указано,Мужской,Игорь,Путин,Омск,,,,,,
836882770,31.1.1955,"СибАДИ
",Факультет «Промышленное и гражданское строительство»,,Не указано,Мужской,Николай,Иванов,Омск,,,,,,
836881535,9.6.1994,,,,Не указано,Мужской,Данил,Николаевич,Омск,,,,,,
836880614,9.4.2000,,,,Не указано,Мужской,Максим,Михайлов,,,,,,,
836879211,30.11.1991,,,,Не указано,Мужской,Иван,Куриков,Омск,,,,,,
836877413,9.9.2000,ОмГУ им. Ф. М. Достоевского,Исторический факультет,,Не указано,Женский,Влада,Малахова,Омск,,,,,,
836877199,10.10.2005,,,,Не указано,Мужской,Константин,Михайлов,Омск,,,,,,
836874844,6.2,,,,,Мужской,Sonic,Top,Омск,,,,,,
836860145,26.3.1950,"ИПЭК
",,,Не указано,Мужской,Олег,Хапалов,Омск,,,,,,
836852252,28.1.1949,,,,Не указано,Женский,Светлана,Овсянникова,Омск,,,,,,
836850202,25.4.2003,ОмГМУ (бывш. ОмГМА),Медико-профилактический факультет,,Не указано,Женский,Маргарита,Пахилова,Омск,,,,,,
836849186,17.9.2003,,,,Не указано,Мужской,Егор,Чернов,,,,,,,
836847506,15.1.1955,,,,Не указано,Мужской,Владимир,Николаев,Омск,,,,,,
836841958,7.11,,,,,Женский,Елена,Лютина,Омск,,,,,,
836841747,14.11.1984,,,,Не указано,Мужской,Евгений,Круцких,Омск,,,,,,
836838989,20.12.1963,,,,Не указано,Женский,Лолита,Тюина,Омск,,,,,,
836838710,28.3.2003,,,,Не указано,Мужской,Иван,Луценко,Омск,,,,,,
836837388,9.4.1998,,,,Не указано,Женский,Лика,Мик,Омск,,,,,,
836836410,2.10.2009,,,Омск,Не указано,Женский,Дарья,Кудинова,Омск,,,,,,
836833500,3.1.2000,ОмГПУ,"Факультет экономики, менеджмента, сервиса и туризма",,Не указано,Мужской,Никита,Билык,Омск,,,,,,
836832162,,,,Омск,Не указано,Женский,Снеговички,Омск,Омск,,,,,,
836829112,18.6.1961,ОмГПУ,"Факультет математики, информатики, физики и технологии",,Женат / замужем,Женский,Лариса,Петренко,,Очное отделение,,,,,Выпускница (специалист)
836827118,12.12.1980,,,,Не указано,Мужской,Сергей,Соломин,Омск,,,,,,
836826427,5.12.1966,,,,Не указано,Женский,Музыка,Музыка,Омск,,,,,,
836822976,5.7.1969,ОмРИ ,Факультет экономики и управления,,Не указано,Мужской,Димитрий,Шустер,Омск,,,,,,
836818896,20.10.1991,,,,Не указано,Мужской,Паша,Тиньков,Омск,,,,,,
836817949,,,,,,Женский,Машка,Обадэ,Омск,,,,,,
836813761,23.2.1965,,,,Не указано,Женский,Валентина,Бородина,Омск,,,,,,
836811523,11.4.2000,,,,Не указано,Мужской,Всеволод,Милютин,Омск,,,,,,
836811218,17.9.1974,,,,Не указано,Женский,Инга,Цыганкова-Смирнова,Омск,,,,,,
836810796,17.9.1998,,,,,Мужской,Sander,Cohen,Омск,,,,,,
836810360,13.11.1969,,,,Не указано,Мужской,Николай,Отрах,Омск,,,,,,
836807620,15.12.1997,,,,Не указано,Женский,Оксана,Ярмоленко,Омск,,,,,,
836807033,29.9.1975,,,,Не указано,Мужской,Виктор,Угаров,Омск,,,,,,
836806533,6.2.1999,,,,Не указано,Мужской,Градимир,Холл,Омск,,,,,,
836804740,17.10.1979,,,,,Женский,Татьяна,Ращупкина,Омск,,,,,,
836792670,7.8.1956,,,,Не указано,Женский,Ольга,Филатова,Омск,,,,,,
836790181,21.4.1973,,,,Не указано,Мужской,Владимир,Антонов,Омск,,,,,,
836784906,13.6.2008,,,,Не указано,Мужской,Кирилл,Новичков,Омск,,,,,,
836783629,23.11.1947,,,,Не указано,Мужской,Владимир,Емельянов,Омск,,,,,,
836783430,25.2.2000,ОмГАУ,Факультет гуманитарных и естественнонаучных дисциплин,,Не указано,Мужской,Google,Moogle,Омск,,,,,,
836778088,2.1.1959,,,Омскская область Русская -Поляна,Женат / замужем,Мужской,Виталий,Боднарчук,Омск,,,,,,
836771589,3.1.1984,,,,Не указано,Женский,Екатерина,Зинькова,Омск,,,,,,
836770549,1.1.2001,"СибАДИ
",,,Не указано,Мужской,Иван,Суворов,Омск,,,,,,
836770376,8.2.1976,,,,Не указано,Женский,Марина,Ружелович,Омск,,,,,,
836770217,9.6.1974,,,,Не указано,Женский,Светлана,Евсеева,Омск,,,,,,
836767712,16.4.1959,СКИТУ (филиал) МГУТУ им. К. Г. Разумовского (бывш. РосЗИТиЛП),Технологический факультет,,Не указано,Женский,Наталья,Жаркова,Омск,,,,,,
836764127,1.12.1989,,,,Не указано,Женский,Яна,Яночка,Омск,,,,,,
836761331,11.8.2000,,,,Не указано,Мужской,Захар,Романчук,Омск,,,,,,
836752052,9.10.1997,ОмГМУ (бывш. ОмГМА),,,Не указано,Мужской,Сабыр,Ташимов,Омск,,,,,,
836749466,22.2.1975,ОмГУ им. Ф. М. Достоевского,Экономический факультет,,Не указано,Женский,Елена,Евстратова,Москва,,,,,,
836748550,28.4.1985,,,,Не указано,Мужской,Егор,Суворов,Омск,,,,,,
836747766,19.8.2006,,,,Не указано,Женский,Катя,Александрова,Омск,,,,,,
836740296,9.5.1954,,,,Не указано,Женский,Валентина,Кравец,Омск,,,,,,
836738236,20.2.1968,ОмГПУ,Факультет иностранных языков,,Не указано,Женский,Гелена,Яровая,Омск,,,,,,
836734241,1.10.1990,,,,,Женский,Светлана,Союнова,Омск,,,,,,
836734008,28.6.1975,,,,Не указано,Мужской,Николай,Степанов,Омск,,,,,,
836730816,9.12.2008,,,,Не указано,Мужской,Егор,Зайцев,Омск,,,,,,
836730063,5.5.1961,МИП,Юридический факультет,Томск,Женат / замужем,Мужской,Виктор,Чугуй,Самара,Заочное отделение,,,,,
836728436,10.1.2006,,,,Не указано,Женский,Вероника,Рудько,Омск,,резко негативное,красота и искусство,доброта и честность,резко негативное,
836724869,12.11.1998,,,,Не указано,Мужской,Виктор,Сайто,Омск,,,,,,
836724609,16.7.2008,,,,Не указано,Женский,Зарина,Еркебаева,Омск,,,,,,
836721658,5.6.2000,"ИПЭК
",Факультет права и экономики,,Не указано,Мужской,Sh,Sh,Омск,,,,,,
836718879,17.11.1981,ОмГАУ,Экономический факультет,,Не указано,Женский,Оковитая,Алена,Омск,,,,,,
836712942,1.8.1984,,,,Не указано,Женский,Лилия,Чаунина,Омск,,,,,,
836712793,1.9.1995,,,,,Мужской,Паша,Пугачев,Омск,,,,,,
836712762,22.3.1990,,,,Не указано,Мужской,Алексей,Игумнов,Омск,,,,,,
836710592,3.4.1952,,,,Не указано,Мужской,Алексей,Меньков,Омск,,,,,,
836707350,29.7.2009,,,,Не указано,Женский,Юлия,Горн,Омск,,,,,,
836704576,8.3.1997,,,,Не указано,Мужской,Андрей,Пип,Омск,,,,,,
836704571,2.4.2003,,,,Не указано,Мужской,Сергей,Серденко,Омск,,,,,,
836698669,3.8.1995,,,,Не указано,Мужской,Леонард,Снарт,Омск,,,,,,
836696065,24.12.1986,,,,Не указано,Мужской,Ринат,Аааааа,Омск,,,,,,
836694677,15.5.2000,,,Омск,Женат / замужем,Женский,Елена,Киселева,Омск,,,,,,
836692947,19.5.1954,,,,Не указано,Мужской,Максим,Лебедев,Омск,,,,,,
836684762,30.9.1995,"ОмГУПС
",,,Не указано,Мужской,Алексей,Глухов,Омск,,,,,,
836676931,18.3.2000,,,,Не указано,Мужской,Матвей,Грохотов,Омск,,,,,,
836673995,1.2.2003,,,,Не указано,Мужской,Евген,Петров,Омск,,,,,,
836673138,17.3.1989,,,,Не указано,Мужской,Ставка,Дня,Омск,,,,,,
836671869,18.10.2006,,,,Влюблён / влюблена,Мужской,Tobacco,Aphid,,,,,,,
836666913,5.6.1981,,,Омск,Не женат / не замужем,Мужской,Андрей,Иванов,Омск,,,,,,
836664803,24.2.1962,,,,Не указано,Женский,Зоя,Скрипникова,Омск,,,,,,
836659370,28.5.1965,,,,Не указано,Мужской,Евгений,Усенко,Омск,,,,,,
836659320,,,,,,Женский,Карина,Орлова,Омск,,,,,,
836656147,12.10.1969,,,,Не указано,Женский,Ольга,Семякина,Омск,,,,,,
836647022,3.11.1970,,,,Не указано,Женский,Наталья,Валькова,Омск,,,,,,
836641153,1.10.2000,ОмГТУ,"Факультет транспорта, нефти и газа",,Не указано,Мужской,El,Rz,Омск,,,,,,
836635079,4.2.1984,,,,Не указано,Мужской,Евгений,Владимирович,Омск,,,,,,
836627163,7.8.2007,"СибАДИ
",,,Не указано,Женский,Ульяна,Житникович,Омск,,,,,,
836624505,12.7.1942,,,,Не указано,Мужской,Марио,Бенивин,Омск,,,,,,
836619608,26.6.2003,,,,Не указано,Мужской,Андрей,Галанов,Омск,,,,,,
836618634,8.7.1989,,,,Не указано,Мужской,Станислав,Юртаев,Омск,,,,,,
836618334,12.12.1985,,,,Не указано,Женский,Ирина,Ирина,Омск,,,,,,
836616367,30.1.1956,ОмГТУ,Радиотехнический факультет,,Не указано,Мужской,Василий,Никитин,Омск,,,,,,
836616143,18.3.1990,,,,Не указано,Женский,Алина,Сергеева,Омск,,,,,,
836616100,,,,,,Женский,Диана,Проворкина,Омск,,,,,,
836614714,3.5.2000,,,,Не указано,Женский,Евчик,Серг,Омск,,,,,,
836613218,2.12.2002,,,,Не указано,Мужской,Nikolai,Petrov,Омск,,,,,,
836607549,20.7.1957,ОмГПУ,"Факультет математики, информатики, физики и технологии",,Не указано,Женский,Вера,Ковальчук,Омск,,,,,,
836607286,14.2.1973,,,,Не указано,Женский,Малюгина,Валентиновна,Омск,,,,,,
836606329,20.12.1988,,,,Не указано,Женский,Pocket,Styler,Омск,,,,,,
836605089,16.11.1973,,,,Не указано,Женский,Светлана,Эмралиева,Омск,,,,,,
836602257,12.9.1956,,,,Не указано,Женский,Диана,Макарена,Омск,,,,,,
836601469,4.9.2009,,,,Не указано,Женский,Виктория,Новикова,Омск,,,,,,
836600907,6.5.1956,,,,Не указано,Женский,Любовь,Подкович,Омск,,,,,,
836599366,5.4.1972,,,,Не указано,Женский,Лиана,Сазонова,Омск,,,,,,
836597169,,,,,Не указано,Мужской,Артур,Бекметов,Омск,,,,,,
836595536,,,,,,Женский,Евгения,Надеждина,Омск,,,,,,
836593732,,,,,,Женский,Оксана,Горст,Омск,,,,,,
836590884,8.9.1980,,,,Не указано,Женский,Инесса,Склярова,Омск,,,,,,
836587387,8.3.1983,"СибАДИ
",,,Не указано,Мужской,Александр,Шефер,Омск,,,,,,
836584427,1.1.1990,"ИПЭК
",,,Не указано,Женский,Евгения,Печенкина,Омск,,,,,,
836583958,19.12.1950,,,,Не указано,Мужской,Костя,Азлагоров,Омск,,,,,,
836577916,8.2.1996,,,,Не указано,Мужской,Олег,Сандаков,Омск,,,,,,
836577343,28.9.1992,,,Омск,Не женат / не замужем,Женский,Наращивание-Ресниц,Омск,Омск,,,саморазвитие,смелость и упорство,,
836576822,4.10.1974,,,,Не указано,Женский,Наталья,Янцен,Омск,,,,,,
836573861,,,,,,Мужской,Сергей,Дарья,Омск,,,,,,
836572316,29.2.1976,,,,Не указано,Мужской,Егор,Пономарев,Омск,,,,,,
836566631,6.12.1995,,,,Не указано,Мужской,Иван,Яценко,Омск,,,,,,
836563719,25.12.1988,"ОмУДТ (бывш. ОГИС, ОмТИ)",Заочный факультет,,Не указано,Мужской,Роман,Макаров,Красноярский,,,,,,
836557835,13.7.1964,,,,Не указано,Женский,Галина,Ковтун,Омск,,,,,,
836557313,25.5.1975,,,,Не указано,Мужской,Болатхан,Кинжитаев,Омск,,,,,,
836551043,8.1.1975,,,,Не указано,Мужской,Ноу,Нейм,Омск,,,,,,
836547861,27.5.2005,,,Астана,Не указано,Мужской,Даниил,Зима,,,,,,,
836547820,24.7.1996,,,,Не указано,Женский,Алена,Смирнова,Омск,,,,,,
836547419,1.1.1971,ОмГМУ (бывш. ОмГМА),,,Не указано,Женский,Татьяна,Ом,Омск,,,,,,
836547098,,,,,,Мужской,Кирилл,Митрофанов,Омск,,,,,,
836546830,7.3.1989,,,,Не указано,Женский,Ук,Этажи,Омск,,,,,,
836545117,15.4,,,,Не указано,Женский,Татьяна,Хавронина,Омск,,,,,,
836541704,26.5.2009,,,,Не указано,Женский,Анастасия,Копытько,Омск,,,,,,
836541540,28.2.1976,"СибАДИ
",Факультет «Промышленное и гражданское строительство»,,Не указано,Женский,Светлана,Горбунова,Омск,Очное отделение,,,,,
836539190,22.10.2008,,,,Не указано,Женский,Libvan,Kritinina,Омск,,,,,,
836532407,11.12.2001,,,,Не указано,Мужской,Илья,Ильязов,Омск,,,,,,
836529610,16.10.2000,,,,Не указано,Мужской,Семён,Поздняков,Омск,,,,,,
836529223,15.10.1980,,,,Не указано,Женский,Светлана,Андреевна,Омск,,,,,,
836528421,21.7.1979,,,,Не указано,Мужской,Абдыкадыр,Абдукаримович,Омск,,,,,,
836527715,31.3.1972,,,,Не указано,Мужской,Михаил,Астафуров,Омск,,,,,,
836524337,26.7.2000,,,Омск,Женат / замужем,Мужской,Алексей,Степнов,,,,семья и дети,ум и креативность,,
836523735,24.9.1987,,,,,Женский,Марина,Попова,Омск,,,,,,
836523317,18.5.1962,ОмГПУ,Факультет искусств,,Не указано,Мужской,Igor,Steps,Омск,,,,,,
836517107,26.8.1970,,,,Не указано,Женский,Наталья,Наталья,Омск,,,,,,
836513913,2.7.1981,,,,Не указано,Мужской,Алексец,Фома,Омск,,,,,,
836513343,16.11.1985,,,,,Мужской,Александр,Кременицкий,Омск,,,,,,
836509078,27.6.2006,,,,Не указано,Мужской,Семен,Попов,Омск,,,,,,
836505323,12.4.1996,"СибАДИ
",Факультет «Информационные системы в управлении»,,Не указано,Мужской,Александр,Леонов,Омск,,,,,,
836501580,27.11.2002,,,,Не указано,Мужской,Nikolay,Romanov,Омск,,,,,,
836498140,24.11.1995,ОмГМУ (бывш. ОмГМА),Стоматологический факультет,,Не указано,Мужской,Андрей,Шиповалов,Омск,,,,,,
836497875,31.3.1999,,,Крутинка,В активном поиске,Женский,Марина,Исмаилова,Омск,,компромиссное,саморазвитие,доброта и честность,компромиссное,
836497312,11.11.1995,,,,Не указано,Мужской,Алексей,Боровик,Омск,,,,,,
836496893,13.10.1994,,,,Не указано,Мужской,Василий,Пивнов,Омск,,,,,,
836493186,18.8.2005,,,,Не указано,Женский,Анастасия,Дьякова,Омск,,,,,,
836492051,17.7.1961,,,,Не указано,Женский,Будник,Наталья,Омск,,,,,,
836488455,5.5.1969,ОмГПУ,"Факультет начального, дошкольного и специального образования",,Не указано,Женский,Людмила,Архипова,Омск,,,,,,
836488266,1.1.2002,,,Таджикистан,Не указано,Мужской,Muhammed,Rasul,Омск,,,,,,
836488217,18.10.1966,,,,Не указано,Мужской,Дмитрий,Журавлёв,Омск,,,,,,
836487364,18.3.1995,"ОмГУПС
",,,Не указано,Мужской,Андрей,Петров,Омск,,,,,,
836485406,7.4.2000,,,,Не указано,Мужской,Егор,Барсуков,Омск,,,,,,
836484339,15.4.1955,,,,Не указано,Женский,Галина,Тарапатина,Омск,,,,,,
836482979,20.1.1995,,,,Не указано,Женский,Лиза,Стельмахова,Омск,,,,,,
836476309,17.1.1972,ОмГАУ,Экономический факультет,,Не указано,Мужской,Яковлев,Василий,Омск,,,,,,
836473485,5.3.1970,,,,Не указано,Мужской,Иван,Полтавец,Омск,,,,,,
836462463,1.5.1997,ОмГПУ,Факультет естественно-научного образования,,Не указано,Мужской,Egor,Smith,Омск,,,,,,
836459434,12.2.1981,,,,Не указано,Мужской,Фарик,Ноя,Омск,,,,,,
836458450,7.10.1999,,,Омск,Влюблён / влюблена,Мужской,Зелибоба,Сезамов,Омск,,,,,,
836458066,2.7,,,,Не указано,Мужской,Ell,Err,Омск,,,,,,
836440222,4.1.1996,СПбГУ,Факультет социологии,,Не указано,Женский,Ирина,Мороз,,,,,,,
836436808,9.5.1992,,,,Не указано,Мужской,Pavel,Serbin,Омск,,,,,,
836423690,20.3.1983,,,,Не указано,Мужской,Алекс,Иванов,Омск,,,,,,
836422443,23.1.1988,,,,Не указано,Мужской,Денис,Тобольский,Омск,,,,,,
836421002,27.6.1997,,,,,Женский,Любовь,Прохоренко,Омск,,,,,,
836420159,28.4.2006,,,"Омск, посёлок морозовка",Влюблён / влюблена,Женский,Валерия,Малая,Омск,,,,,,
836419337,8.4.1988,,,,Не указано,Мужской,Павел,Кузнецов,Омск,,,,,,
836416195,2.2.1982,,,,Не указано,Мужской,Василий,Интерестный,Омск,,,,,,
836402506,11.4.1992,,,,Не указано,Женский,Александра,Кабанова,Омск,,,,,,
836400929,22.12.2001,,,,Не указано,Женский,Яркое,Солнышко,Омск,,,,,,
836398125,19.3.1985,,,Омск,Женат / замужем,Женский,Анастасия,Наздричева,Омск,,,,,,
836396070,19.1.1999,ИРСИД,,,Не указано,Мужской,Токсик,Ток,Омск,,,,,,
836395097,20.8.1982,,,,Не указано,Женский,Ольга,Ганжа,Омск,,,,,,
836392995,20.6.1993,"СибАДИ
",Факультет «Автомобильные дороги и мосты»,,Не указано,Мужской,Хатаб,Мухамедов,Омск,,,,,,
836389930,14.7.2009,,,,Не указано,Женский,Самал,Кажкаримова,Омск,,,,,,
836388464,5.4.1957,ОмГПУ,Филологический факультет,,Не указано,Мужской,Леонид,Гайдар,Омск,,,,,,
836384822,3.3.2003,,,,Не указано,Мужской,По,Шахару,Омск,,,,,,
836384422,16.10.1987,,,,Не указано,Женский,Елена,Байдук,Омск,,,,,,
836379061,28.1.1973,,,Омск,Не указано,Женский,Ольга,Кротикова,Омск,,,,,,
836378955,19.2.2008,,,,Не указано,Женский,Алмагуль,Кажкаримова,Омск,,,,,,
836377336,14.3.2000,,,,Не указано,Женский,Надежда,Гаврикова,Омск,,,,,,
836370442,27.10.1974,,,,Не указано,Женский,Нелли,Мкртчян,Омск,,,,,,
836369952,4.11.1994,ОмГА (бывш. ОГИ),Гуманитарный факультет,,Не указано,Женский,Pola,Gu,,,,,,,
836369649,10.10.1993,,,,Не указано,Женский,Анастасия,Федосеева,Омск,,,,,,
836367530,11.8.1973,,,,Не указано,Женский,Светлана,Швачунова,Омск,,,,,,
836363581,,,,,,Женский,Оксана,Сергеева,Омск,,,,,,
836362637,28.4.1961,,,,Не указано,Женский,Загороднова,Елена,Омск,,,,,,
836362362,28.11.2002,ОмГПУ,,,Не указано,Мужской,Proto,The-Communisto,Омск,,,,,,
836359594,14.5.1983,,,,Не указано,Мужской,Вадим,Логинов,Омск,,,,,,
836358906,13.6.1966,,,,Не указано,Женский,Надежда,Максимейко,Омск,,,,,,
836358693,20.9.1980,,,,Не указано,Мужской,Alvik,Froizen,Омск,,,,,,
836358204,21.11.1980,,,,Не указано,Женский,Ольга,Комдир,Омск,,,,,,
836352744,3.5.1987,,,,,Мужской,Сергей,Верх,Омск,,,,,,
836351411,3.11.1971,ОмА МВД России (бывш. ОВШМ МВД СССР),Общеюридический факультет,Пермь,Не женат / не замужем,Мужской,Константин,Кутюхин,Пермь,,,,,,
836350330,6.3.2008,,,,Не указано,Мужской,Noname,Noname,Омск,,,,,,
836341875,2.1.1969,ОмГПУ,,,Не указано,Женский,Лилия,Легенькая,Омск,,,,,,
836339957,10.6.1961,,,,Не указано,Женский,Наталья,Михайлова,Омск,,,,,,
836339171,24.11.1978,,,,Не указано,Женский,Елена,Коновалова,Омск,,,,,,
836337578,8.8.1971,,,,Не указано,Женский,Наталья,Анатольевна,Омск,,,,,,
836337112,19.7.1964,"ОмГУПС
",,,Не указано,Женский,Кристина,Ткачева,,,,,,,
836336216,2.11.1998,ОмГМУ (бывш. ОмГМА),,,Не указано,Мужской,Александр,Федоров,Омск,,,,,,
836335675,1.5.1957,ОмГМУ (бывш. ОмГМА),Лечебный факультет,,Не указано,Женский,Галина,Доровских,Омск,Очное отделение,,,,,
836333982,23.4.2006,,,,Не указано,Женский,Tear,Liang,Омск,,,,,,
836325490,1.2.1953,,,,Не указано,Мужской,Алекс,Рад,Омск,,,,,,
836325390,3.5.1985,СибГУФК,,,Не указано,Мужской,Алексей-Анатольевич,Шаров,Омск,,,,,,
836317754,12.6.2001,,,Барнаул,В активном поиске,Мужской,Данил,Оноков,,,,,,,
836316373,17.12.1985,,,,Не указано,Мужской,Михаил,Нагаев,Омск,,,,,,
836315828,28.4.1987,,,,Не указано,Женский,Царёва,Ольга,Омск,,,,,,
836313497,28.4.2000,ММА (бывш. МИЛ),Факультет психологии,,Не указано,Женский,Валерия,Никотинева,Омск,,,,,,
836307534,14.11.2006,,,,Не указано,Мужской,Илья,Музыкантов,Омск,,,,,,
836306805,,,,,,Мужской,Денис,Контактов,Омск,,,,,,
836304559,29.10.2004,,,,Не указано,Мужской,Иосиф,Мильчарек,Омск,,,,,,
836303667,28.3.2001,,,,Не указано,Мужской,Александр,Лазарев,Омск,,,,,,
836302532,21.7.2000,ИРСИД,,,Не указано,Мужской,Костя,Голубев,Омск,,,,,,
836296905,14.12.1975,,,,Не указано,Женский,Галина,Тарасова,Омск,,,,,,
836293687,14.7.2000,ОмГПУ,,,Не указано,Мужской,Савелий,Тиктинский,Омск,,,,,,
836289941,24.7.1991,,,,Не указано,Женский,Настя,Рыбачик,Омск,,,,,,
836278369,9.2.2000,,,,Не указано,Женский,Яна,Иванова,Омск,,,,,,
836276722,,,,,,Мужской,Ричард,Сапогов,Омск,,,,,,
836276452,5.6.1976,,,,,Женский,Елена,Меньшикова,Омск,,,,,,
836272987,4.11.1981,ОмГУ им. Ф. М. Достоевского,Экономический факультет,,Не указано,Женский,Лариса,Лызлова,Омск,Очное отделение,,,,,
836272564,18.10.1989,,,,Не указано,Женский,Дарья,Попова,Омск,,,,,,
836270786,20.3.1975,,,,Не указано,Мужской,Александр,Доронин,Омск,,,,,,
836265983,23.2.1989,,,,Не указано,Мужской,Сергей,Юнусов,Омск,,,,,,
836257595,16.2.1973,ОмГУ им. Ф. М. Достоевского,Факультет иностранных языков,,Не указано,Женский,Tatiana,Epifanova,Омск,Очное отделение,,,,,
836255960,13.2.1983,ОмГТУ,,,Не указано,Женский,Оксана,Дайчман,Омск,,,,,,
836248648,26.4.1976,,,,Не указано,Женский,Socolic,Irina,Омск,,,,,,
836247646,14.12.1970,ОмГПУ,Факультет психологии и педагогики,,Не указано,Женский,Ольга,Багрова,Омск,,,,,,
836246831,16.5.1970,,,,,Женский,Оксана,Корытина,Омск,,,,,,
836245882,28.2.1983,ОмГПУ,"Факультет начального, дошкольного и специального образования",,Не указано,Женский,Галина,Куракова,,,,,,,
836241151,5.9.1991,СИБИТ,Факультет очного обучения,,Не указано,Женский,Катрин,Королева,Омск,,,,,,
836240137,13.6.1962,ОмГТУ,,,Не указано,Мужской,Dan,Gps,Омск,,,,,,
836238796,12.8.1986,,,,Не указано,Мужской,Дмитрий,Ливинский,Омск,,,,,,
836238372,25.7.1999,ОмГАУ,,,Не указано,Мужской,Александр,Макаренков,,,,,,,
836237834,20.6.1978,,,,Не указано,Мужской,Ed,Ed,Омск,,,,,,
836236726,5.4.1971,,,,Не указано,Женский,Светлана,Ситникова,Омск,,,,,,
836236278,1.1.2000,,,,Не указано,Мужской,Семен,Ли,Омск,,,,,,
