@startuml

package controller {
    class MainController{
        RestTemplate restTemplate
        index()
        show()
        buy()
    }

    class RestApiController{
        ShowService showService
        ClientService clientService
        SellService sellService
        showShow()
        addShow()
        dellShow()
        showClient()
        addClient()
        delClient()
        buyTicket()
        showTicket()
    }
}

package models{

    abstract class AbstractEntity{
        Integer id
    }

    class Client extends AbstractEntity{
        String firstName
            String lastName
    }

    class Place extends AbstractEntity{
         String place;
         Boolean isFree;
         Show show;
    }

    class Show extends AbstractEntity{
        String title;
        ZonedDateTime dateTime;
        Float price;
        List<Place> place;
    }

    class Ticket extends AbstractEntity{
         Place place;
         Client client;
    }
}
package repositories {
    interface ClientRepository
    interface PlaceRepository
    interface ShowRepository
    interface TicketRepository
}

package services {

    class ClientService{
        ClientRepository clientRepository
        Iterable<Client> findAllClients()
        Optional<Client> findClientById()
        Client saveNewClient()
        void deleteClientById()
    }

    class SellService {
        TicketRepository ticketRepository;
        ClientRepository clientRepository;
        PlaceRepository placeRepository;
        Ticket buyTicket()
        Iterable<Ticket> findAllTicket()
        Optional<Ticket> findTicketById()
    }

    class ShowService {
        private ShowRepository showRepository;
        private PlaceRepository placeRepository;
        Iterable<Show> findAllShows()
        Optional<Show> findShowById()
        Optional<Show> saveNew()
        void deleteShowById()
    }
}

class TheaterApplication{
    main()
}



controller *-- services
controller .. models

services *-- repositories
services .. models

repositories .. models

TheaterApplication -- controller

Ticket *-- Client
Ticket *-- Place
Place --* Show


MainController .. RestApiController

@enduml