<svg width="219" height="80" viewBox="0 0 219 80" fill="none" xmlns="http://www.w3.org/2000/svg">
	<path d="M126.94 23.93L127.25 24.7C127.24 23.54 127.3 22.77 127.45 22C127.2 20.46 127 22.78 126.94 23.93Z" fill="#3D90D9"/>
	<path d="M129.73 32.92C129.65 31.8 129.46 31.1 129.25 31.02C129.27 30.6 129.32 30.2 129.46 31.23C129.78 25.45 129.22 30.46 128.73 27L129.21 31.02C129.16 31.02 129.1 31.05 129.05 31.14C128.89 32.21 128.48 33.26 128.69 34.99C128.45 34.96 128.49 37.76 127.97 36.12C128.09 32.24 127.16 30.42 127.34 27.28L126.95 26.26C126.95 25.49 126.76 24.02 126.7 22.63L126.69 21.36C126.7 21.01 126.73 20.69 126.77 20.41C126.98 15.57 127.59 20.76 128 20.93L128.19 16.93C127.96 15.84 127.91 14.84 127.94 13.9C127.96 13.43 128 12.97 128.05 12.52C128.1 12.05 128.17 11.7 128.23 11.09C128.36 9.97999 128.49 8.82999 128.54 7.66999C128.59 6.50999 128.57 5.32999 128.38 4.30999C128.05 4.32999 127.71 4.34999 127.36 4.38999L128.12 4.18999C128.3 4.17999 128.47 4.17999 128.54 4.15999C128.73 5.08999 128.94 4.65999 129.11 3.62999C128.37 3.36999 126.8 3.08999 125.62 2.99999L123.68 3.06999C123.27 3.16999 122.81 3.23999 122.29 3.27999C122.03 3.29999 121.76 3.31999 121.48 3.31999C121.25 3.32999 121 3.32999 120.75 3.33999C119.86 3.35999 118.81 3.29999 117.71 3.20999C115.51 3.02999 113.07 2.72999 111.09 2.72999C110.25 2.62999 109.93 2.37999 110.67 2.39999L106.4 1.57999C105.08 2.49999 103.24 1.34999 100.66 1.28999C98.86 1.56999 98.29 1.94999 95.91 2.04999C90.01 0.799988 86.37 1.58999 81.09 0.269989C80.2 0.969989 76.88 0.889988 79.36 1.97999C76.29 1.42999 73.37 0.909988 70.47 0.389988C70.36 1.76999 70.26 3.25999 70.19 4.85999C70.15 5.65999 70.12 6.47999 70.1 7.32999C70.08 8.07999 70.07 8.83999 70.05 9.59999C70.18 9.96999 70.3 10.37 70.44 10.74C70.82 11.05 71.3 11.6 71.82 12.18L72.28 26C72.21 26.17 72.14 26.35 72.07 26.54C70.82 31.37 69.91 37.65 69.48 44.47C69.81 45.76 70.14 47.1 70.41 48.62L69.87 52.89C70.01 57.12 70.41 62.12 71.49 64.76C71.36 65.54 71.21 65.55 71.09 66.33C71.13 66.52 71.17 66.74 71.2 66.97C71.22 67.1 71.23 67.18 71.24 67.36C71.25 67.53 71.27 67.71 71.28 67.9C71.32 68.63 71.36 69.42 71.4 70.22C71.48 71.8 71.59 73.37 71.88 74.14C71.87 74.28 71.86 74.42 71.85 74.52C72.82 74.74 73.28 74.96 73.65 75.19C74.03 75.42 74.32 75.66 75.05 75.93C75.88 75.93 76.71 75.97 77.55 76.02C77.97 76.05 78.4 76.08 78.83 76.11C79.14 76.14 79.45 76.17 79.76 76.2C80.92 76.33 82.12 76.5 83.31 76.67C85.7 77 88.1 77.3 90.23 77.07C92.09 78.51 96.42 76.77 98.66 78.16C103.25 78.96 108.27 78.8 109.46 78.05C109.45 78.28 107.88 78.77 109.79 79.22C110.17 79.17 110.95 79.15 110.95 79.08C111.33 79.11 114.77 79.75 115.94 79.45C116.42 79.34 116.57 79.24 116.47 79.12C113.63 78.26 116.75 77.16 120.32 76.18L125.73 76.59C125.86 76.84 125.99 76.87 126.11 76.62L127.29 76.71L127.27 74.56C127.33 74.55 127.4 74.55 127.46 74.54C127.4 74.53 127.33 74.52 127.27 74.51L127.22 70.39C127.29 70.66 127.37 70.85 127.49 70.87C128.1 71.55 128.36 67.45 128.47 65.64C128.1 63.77 127.99 66.8 127.93 68.13L127.17 65.9L127.15 64.02C127.21 63.81 127.29 63.68 127.37 63.69C127.63 62.86 128.34 63.81 128.23 62.33C128.32 58.08 127.33 62.1 127.24 58.55C127.19 58.61 127.13 58.69 127.08 58.79L127.04 55.21C127.38 54.48 127.75 53.82 128.21 55.39C128.28 54.06 128.7 53.38 128.57 51.54C127.57 46.55 128.69 44.38 128.38 39.96C128.26 40.56 128.04 39.67 127.87 39.54C128.17 33.33 130.34 41.39 129.73 32.92Z" fill="#3D90D9"/>
	<path d="M68.2 53.1C67.59 53.12 67.49 56.98 67.22 58.14C67.6 60.44 68.3 63.12 68.63 61.56C68.6 58.48 67.92 56.19 68.2 53.1Z" fill="#3D90D9"/>
	<path d="M129.77 23.43L129.68 19.89L129.18 20.68C128.91 23.57 129.71 21.48 129.77 23.43Z" fill="#3D90D9"/>
	<path d="M7.77002 22.39C7.78002 22.7 7.55002 23.45 7.08002 24.63C6.84002 25.22 6.66002 25.71 6.53002 26.1C6.40002 26.49 6.32002 26.77 6.30002 26.95C6.06002 28.36 5.83002 29.88 5.61002 31.51C5.39002 33.14 5.18002 34.89 4.98002 36.78C4.91002 37.29 4.85002 37.73 4.80002 38.11C4.75002 38.48 4.71002 38.79 4.67002 39.03C4.65002 39.27 4.62002 39.53 4.58002 39.8C4.54002 40.07 4.51002 40.38 4.49002 40.72C4.47002 41.05 4.45002 41.36 4.45002 41.63C4.44002 41.9 4.45002 42.16 4.46002 42.4C4.46002 42.54 4.54002 42.76 4.69002 43.04C4.83002 43.3 4.91002 43.53 4.92002 43.72C4.94002 44.15 4.65002 44.56 4.05002 44.97C3.75002 45.17 3.48002 45.32 3.22002 45.42C2.96002 45.52 2.72002 45.58 2.50002 45.61C2.16002 45.61 1.88002 45.53 1.68002 45.36C1.45002 45.12 1.26002 44.83 1.11002 44.47C0.960018 44.11 0.870018 43.81 0.860018 43.56C0.820018 42.81 0.820019 42.06 0.830019 41.32C0.850019 40.57 0.900017 39.81 1.00002 39.04C1.10002 38.28 1.21002 37.42 1.35002 36.46C1.49002 35.5 1.66002 34.43 1.86002 33.25C2.01002 32.44 2.16002 31.68 2.30002 30.96C2.44002 30.24 2.57002 29.56 2.70002 28.92C2.83002 28.27 2.98002 27.53 3.15002 26.72C3.32002 25.91 3.50002 25 3.70002 23.99C3.76002 23.63 3.81002 23.33 3.86002 23.08C3.91002 22.83 3.95002 22.63 3.99002 22.49C4.01002 22.32 4.05002 22.1 4.11002 21.83C4.16002 21.56 4.23002 21.21 4.31002 20.8C4.32002 20.66 4.37002 20.49 4.44002 20.31C4.52002 20.13 4.61002 19.95 4.72002 19.78C4.83002 19.61 4.96002 19.47 5.09002 19.34C5.23002 19.22 5.36002 19.15 5.49002 19.15C5.73002 19.14 5.99002 19.19 6.28002 19.32C6.57002 19.44 6.81002 19.61 6.98002 19.81C7.22002 20.05 7.40002 20.3 7.51002 20.57C7.62002 20.84 7.70002 21.12 7.72002 21.42C7.73002 21.61 7.74002 21.78 7.74002 21.92C7.74002 22.06 7.75002 22.21 7.77002 22.39Z" fill="white"/>
	<path d="M43.07 32.66C43.07 32.89 43.03 33.11 42.95 33.35C42.87 33.59 42.78 33.81 42.67 34.04C42.56 34.27 42.43 34.5 42.29 34.72C42.15 34.94 42.01 35.15 41.88 35.35C41.54 35.88 41.13 36.43 40.67 36.98C40.21 37.53 39.71 38.07 39.18 38.59C38.65 39.11 38.11 39.61 37.55 40.07C36.99 40.53 36.45 40.94 35.91 41.3C35.48 41.58 35.08 41.85 34.69 42.1C34.3 42.35 33.92 42.56 33.52 42.74C33.13 42.92 32.72 43.06 32.29 43.17C31.86 43.28 31.39 43.33 30.88 43.33C29.89 43.33 29.09 43.08 28.48 42.58C28.17 42.33 27.9 42.01 27.67 41.61C27.44 41.21 27.24 40.77 27.06 40.28C26.89 39.79 26.74 39.28 26.61 38.73C26.49 38.18 26.38 37.64 26.3 37.11C26.19 36.45 26.09 35.85 26 35.32C25.9 34.79 25.79 34.35 25.67 33.98C25.54 33.62 25.39 33.34 25.22 33.14C25.04 32.94 24.81 32.85 24.53 32.85C24.3 32.85 24.09 32.87 23.89 32.92C23.69 32.97 23.48 33.06 23.26 33.2C23.04 33.34 22.8 33.54 22.54 33.81C22.28 34.07 21.97 34.42 21.62 34.84C21.27 35.27 20.87 35.79 20.42 36.41C19.97 37.03 19.44 37.76 18.84 38.62C18.54 39.04 18.19 39.49 17.79 39.99C17.39 40.49 16.97 40.96 16.55 41.41C16.13 41.86 15.72 42.26 15.31 42.6C14.9 42.94 14.55 43.16 14.24 43.26C13.2 43.03 12.67 41.73 12.67 39.36C12.67 38.73 12.74 37.77 12.88 36.49C12.95 35.91 13.03 35.3 13.13 34.66C13.23 34.03 13.34 33.39 13.49 32.75C13.64 32.11 13.8 31.5 13.98 30.9C14.16 30.3 14.38 29.75 14.63 29.23C14.75 28.99 14.87 28.81 15 28.67C15.13 28.53 15.26 28.43 15.4 28.37C15.54 28.3 15.68 28.26 15.83 28.24C15.98 28.22 16.13 28.21 16.28 28.21C16.47 28.21 16.64 28.34 16.79 28.6C16.94 28.86 17.01 29.22 17.01 29.69C17.01 29.98 16.99 30.24 16.94 30.49C16.89 30.74 16.83 30.99 16.74 31.26C16.66 31.52 16.57 31.8 16.47 32.11C16.37 32.41 16.28 32.76 16.18 33.15C16.11 33.47 16.03 33.83 15.94 34.22C15.85 34.61 15.77 35.01 15.69 35.41C15.61 35.81 15.55 36.21 15.49 36.59C15.44 36.98 15.41 37.32 15.41 37.63C15.41 37.84 15.45 38.06 15.52 38.29C15.85 38.25 16.4 37.76 17.16 36.79C17.55 36.3 17.98 35.77 18.45 35.19C18.92 34.61 19.43 33.97 19.97 33.27C20.37 32.75 20.77 32.26 21.17 31.81C21.57 31.36 22 31 22.42 30.66C22.85 30.32 23.3 30.05 23.78 29.86C24.26 29.66 24.79 29.57 25.37 29.57C25.99 29.57 26.5 29.7 26.91 29.97C27.32 30.24 27.65 30.61 27.9 31.07C28.15 31.54 28.34 32.1 28.48 32.75C28.62 33.4 28.73 34.12 28.81 34.9C28.88 35.57 28.95 36.22 29.01 36.88C29.07 37.53 29.2 38.12 29.39 38.63C29.58 39.14 29.85 39.57 30.21 39.89C30.57 40.21 31.08 40.37 31.74 40.37C32.25 40.37 32.78 40.25 33.34 40.01C33.9 39.77 34.49 39.44 35.1 39.02C35.72 38.6 36.36 38.1 37.01 37.53C37.67 36.96 38.35 36.34 39.05 35.66C39.32 35.4 39.62 35.07 39.95 34.67C40.28 34.27 40.6 33.89 40.91 33.52C41.22 33.15 41.52 32.84 41.79 32.58C42.06 32.32 42.28 32.19 42.45 32.19C42.52 32.19 42.64 32.23 42.8 32.3C42.96 32.37 43.07 32.5 43.07 32.66Z" fill="white"/>
	<path d="M43.08 28.9C43.25 28.65 43.45 28.4 43.69 28.14C43.93 27.89 44.18 27.65 44.44 27.45C44.7 27.24 44.95 27.07 45.2 26.94C45.44 26.81 45.65 26.74 45.81 26.74C45.99 26.74 46.16 26.78 46.32 26.85C46.48 26.92 46.62 27.02 46.75 27.13C46.87 27.25 46.98 27.38 47.05 27.53C47.12 27.68 47.17 27.83 47.17 27.98C47.17 28.28 47.09 28.57 46.93 28.85C46.77 29.14 46.57 29.41 46.32 29.69C46.08 29.96 45.81 30.23 45.53 30.48C45.24 30.74 44.98 30.98 44.73 31.22C44.48 31.46 44.28 31.68 44.12 31.89C43.96 32.1 43.87 32.29 43.86 32.47C44.04 32.86 44.28 33.24 44.59 33.6C44.9 33.96 45.25 34.32 45.65 34.66C46.05 35 46.47 35.35 46.93 35.69C47.39 36.03 47.86 36.38 48.35 36.74C48.62 36.94 48.86 37.15 49.05 37.35C49.25 37.56 49.42 37.75 49.56 37.91C49.7 38.08 49.82 38.21 49.91 38.32C50 38.43 50.07 38.48 50.13 38.48C50.21 38.48 50.34 38.43 50.51 38.33C50.68 38.23 50.88 38.09 51.1 37.92C51.32 37.75 51.57 37.54 51.84 37.31C52.11 37.07 52.39 36.82 52.68 36.54C53.37 35.9 54.06 35.2 54.76 34.45C55.46 33.7 56.11 32.99 56.72 32.33C57.33 31.67 57.86 31.12 58.31 30.68C58.77 30.24 59.1 30.02 59.3 30.02C59.43 30.02 59.53 30.05 59.6 30.1C59.67 30.15 59.72 30.22 59.75 30.3C59.78 30.38 59.8 30.48 59.8 30.59C59.8 30.7 59.81 30.8 59.81 30.89C59.81 31.02 59.72 31.25 59.53 31.57C59.34 31.89 59.11 32.26 58.81 32.69C58.51 33.12 58.17 33.58 57.79 34.07C57.41 34.56 57.02 35.05 56.63 35.53C56.24 36.01 55.86 36.46 55.49 36.87C55.12 37.28 54.8 37.63 54.51 37.9C54.19 38.21 53.9 38.49 53.63 38.75C53.36 39.01 53.09 39.27 52.8 39.55C52.51 39.83 52.2 40.14 51.85 40.48C51.5 40.82 51.08 41.23 50.59 41.7C50.2 42.08 49.83 42.47 49.49 42.86C49.15 43.25 48.81 43.64 48.47 44.03C48.13 44.42 47.79 44.8 47.44 45.19C47.09 45.58 46.71 45.95 46.31 46.32C45.64 46.91 45.01 47.41 44.41 47.81C43.81 48.21 43.21 48.41 42.62 48.41C42.12 48.41 41.71 48.31 41.37 48.12C41.03 47.93 40.87 47.66 40.87 47.32C40.87 46.96 41.01 46.63 41.28 46.32C41.55 46.01 41.89 45.72 42.3 45.44C42.7 45.16 43.14 44.89 43.62 44.64C44.1 44.39 44.54 44.13 44.96 43.88C45.81 43.37 46.45 42.8 46.87 42.18C47.29 41.56 47.49 40.93 47.49 40.3C47.49 39.85 47.23 39.34 46.7 38.77C46.17 38.2 45.29 37.52 44.06 36.74C43.67 36.49 43.31 36.21 42.99 35.91C42.67 35.61 42.4 35.3 42.18 35C41.96 34.7 41.79 34.4 41.66 34.12C41.53 33.83 41.47 33.59 41.47 33.37C41.47 32.93 41.49 32.54 41.54 32.19C41.59 31.85 41.67 31.5 41.8 31.17C41.92 30.83 42.09 30.48 42.3 30.12C42.52 29.78 42.77 29.37 43.08 28.9Z" fill="white"/>
	<path d="M84.26 31.72C84.26 32.09 84.13 32.53 83.89 33.04C83.64 33.55 83.36 33.92 83.05 34.16C81.86 35.12 80.55 36.02 79.11 36.85C77.67 37.68 76.07 38.51 74.33 39.33C72.58 40.15 70.92 40.86 69.33 41.45C67.74 42.04 66.2 42.54 64.72 42.93C64.59 42.98 64.36 43 64.03 43C63.46 43 62.91 42.85 62.39 42.54C61.88 42.22 61.62 41.76 61.62 41.17C61.62 40.96 61.69 40.78 61.83 40.64C62.03 40.44 62.44 40.22 63.04 40C63.66 39.77 64.44 39.51 65.39 39.2C65.87 39.05 66.27 38.91 66.59 38.79C66.92 38.67 67.16 38.57 67.33 38.49C68.09 38.09 68.79 37.55 69.44 36.87C70.09 36.19 70.62 35.48 71.05 34.73C71.63 33.76 71.92 32.9 71.92 32.15C71.92 30.54 71.4 29.73 70.35 29.73C69.74 29.73 68.97 29.97 68.03 30.46C67.57 30.7 67.14 30.94 66.76 31.19C66.37 31.44 66.03 31.68 65.72 31.92C65.22 32.32 64.69 32.87 64.13 33.57C63.57 34.26 63.03 35.02 62.49 35.82C61.96 36.63 61.45 37.44 60.98 38.27C60.51 39.1 60.12 39.84 59.8 40.51C59.74 41.06 59.68 41.66 59.62 42.34C59.56 43.02 59.5 43.75 59.42 44.56C59.29 46.17 59.14 47.7 58.97 49.13C58.8 50.56 58.62 51.8 58.42 52.84C58.38 53.05 58.35 53.27 58.31 53.48C58.27 53.69 58.23 53.85 58.19 53.96C58.05 54.33 57.79 54.51 57.42 54.51C57.09 54.51 56.64 54.34 56.08 53.99C55.55 53.66 55.28 53.33 55.28 53.01C55.28 52.81 55.29 52.57 55.32 52.29C55.34 52.01 55.38 51.69 55.43 51.34C55.52 50.38 55.61 49.56 55.69 48.87C55.77 48.19 55.84 47.64 55.9 47.24C56.07 46.02 56.21 44.7 56.35 43.28C56.48 41.86 56.59 40.31 56.67 38.64C56.69 38.15 56.71 37.43 56.72 36.49C56.74 35.52 56.76 34.68 56.78 33.97C56.8 33.26 56.82 32.67 56.86 32.2C57.03 29.93 57.62 28.8 58.64 28.8C59.04 28.8 59.4 28.98 59.71 29.33C60.02 29.7 60.17 30.08 60.17 30.47C60.17 30.89 60.13 31.34 60.04 31.84C59.95 32.34 59.86 32.85 59.76 33.37C59.66 33.89 59.56 34.41 59.47 34.91C59.38 35.41 59.34 35.87 59.34 36.27C59.34 36.61 59.38 36.79 59.45 36.79C60.28 35.29 61.1 33.99 61.9 32.89C62.7 31.79 63.5 30.86 64.3 30.11C65.48 29.02 66.6 28.23 67.68 27.76C68.75 27.29 70.04 27.05 71.56 27.05C72 27.04 72.39 27.19 72.74 27.5C73.09 27.81 73.39 28.19 73.64 28.65C73.89 29.11 74.08 29.59 74.21 30.11C74.34 30.63 74.41 31.08 74.41 31.47C74.42 32.06 74.32 32.68 74.12 33.33C73.91 33.98 73.64 34.62 73.29 35.25C72.94 35.88 72.55 36.5 72.11 37.08C71.67 37.67 71.22 38.19 70.76 38.64C71.94 38.2 73.26 37.61 74.73 36.88C76.21 36.13 77.61 35.33 78.91 34.48C80.21 33.63 81.38 32.75 82.43 31.86C82.94 31.44 83.39 31.24 83.78 31.24C84.1 31.2 84.26 31.37 84.26 31.72Z" fill="white"/>
	<path d="M100.22 33.8V33.84C100.22 34.1 100.1 34.45 99.86 34.87C99.62 35.3 99.3 35.78 98.91 36.31C98.51 36.84 98.05 37.41 97.53 38.02C97.01 38.63 96.46 39.24 95.89 39.85C95.21 40.56 94.51 41.25 93.78 41.91C93.05 42.57 92.26 43.21 91.4 43.82C89.74 45.06 88.25 45.67 86.95 45.67C85.51 45.67 84.4 45.19 83.6 44.23C82.8 43.26 82.26 42.08 81.98 40.7C81.69 39.33 81.55 37.93 81.55 36.48C81.55 35.87 81.62 34.93 81.76 33.65C81.83 33.01 81.9 32.46 81.97 31.99C82.04 31.52 82.12 31.15 82.2 30.87C82.37 30.31 82.72 29.83 83.25 29.41C83.8 28.97 84.37 28.75 84.96 28.75C85.28 28.75 85.44 29.05 85.44 29.66C85.44 30.06 85.4 30.52 85.32 31.03C85.24 31.54 85.16 32.05 85.08 32.54C84.93 33.48 84.81 34.32 84.74 35.06C84.67 35.8 84.63 36.45 84.63 36.99C84.63 38.2 84.8 39.41 85.13 40.62C85.46 41.87 86.06 42.49 86.93 42.49C87.81 42.49 88.83 42.17 89.99 41.53C90.57 41.2 91.15 40.83 91.74 40.43C92.32 40.03 92.9 39.58 93.49 39.08C94.1 38.58 94.67 38.08 95.2 37.58C95.73 37.08 96.27 36.56 96.8 36.02C97.33 35.49 97.81 34.99 98.22 34.52C98.63 34.06 98.99 33.63 99.3 33.24C99.32 33.19 99.37 33.1 99.44 32.97C99.51 32.84 99.58 32.77 99.64 32.77L99.68 32.79C99.77 32.79 99.85 32.82 99.89 32.89C99.94 32.96 99.99 33.05 100.05 33.18C100.18 33.46 100.23 33.66 100.22 33.8ZM88.55 19.32C88.55 20.09 88.35 20.75 87.94 21.3C87.55 21.85 86.97 22.12 86.21 22.12C85.73 22.12 85.21 22.05 84.62 21.91C84.05 21.77 83.77 21.54 83.77 21.22C83.77 20.64 83.95 20.08 84.31 19.55C84.67 19.02 85.11 18.59 85.62 18.26C86.04 18.02 86.3 17.9 86.42 17.9C87.1 17.9 87.62 17.99 87.99 18.18C88.37 18.36 88.55 18.74 88.55 19.32Z" fill="white"/>
	<path d="M114.95 31.02C114.95 31.09 114.94 31.2 114.93 31.33C114.92 31.47 114.89 31.6 114.84 31.74C114.79 31.88 114.74 32 114.67 32.11C114.6 32.22 114.52 32.27 114.41 32.27C114.34 32.27 114.22 32.27 114.05 32.26C113.88 32.25 113.71 32.25 113.52 32.23C113.34 32.22 113.16 32.21 112.99 32.2C112.82 32.19 112.7 32.19 112.63 32.19C110.36 32.33 108.47 33.16 106.97 34.68C105.49 36.16 104.2 38.15 103.12 40.63C102.92 41.14 102.72 41.67 102.52 42.21C102.32 42.76 102.14 43.33 101.96 43.94C101.86 44.27 101.8 44.57 101.75 44.82C101.7 45.07 101.64 45.35 101.55 45.63C101.53 45.72 101.43 45.82 101.25 45.91C101.07 46 100.87 46.08 100.65 46.15C100.43 46.22 100.22 46.28 100.02 46.33C99.82 46.38 99.68 46.4 99.61 46.4C98.79 46.45 98.33 45.6 98.22 43.85C98.18 43.38 98.17 42.94 98.18 42.56C98.19 42.17 98.2 41.8 98.22 41.44C98.24 41.08 98.28 40.7 98.32 40.3C98.36 39.9 98.41 39.45 98.45 38.96C98.51 38.34 98.58 37.63 98.66 36.82C98.74 36.01 98.84 35.2 98.95 34.38C99.06 33.56 99.17 32.78 99.29 32.04C99.41 31.3 99.53 30.68 99.66 30.2C99.79 29.64 99.97 29.23 100.2 28.95C100.43 28.67 100.77 28.53 101.22 28.5C101.34 28.5 101.47 28.53 101.6 28.6C101.74 28.66 101.86 28.75 101.97 28.86C102.08 28.97 102.18 29.08 102.25 29.2C102.33 29.32 102.37 29.43 102.38 29.52C102.39 29.82 102.39 30.14 102.36 30.49C102.33 30.84 102.29 31.2 102.24 31.58C102.18 31.95 102.11 32.33 102.03 32.71C101.95 33.09 101.86 33.45 101.78 33.8C101.61 34.48 101.49 35.06 101.4 35.54C101.31 36.02 101.24 36.49 101.18 36.94C101.12 37.39 101.06 37.88 101 38.39C100.94 38.91 100.86 39.54 100.77 40.3C100.97 39.85 101.15 39.46 101.3 39.14C101.45 38.82 101.58 38.54 101.7 38.29C101.82 38.04 101.93 37.83 102.03 37.64C102.13 37.45 102.24 37.25 102.36 37.04C102.48 36.83 102.61 36.6 102.75 36.35C102.89 36.1 103.07 35.8 103.28 35.44C104.11 34.06 105 32.94 105.95 32.06C106.9 31.19 107.81 30.56 108.69 30.18C109.69 29.71 110.51 29.45 111.15 29.41C111.46 29.4 111.83 29.42 112.25 29.46C112.68 29.51 113.09 29.6 113.48 29.73C113.87 29.86 114.21 30.03 114.49 30.24C114.77 30.45 114.95 30.73 114.95 31.02Z" fill="white"/>
	<path d="M142.91 33.27C142.91 33.41 142.89 33.58 142.86 33.78C142.83 33.98 142.77 34.18 142.71 34.38C142.64 34.58 142.57 34.78 142.5 34.96C142.43 35.14 142.34 35.29 142.26 35.4C142.19 35.5 142.08 35.62 141.95 35.78C141.81 35.94 141.66 36.12 141.5 36.31C141.33 36.5 141.15 36.7 140.96 36.91C140.76 37.12 140.56 37.32 140.35 37.51C139.61 38.19 138.89 38.84 138.19 39.48C137.48 40.12 136.76 40.68 136.01 41.16C135.26 41.64 134.48 42.04 133.67 42.33C132.86 42.62 131.98 42.76 131.03 42.75C130.59 42.75 130.15 42.67 129.7 42.51C129.26 42.35 128.84 42.12 128.44 41.82C128.05 41.52 127.71 41.17 127.42 40.75C127.13 40.33 126.93 39.88 126.81 39.38C126.47 39.74 126.1 40.11 125.72 40.49C125.34 40.88 124.95 41.26 124.54 41.66C124.13 42.05 123.71 42.43 123.27 42.8C122.83 43.17 122.38 43.51 121.92 43.82C121.66 43.99 121.35 44.16 120.98 44.35C120.61 44.54 120.24 44.71 119.84 44.88C119.44 45.04 119.04 45.17 118.65 45.27C118.25 45.37 117.89 45.42 117.57 45.42C117.08 45.42 116.66 45.27 116.31 44.97C115.96 44.67 115.67 44.3 115.44 43.86C115.21 43.42 115.04 42.95 114.92 42.45C114.81 41.95 114.75 41.51 114.75 41.11C114.75 40.33 114.86 39.53 115.09 38.71C115.32 37.89 115.61 37.09 115.97 36.31C116.33 35.53 116.74 34.79 117.18 34.09C117.63 33.39 118.06 32.77 118.49 32.22C118.94 31.65 119.48 31.08 120.09 30.52C120.71 29.96 121.35 29.45 122.01 29.01C122.68 28.57 123.33 28.21 123.97 27.93C124.61 27.65 125.18 27.52 125.68 27.52C125.93 27.52 126.19 27.52 126.47 27.52C126.75 27.52 127.02 27.54 127.3 27.56C127.57 27.59 127.84 27.64 128.1 27.7C128.36 27.76 128.6 27.86 128.81 27.99C128.92 28.06 129.04 28.2 129.18 28.4C129.32 28.6 129.46 28.83 129.58 29.08C129.7 29.33 129.81 29.58 129.89 29.83C129.97 30.08 130.02 30.27 130.02 30.42C130.02 30.81 129.93 31.33 129.75 31.99C129.56 32.81 129.38 33.55 129.22 34.23C129.06 34.9 128.98 35.59 128.98 36.3C128.98 36.7 129.04 37.12 129.18 37.54C129.32 37.96 129.5 38.34 129.74 38.69C129.98 39.04 130.28 39.32 130.63 39.54C130.98 39.76 131.38 39.87 131.81 39.87C132.53 39.87 133.28 39.72 134.04 39.42C134.8 39.12 135.57 38.7 136.35 38.17C137.13 37.64 137.9 37.03 138.67 36.34C139.44 35.65 140.2 34.91 140.95 34.12C141.01 34.05 141.11 33.93 141.26 33.75C141.41 33.58 141.56 33.41 141.72 33.23C141.88 33.06 142.04 32.9 142.19 32.77C142.34 32.63 142.46 32.56 142.53 32.56C142.78 32.54 142.91 32.78 142.91 33.27ZM127.06 31.79C127.06 31.59 127.05 31.34 127.02 31.04C127 30.74 126.92 30.5 126.79 30.31C126.66 30.12 126.5 30.03 126.31 30.03C126.12 30.04 125.93 30.04 125.74 30.04C125.32 30.04 124.92 30.11 124.54 30.24C124.15 30.37 123.78 30.55 123.41 30.78C123.04 31.01 122.69 31.28 122.35 31.58C122.01 31.88 121.68 32.2 121.36 32.53C121.09 32.8 120.8 33.14 120.5 33.55C120.2 33.95 119.9 34.4 119.61 34.88C119.32 35.36 119.04 35.87 118.76 36.39C118.49 36.92 118.25 37.44 118.05 37.96C117.85 38.48 117.69 38.98 117.57 39.46C117.45 39.94 117.39 40.38 117.39 40.77C117.39 40.89 117.4 41.05 117.43 41.24C117.46 41.43 117.51 41.63 117.57 41.81C117.63 41.99 117.72 42.15 117.84 42.28C117.95 42.41 118.09 42.48 118.26 42.48C118.81 42.48 119.49 42.31 120.31 41.96C121.43 41.49 122.44 40.84 123.35 40.01C124.26 39.19 125.03 38.23 125.67 37.15C126.59 35.48 127.06 33.69 127.06 31.79Z" fill="white"/>
	<path d="M159.76 29.99C159.76 30.2 159.73 30.39 159.67 30.54C159.61 30.69 159.53 30.83 159.42 30.93C159.31 31.04 159.19 31.14 159.05 31.22C158.91 31.31 158.76 31.4 158.6 31.48C158.21 31.66 157.74 31.81 157.2 31.93C156.66 32.05 156.1 32.15 155.53 32.24C154.95 32.33 154.38 32.41 153.82 32.47C153.26 32.53 152.74 32.6 152.28 32.67C151.41 32.8 150.65 32.9 149.98 32.98C149.31 33.06 148.74 33.13 148.25 33.2C147.76 33.27 147.36 33.35 147.04 33.43C146.72 33.51 146.46 33.63 146.27 33.79C146.02 34.87 145.76 35.97 145.5 37.08C145.23 38.19 145 39.23 144.81 40.21C144.77 40.38 144.74 40.55 144.69 40.74C144.64 40.93 144.6 41.12 144.56 41.32C144.48 41.74 144.41 42.1 144.36 42.42C144.31 42.73 144.29 43.03 144.29 43.32C144.29 43.72 144.33 44.05 144.41 44.3C144.46 44.43 144.51 44.6 144.57 44.81C144.63 45.02 144.71 45.26 144.8 45.53C144.99 46.09 145.08 46.49 145.08 46.72C145.08 47.1 144.93 47.51 144.62 47.95C144.32 48.39 143.99 48.61 143.62 48.61C143.23 48.61 142.82 48.31 142.41 47.72C142.21 47.42 142.03 47.13 141.88 46.84C141.73 46.55 141.59 46.26 141.47 45.96C141.28 45.39 141.18 44.83 141.18 44.29C141.18 44.17 141.19 44.05 141.2 43.92C141.21 43.8 141.23 43.66 141.25 43.52C141.3 43.26 141.37 42.93 141.46 42.54C141.51 42.35 141.55 42.19 141.58 42.05C141.61 41.91 141.64 41.8 141.66 41.72C141.95 40.4 142.19 39.3 142.38 38.41C142.58 37.52 142.72 36.83 142.82 36.33C143.07 35.21 143.19 34.58 143.19 34.44C143.19 34.25 143.12 34.1 142.98 34C142.84 33.9 142.68 33.85 142.49 33.85C142.26 33.85 142.01 33.86 141.72 33.88C141.43 33.9 141.12 33.93 140.78 33.98C140.44 34.03 140.15 34.06 139.93 34.08C139.7 34.1 139.54 34.11 139.43 34.11C139 34.11 138.61 34.04 138.26 33.91C137.91 33.78 137.61 33.59 137.35 33.35C137.1 33.11 136.9 32.82 136.75 32.48C136.61 32.14 136.54 31.76 136.54 31.33C136.87 31.38 137.21 31.41 137.56 31.43C137.91 31.45 138.28 31.46 138.66 31.46C138.83 31.46 139.08 31.45 139.42 31.43C139.76 31.41 140.18 31.38 140.69 31.33C141.21 31.28 141.66 31.25 142.03 31.22C142.4 31.19 142.71 31.18 142.95 31.18C143.23 31.18 143.55 30.74 143.89 29.86C144.06 29.41 144.21 28.95 144.36 28.49C144.51 28.03 144.64 27.55 144.76 27.05C144.89 26.55 145 26.11 145.09 25.72C145.18 25.33 145.25 25 145.31 24.73C145.33 24.66 145.39 24.4 145.47 23.95C145.53 23.71 145.58 23.49 145.62 23.28C145.66 23.07 145.69 22.89 145.72 22.72C145.8 22.27 145.89 21.85 146 21.47C146.1 21.09 146.22 20.75 146.35 20.44C146.61 19.82 147.03 19.51 147.61 19.51C148.49 19.51 148.93 20 148.93 20.97C148.93 21.58 148.8 22.27 148.54 23.05C147.41 26.65 146.85 28.84 146.85 29.64C146.85 30.08 147.07 30.3 147.51 30.3C148.59 30.3 149.69 30.27 150.8 30.22C151.91 30.17 152.99 30.09 154.03 30C154.58 29.95 155.06 29.9 155.48 29.85C155.9 29.8 156.29 29.74 156.65 29.69C157.01 29.64 157.35 29.59 157.67 29.54C157.99 29.49 158.34 29.45 158.71 29.4C158.78 29.39 158.87 29.38 158.99 29.37C159.1 29.36 159.21 29.38 159.32 29.41C159.43 29.44 159.52 29.51 159.61 29.6C159.71 29.68 159.76 29.81 159.76 29.99Z" fill="white"/>
	<path d="M175.45 33.8C175.46 34.05 175.35 34.39 175.12 34.82C174.89 35.25 174.57 35.73 174.18 36.27C173.78 36.81 173.32 37.39 172.79 38.01C172.26 38.63 171.71 39.24 171.12 39.86C170.45 40.57 169.75 41.26 169.01 41.92C168.27 42.58 167.48 43.22 166.63 43.83C164.97 45.07 163.48 45.68 162.18 45.68C160.74 45.68 159.63 45.2 158.83 44.24C158.03 43.27 157.49 42.09 157.21 40.71C156.92 39.34 156.78 37.94 156.78 36.49C156.78 35.88 156.85 34.94 156.99 33.66C157.06 33.02 157.13 32.47 157.2 32C157.27 31.53 157.35 31.16 157.43 30.88C157.6 30.32 157.95 29.84 158.48 29.42C159.03 28.98 159.6 28.76 160.19 28.76C160.51 28.76 160.67 29.06 160.67 29.67C160.67 30.07 160.63 30.53 160.55 31.04C160.47 31.55 160.39 32.06 160.31 32.55C160.16 33.49 160.04 34.33 159.97 35.07C159.9 35.81 159.86 36.46 159.86 37C159.86 38.2 160.03 39.41 160.36 40.63C160.69 41.88 161.29 42.5 162.16 42.5C163.04 42.5 164.06 42.18 165.22 41.54C165.8 41.21 166.38 40.84 166.97 40.44C167.55 40.04 168.13 39.59 168.72 39.09C169.31 38.59 169.88 38.09 170.43 37.59C170.98 37.09 171.51 36.57 172.03 36.03C172.55 35.5 173.02 35 173.44 34.53C173.86 34.07 174.22 33.64 174.53 33.25C174.54 33.23 174.56 33.19 174.59 33.13C174.62 33.08 174.65 33.02 174.69 32.97C174.73 32.92 174.76 32.87 174.8 32.84C174.84 32.81 174.87 32.79 174.91 32.8C175.08 32.8 175.2 32.93 175.28 33.19C175.39 33.45 175.45 33.65 175.45 33.8ZM163.78 19.32C163.78 20.09 163.58 20.75 163.17 21.3C162.78 21.85 162.2 22.12 161.44 22.12C160.96 22.12 160.44 22.05 159.85 21.91C159.28 21.77 159 21.54 159 21.22C159 20.64 159.18 20.08 159.54 19.55C159.9 19.02 160.34 18.59 160.85 18.26C161.25 18.02 161.52 17.9 161.65 17.9C162.33 17.9 162.85 17.99 163.22 18.18C163.6 18.36 163.78 18.74 163.78 19.32Z" fill="white"/>
	<path d="M197.55 29.69C197.55 29.89 197.48 30.11 197.34 30.35C197.2 30.59 197.01 30.83 196.79 31.07C196.56 31.31 196.31 31.55 196.02 31.78C195.74 32.01 195.45 32.23 195.17 32.42C194.88 32.62 194.61 32.79 194.36 32.94C194.11 33.09 193.89 33.2 193.73 33.27C193.42 33.4 193.01 33.52 192.51 33.62C192.01 33.72 191.48 33.81 190.93 33.88C190.38 33.95 189.85 34.01 189.33 34.05C188.81 34.09 188.37 34.11 188.01 34.11C187.87 34.11 187.67 34.09 187.42 34.04C187.17 33.99 186.92 33.93 186.65 33.86C186.39 33.79 186.14 33.71 185.91 33.62C185.68 33.53 185.51 33.44 185.4 33.34C185.51 33.79 185.6 34.25 185.69 34.7C185.78 35.15 185.81 35.63 185.81 36.12C185.81 36.33 185.78 36.59 185.73 36.9C185.68 37.21 185.61 37.52 185.52 37.83C185.43 38.14 185.33 38.45 185.23 38.74C185.12 39.03 185.01 39.27 184.89 39.46C184.58 39.98 184.26 40.46 183.94 40.88C183.61 41.31 183.25 41.7 182.84 42.06C182.43 42.42 181.97 42.76 181.46 43.08C180.95 43.4 180.36 43.71 179.7 44.01C178.99 44.32 178.27 44.54 177.55 44.66C176.83 44.78 176.09 44.85 175.31 44.85C174.82 44.85 174.39 44.71 174.01 44.42C173.63 44.14 173.31 43.75 173.05 43.27C172.79 42.79 172.59 42.23 172.45 41.6C172.31 40.97 172.24 40.31 172.24 39.62C172.24 39.44 172.26 39.22 172.28 38.96C172.31 38.7 172.35 38.43 172.4 38.16C172.45 37.89 172.51 37.63 172.57 37.38C172.63 37.13 172.69 36.92 172.75 36.74C172.92 36.24 173.15 35.67 173.46 35.03C173.77 34.39 174.13 33.73 174.55 33.06C174.97 32.39 175.43 31.73 175.94 31.08C176.45 30.43 176.98 29.85 177.54 29.34C178.1 28.83 178.68 28.42 179.29 28.11C179.9 27.8 180.5 27.65 181.11 27.65C181.31 27.65 181.48 27.68 181.6 27.74C181.72 27.8 181.83 27.88 181.92 27.97C182.01 28.07 182.09 28.17 182.16 28.27C182.23 28.37 182.31 28.48 182.41 28.59C182.45 28.65 182.5 28.68 182.57 28.68C182.66 28.68 182.78 28.66 182.93 28.61C183.07 28.56 183.23 28.54 183.41 28.54C183.64 28.54 183.91 28.69 184.25 28.98C184.59 29.27 184.93 29.59 185.29 29.94C185.65 30.29 186.01 30.61 186.38 30.9C186.74 31.19 187.07 31.34 187.35 31.34C187.67 31.34 188.02 31.33 188.38 31.32C188.75 31.31 189.12 31.29 189.5 31.26C189.88 31.23 190.25 31.19 190.62 31.14C190.99 31.09 191.33 31.04 191.64 30.98C191.72 30.96 191.92 30.9 192.23 30.82C192.54 30.74 192.9 30.64 193.31 30.53C193.72 30.42 194.15 30.3 194.61 30.17C195.07 30.04 195.49 29.92 195.88 29.8C196.27 29.69 196.6 29.59 196.85 29.52C197.11 29.45 197.25 29.41 197.27 29.41C197.34 29.41 197.41 29.43 197.47 29.46C197.52 29.53 197.55 29.59 197.55 29.69ZM183.66 32.54C183.59 32.3 183.45 32.07 183.24 31.85C183.03 31.62 182.79 31.42 182.53 31.24C182.26 31.06 181.98 30.92 181.68 30.8C181.38 30.68 181.1 30.63 180.84 30.63C180.63 30.63 180.42 30.67 180.22 30.74C180.02 30.81 179.82 30.9 179.62 31.02C179.42 31.14 179.24 31.26 179.06 31.39C178.88 31.53 178.72 31.65 178.56 31.77C178.1 32.16 177.65 32.71 177.23 33.42C176.81 34.13 176.44 34.89 176.13 35.7C175.82 36.51 175.56 37.32 175.37 38.13C175.18 38.94 175.08 39.64 175.08 40.23C175.08 40.49 175.12 40.74 175.21 40.99C175.3 41.23 175.43 41.45 175.59 41.63C175.76 41.81 175.95 41.96 176.18 42.07C176.41 42.18 176.65 42.24 176.93 42.24C177.64 42.24 178.3 42.11 178.91 41.86C179.52 41.6 180.06 41.25 180.56 40.81C181.06 40.37 181.49 39.83 181.87 39.22C182.25 38.6 182.57 37.93 182.83 37.22C183.09 36.51 183.29 35.74 183.43 34.95C183.57 34.15 183.65 33.35 183.66 32.54Z" fill="white"/>
	<path d="M218.83 40.11C218.83 40.53 218.69 40.98 218.4 41.48C218.11 41.98 217.7 42.44 217.14 42.88C216.58 43.32 215.9 43.68 215.08 43.97C214.26 44.26 213.32 44.41 212.27 44.41C211.2 44.41 210.26 44.22 209.44 43.85C208.62 43.48 207.93 42.89 207.36 42.1C206.79 41.31 206.37 40.3 206.08 39.07C205.79 37.85 205.64 36.39 205.64 34.69C205.45 34.81 205.17 35.05 204.8 35.41C204.43 35.77 204.02 36.2 203.56 36.69C203.1 37.18 202.63 37.71 202.14 38.28C201.65 38.85 201.18 39.4 200.73 39.93C200.28 40.46 199.89 40.95 199.54 41.4C199.19 41.85 198.93 42.2 198.77 42.45C198.47 42.9 198.24 43.28 198.06 43.58C197.88 43.88 197.72 44.13 197.56 44.31C197.4 44.49 197.24 44.62 197.07 44.7C196.9 44.78 196.67 44.82 196.4 44.82C196.15 44.82 195.92 44.78 195.71 44.7C195.5 44.62 195.31 44.52 195.16 44.4C195.01 44.28 194.89 44.14 194.8 43.98C194.71 43.82 194.68 43.67 194.68 43.52C194.68 43.31 194.69 43.06 194.72 42.78C194.74 42.5 194.78 42.22 194.82 41.93C194.86 41.64 194.91 41.35 194.95 41.07C195 40.79 195.04 40.53 195.08 40.3C195.2 39.67 195.33 38.93 195.47 38.09C195.61 37.25 195.73 36.22 195.81 35.01C195.87 34.24 195.93 33.51 195.98 32.82C196.03 32.13 196.06 31.41 196.06 30.67C196.06 30.31 196.1 29.97 196.18 29.64C196.26 29.31 196.39 29.01 196.56 28.76C196.73 28.5 196.95 28.3 197.2 28.15C197.46 28 197.76 27.92 198.12 27.92C198.38 27.92 198.59 27.96 198.76 28.03C198.93 28.1 199.06 28.2 199.15 28.32C199.24 28.44 199.31 28.57 199.34 28.72C199.37 28.87 199.38 29.02 199.38 29.17C199.38 29.35 199.37 29.52 199.34 29.7C199.32 29.87 199.3 30.02 199.3 30.15C199.3 30.19 199.28 30.32 199.25 30.55C199.22 30.78 199.16 31.08 199.1 31.43C199.03 31.79 198.96 32.18 198.87 32.62C198.78 33.06 198.69 33.5 198.59 33.94C198.39 34.85 198.24 35.59 198.15 36.14C198.06 36.69 198 37.17 197.95 37.56C197.91 37.96 197.88 38.33 197.86 38.67C197.84 39.01 197.8 39.43 197.74 39.92C198 39.56 198.37 39.12 198.84 38.59C199.31 38.06 199.81 37.52 200.32 36.95C200.83 36.39 201.32 35.84 201.79 35.31C202.26 34.78 202.63 34.34 202.9 33.98C203.26 33.51 203.62 33.07 203.99 32.68C204.36 32.29 204.74 31.95 205.13 31.66C205.52 31.38 205.94 31.15 206.38 30.99C206.82 30.83 207.29 30.75 207.79 30.75C208.13 30.75 208.35 30.83 208.45 31C208.54 31.17 208.59 31.37 208.59 31.61C208.59 31.71 208.59 31.8 208.58 31.9C208.57 32 208.57 32.1 208.57 32.19C208.57 32.28 208.55 32.45 208.52 32.7C208.48 32.94 208.45 33.2 208.41 33.48C208.37 33.76 208.34 34.02 208.31 34.27C208.28 34.52 208.27 34.69 208.27 34.79C208.27 35.82 208.35 36.77 208.5 37.63C208.65 38.49 208.9 39.23 209.25 39.86C209.59 40.48 210.05 40.97 210.62 41.31C211.19 41.65 211.89 41.83 212.72 41.83C213.25 41.83 213.73 41.8 214.14 41.73C214.55 41.67 214.94 41.55 215.32 41.4C215.7 41.25 216.07 41.05 216.46 40.81C216.85 40.57 217.28 40.28 217.77 39.92C217.89 39.82 218.01 39.74 218.13 39.65C218.23 39.59 218.32 39.53 218.42 39.47C218.51 39.41 218.59 39.38 218.65 39.38L218.83 40.11Z" fill="white"/>
</svg>
