﻿Latitud;Longitud;Fecha;Hora;Altitud;Profundidad;Velocidad;Referencia;Dust-Track;P-Track
-38,7503;-72,61518333;26-05-2016;21:42:47;102;20;15;65;0,902;54900
-38,74998333;-72,61476667;26-05-2016;21:42:53;101;50;30;45;0,785;54900
-38,74965;-72,61433333;26-05-2016;21:42:59;101;54;32;44;0,816;55500
-38,74953333;-72,61426667;26-05-2016;21:43:04;100;14;10;25;0,816;55400
-38,74955;-72,61426667;26-05-2016;21:43:20;102;3;0,6;181;0,853;54500
-38,74946667;-72,61413333;26-05-2016;21:43:25;101;15;11;50;0,915;54300
-38,74926667;-72,61385;26-05-2016;21:43:30;101;33;24;48;1,09;54600
-38,74881667;-72,61325;26-05-2016;21:43:37;101;71;37;46;1,02;54500
-38,74818333;-72,61245;26-05-2016;21:43:45;101;99;45;45;0,94;54700
-38,74728333;-72,61135;26-05-2016;21:43:56;102;138;45;44;0,646;54500
-38,74645;-72,61036667;26-05-2016;21:44:06;101;127;46;42;0,413;52800
-38,74591667;-72,60973333;26-05-2016;21:44:14;102;81;36;43;0,729;54200
-38,74586667;-72,60965;26-05-2016;21:44:15;102;8;30;51;0,704;53500
-38,7458;-72,60925;26-05-2016;21:44:20;102;36;26;77;0,775;52500
-38,74573333;-72,60905;26-05-2016;21:44:24;102;20;18;69;0,819;50400
-38,74568333;-72,60901667;26-05-2016;21:44:25;102;6;20;16;0,971;51700
-38,74545;-72,60896667;26-05-2016;21:44:29;102;27;25;12;0,452;50800
-38,74523333;-72,6088;26-05-2016;21:44:33;102;27;24;30;0,4;50800
-38,74498333;-72,60846667;26-05-2016;21:44:40;103;41;21;46;0,509;52200
-38,74463333;-72,60798333;26-05-2016;21:44:47;103;57;30;48;0,442;51700
-38,74425;-72,60745;26-05-2016;21:44:53;103;63;38;47;0,382;52400
-38,74365;-72,60661667;26-05-2016;21:45:02;103;98;39;47;0,403;50100
-38,74325;-72,60613333;26-05-2016;21:45:09;104;61;31;44;0,388;49800
-38,74303333;-72,60586667;26-05-2016;21:45:15;104;33;20;46;0,393;49500
-38,7427;-72,60536667;26-05-2016;21:45:23;104;57;26;49;0,437;49900
-38,74228333;-72,60481667;26-05-2016;21:45:31;105;67;30;46;0,332;50100
-38,74173333;-72,60411667;26-05-2016;21:45:39;105;86;39;46;0,228;50600
-38,7411;-72,60321667;26-05-2016;21:45:48;105;105;42;47;0,232;50100
-38,7405;-72,60225;26-05-2016;21:45:57;105;107;43;52;0,168;50300
-38,7399;-72,6011;26-05-2016;21:46:07;105;120;43;56;0,176;50200
-38,73916667;-72,59971667;26-05-2016;21:46:19;105;145;43;56;0,166;51400
-38,73868333;-72,59878333;26-05-2016;21:46:28;105;98;39;56;0,242;51500
-38,7385;-72,59848333;26-05-2016;21:46:33;105;33;24;55;0,254;51400
-38,73841667;-72,59833333;26-05-2016;21:46:38;105;15;11;53;0,255;51500
-38,73838333;-72,59825;26-05-2016;21:47:34;105;10;0,6;55;0,251;58300
-38,73821667;-72,59791667;26-05-2016;21:47:39;105;33;24;57;0,221;58700
-38,7379;-72,59726667;26-05-2016;21:47:46;105;67;34;58;0,174;57000
-38,7374;-72,59625;26-05-2016;21:47:55;106;104;42;58;0,208;58600
-38,73678333;-72,59508333;26-05-2016;21:48:05;108;123;44;56;0,35;57600
-38,73605;-72,59371667;26-05-2016;21:48:16;109;144;47;55;0,465;54300
-38,73545;-72,59263333;26-05-2016;21:48:25;110;116;46;55;0,341;54200
-38,73501667;-72,59178333;26-05-2016;21:48:32;110;89;46;56;0,572;54100
-38,73443333;-72,5906;26-05-2016;21:48:41;110;120;48;58;0,255;53700
-38,73393333;-72,5897;26-05-2016;21:48:49;110;96;43;55;0,339;52900
-38,73378333;-72,58945;26-05-2016;21:48:53;110;27;24;53;0,343;52800
-38,73376667;-72,58943333;26-05-2016;21:48:56;110;4;4;43;0,343;52500
-38,7337;-72,58936667;26-05-2016;21:49:38;111;9;0,7;42;0,323;52500
-38,73351667;-72,58903333;26-05-2016;21:49:43;111;36;26;53;0,301;53300
-38,73321667;-72,58843333;26-05-2016;21:49:49;112;61;37;57;0,247;47100
-38,73271667;-72,58751667;26-05-2016;21:49:57;113;98;44;55;0,263;53100
-38,73206667;-72,58631667;26-05-2016;21:50:07;114;126;45;55;0,277;48400
-38,73146667;-72,58521667;26-05-2016;21:50:17;114;118;42;55;0,206;51300
-38,73093333;-72,58421667;26-05-2016;21:50:25;113;105;47;56;0,191;47600
-38,7303;-72,58303333;26-05-2016;21:50:34;113;124;50;56;0,231;48900
-38,72958333;-72,58171667;26-05-2016;21:50:44;112;140;50;55;0,366;45700
-38,72918333;-72,58093333;26-05-2016;21:50:51;113;81;42;57;0,42;47300
-38,72888333;-72,58035;26-05-2016;21:50:57;113;60;36;57;0,469;47100
-38,72878333;-72,58015;26-05-2016;21:51:01;112;20;18;55;0,449;47200
-38,72876667;-72,5801;26-05-2016;21:51:06;112;5;4;60;0,432;47400
-38,72871667;-72,58;26-05-2016;21:51:11;113;10;7;60;0,382;47500
-38,72856667;-72,57971667;26-05-2016;21:51:16;113;30;22;55;0,186;45600
-38,72826667;-72,57921667;26-05-2016;21:51:22;115;55;33;54;0,117;47300
-38,72786667;-72,57843333;26-05-2016;21:51:29;115;82;42;56;0,176;45100
-38,72723333;-72,57721667;26-05-2016;21:51:39;116;127;46;56;0,412;45700
-38,72648333;-72,57583333;26-05-2016;21:51:50;118;146;48;55;0,655;45200
-38,72578333;-72,57476667;26-05-2016;21:51:59;118;121;48;50;0,812;45600
-38,72505;-72,57395;26-05-2016;21:52:07;118;108;49;41;1,1;45800
-38,72371667;-72,57251667;26-05-2016;21:52:21;118;194;50;40;1,32;45800
-38,72263333;-72,57135;26-05-2016;21:52:32;118;158;52;40;1,28;44900
-38,72143333;-72,5701;26-05-2016;21:52:44;118;171;51;40;0,918;45900
-38,72051667;-72,56911667;26-05-2016;21:52:54;118;133;48;40;1,19;45300
-38,71998333;-72,56853333;26-05-2016;21:53:01;118;79;41;40;1,24;44600
-38,71985;-72,56838333;26-05-2016;21:53:05;118;19;17;42;1,24;44300
-38,71983333;-72,56835;26-05-2016;21:53:10;119;3;2;55;1,11;43800
-38,71976667;-72,56821667;26-05-2016;21:53:15;119;15;10;52;0,994;44800
-38,71951667;-72,56795;26-05-2016;21:53:20;119;36;26;41;0,992;44600
-38,71918333;-72,56756667;26-05-2016;21:53:25;119;50;36;42;0,345;43800
-38,71856667;-72,5669;26-05-2016;21:53:32;119;90;46;40;0,156;43300
-38,7175;-72,56573333;26-05-2016;21:53:43;119;156;51;40;0,064;42800
-38,71678333;-72,56493333;26-05-2016;21:53:50;119;106;55;41;0,067;43800
-38,71578333;-72,56386667;26-05-2016;21:53:59;118;144;58;40;0,058;43600
-38,7149;-72,56295;26-05-2016;21:54:07;119;128;57;39;0,068;44200
-38,71453333;-72,5626;26-05-2016;21:54:11;119;50;45;36;0,072;43900
-38,71438333;-72,56246667;26-05-2016;21:54:14;119;21;25;35;0,074;43600
-38,7144;-72,56245;26-05-2016;21:54:17;119;3;3;117;0,083;44200
-38,71441667;-72,56246667;26-05-2016;21:54:47;119;3;0,4;205;0,061;43900
-38,71436667;-72,56236667;26-05-2016;21:54:53;119;10;6;54;0,078;44000
-38,71416667;-72,56215;26-05-2016;21:54:57;119;30;27;40;0,065;44400
-38,71378333;-72,56176667;26-05-2016;21:55:02;118;53;38;39;0,049;44000
-38,71315;-72,56105;26-05-2016;21:55:09;116;95;49;41;0,029;44200
-38,71225;-72,56005;26-05-2016;21:55:18;114;132;53;41;0,027;45700
-38,71175;-72,55946667;26-05-2016;21:55:24;113;76;45;42;0,041;44800
-38,71151667;-72,5592;26-05-2016;21:55:28;114;34;31;42;0,056;45600
-38,71141667;-72,55908333;26-05-2016;21:55:32;114;16;14;45;0,054;46000
-38,71141667;-72,55906667;26-05-2016;21:55:39;115;1;0,5;46;0,052;45600
-38,71133333;-72,559;26-05-2016;21:55:46;115;10;5;38;0,07;44800
-38,71113333;-72,55876667;26-05-2016;21:55:50;115;31;28;40;0,079;44700
-38,71076667;-72,55836667;26-05-2016;21:55:55;115;53;38;40;0,177;48600
-38,71011667;-72,55766667;26-05-2016;21:56:02;115;95;49;41;0,203;50000
-38,70916667;-72,5566;26-05-2016;21:56:11;115;140;56;41;0,165;48800
-38,70801667;-72,55531667;26-05-2016;21:56:22;114;171;56;41;0,322;49400
-38,70686667;-72,55403333;26-05-2016;21:56:33;113;169;55;41;0,231;50100
-38,70573333;-72,55276667;26-05-2016;21:56:44;114;167;55;41;0,22;49100
-38,70421667;-72,55106667;26-05-2016;21:56:58;115;224;58;41;0,189;49500
-38,70263333;-72,54935;26-05-2016;21:57:12;119;231;60;40;0,362;49200
-38,70131667;-72,54791667;26-05-2016;21:57:23;123;192;63;40;0,38;49900
-38,69983333;-72,54626667;26-05-2016;21:57:35;128;220;66;41;0,103;48800
-38,69871667;-72,54503333;26-05-2016;21:57:44;132;164;66;41;0,08;47400
-38,69721667;-72,54338333;26-05-2016;21:57:57;136;220;61;40;0,045;47800
-38,69596667;-72,54201667;26-05-2016;21:58:08;139;183;60;41;0,035;48600
-38,69478333;-72,54066667;26-05-2016;21:58:19;140;177;58;42;0,035;48700
-38,69396667;-72,53955;26-05-2016;21:58:27;141;133;60;47;0,031;47400
-38,69328333;-72,53851667;26-05-2016;21:58:34;142;118;60;50;0,025;47800
-38,69261667;-72,5375;26-05-2016;21:58:41;142;115;59;50;0,02;47800
-38,6918;-72,53651667;26-05-2016;21:58:49;142;124;56;44;0,026;47500
-38,69106667;-72,53565;26-05-2016;21:58:56;142;112;58;42;0,046;47900
-38,68958333;-72,5337;26-05-2016;21:59:10;143;237;61;46;0,035;47100
-38,68846667;-72,5322;26-05-2016;21:59:21;141;180;59;46;0,013;45400
-38,68725;-72,53056667;26-05-2016;21:59:33;140;196;59;46;0,023;46000
-38,6866;-72,52966667;26-05-2016;21:59:40;140;107;55;48;0,018;45900
-38,68631667;-72,52926667;26-05-2016;21:59:44;140;47;42;48;0,015;45800
-38,68618333;-72,52905;26-05-2016;21:59:47;139;24;29;50;0,019;46000
-38,686;-72,52896667;26-05-2016;21:59:51;139;21;19;20;0,02;45700
-38,68593333;-72,5291;26-05-2016;21:59:55;140;15;14;305;0,022;45700
-38,68593333;-72,52925;26-05-2016;22:00:01;140;13;8;267;0,019;45900
-38,68613333;-72,52953333;26-05-2016;22:00:06;140;34;24;227;0,02;47600
-38,68658333;-72,53003333;26-05-2016;22:00:12;140;66;40;221;0,018;47200
-38,68718333;-72,53078333;26-05-2016;22:00:19;140;93;48;224;0,013;47800
-38,68813333;-72,53203333;26-05-2016;22:00:29;140;151;55;226;0,042;48400
-38,68923333;-72,53353333;26-05-2016;22:00:40;140;179;59;227;0,041;48600
-38,69055;-72,53528333;26-05-2016;22:00:53;140;212;59;226;0,04;49400
-38,69155;-72,53668333;26-05-2016;22:01:03;140;164;59;228;0,029;49000
-38,69238333;-72,53795;26-05-2016;22:01:12;142;144;58;230;0,023;49500
-38,69321667;-72,53893333;26-05-2016;22:01:20;143;126;57;223;0,03;50600
-38,69405;-72,5399;26-05-2016;22:01:28;144;126;57;223;0,04;50400
-38,69501667;-72,54116667;26-05-2016;22:01:37;145;153;61;225;0,043;49900
-38,69608333;-72,54241667;26-05-2016;22:01:46;145;160;64;223;0,041;50500
-38,69766667;-72,54415;26-05-2016;22:01:59;145;233;64;221;0,067;50100
-38,69903333;-72,54565;26-05-2016;22:02:11;143;200;60;221;0,101;50600
-38,70061667;-72,54741667;26-05-2016;22:02:25;142;234;60;221;0,2;51800
-38,70165;-72,54853333;26-05-2016;22:02:34;140;151;60;221;0,455;50700
-38,70273333;-72,54971667;26-05-2016;22:02:44;137;159;57;221;0,355;51300
-38,70315;-72,55031667;26-05-2016;22:02:49;135;70;50;228;0,229;50700
-38,70366667;-72,5511;26-05-2016;22:02:55;132;88;53;230;0,234;51800
-38,70436667;-72,55186667;26-05-2016;22:03:02;130;104;54;220;0,235;51800
-38,70555;-72,55295;26-05-2016;22:03:12;126;161;58;215;0,431;52400
-38,70655;-72,55396667;26-05-2016;22:03:21;123;143;57;219;0,626;50700
-38,70748333;-72,55496667;26-05-2016;22:03:30;121;134;54;220;0,861;52400
-38,7087;-72,5563;26-05-2016;22:03:42;118;179;54;221;0,461;53700
-38,7095;-72,55718333;26-05-2016;22:03:50;116;117;53;221;0,101;54200
-38,71026667;-72,55801667;26-05-2016;22:03:58;115;112;50;220;0,077;53000
-38,71143333;-72,5593;26-05-2016;22:04:10;114;172;51;221;0,244;54000
-38,71265;-72,56065;26-05-2016;22:04:22;113;179;54;221;0,255;53300
-38,71341667;-72,56148333;26-05-2016;22:04:30;113;110;50;221;0,123;53700
-38,71386667;-72,56198333;26-05-2016;22:04:37;112;66;34;221;0,231;53800
-38,71403333;-72,56218333;26-05-2016;22:04:42;112;27;19;222;0,203;53300
-38,71408333;-72,56225;26-05-2016;22:04:47;112;8;5;224;0,217;53900
-38,71415;-72,5623;26-05-2016;22:05:18;112;8;0,9;223;0,327;52400
-38,71431667;-72,56248333;26-05-2016;22:05:22;112;25;23;221;0,218;52300
-38,71475;-72,56296667;26-05-2016;22:05:29;112;64;33;220;0,28;52700
-38,71535;-72,56361667;26-05-2016;22:05:36;112;88;45;220;0,123;51400
-38,71611667;-72,56438333;26-05-2016;22:05:44;112;108;49;218;0,053;51400
-38,7169;-72,5653;26-05-2016;22:05:52;112;117;53;222;0,042;52400
-38,7178;-72,56633333;26-05-2016;22:06:01;113;135;54;222;0,069;51600
-38,7187;-72,56733333;26-05-2016;22:06:11;113;131;47;221;0,189;52400
-38,71955;-72,56821667;26-05-2016;22:06:21;112;122;44;219;0,472;50100
-38,72045;-72,56918333;26-05-2016;22:06:31;111;131;47;220;1;52400
-38,72136667;-72,57016667;26-05-2016;22:06:41;109;133;48;220;1,33;52400
-38,72216667;-72,57103333;26-05-2016;22:06:50;108;117;47;220;1,3;52200
-38,7228;-72,5717;26-05-2016;22:06:57;108;92;47;219;1,4;53300
-38,7235;-72,57246667;26-05-2016;22:07:05;108;102;46;220;1,42;54500
-38,72418333;-72,5732;26-05-2016;22:07:13;107;99;45;220;1,33;55300
-38,7249;-72,57396667;26-05-2016;22:07:21;106;103;46;220;1,44;55300
-38,7259;-72,57506667;26-05-2016;22:07:32;104;148;48;221;1,15;57500
-38,72638333;-72,57578333;26-05-2016;22:07:38;102;82;49;229;0,923;57900
-38,727;-72,577;26-05-2016;22:07:47;100;126;50;237;0,688;58200
-38,72761667;-72,57815;26-05-2016;22:07:56;98;121;48;235;0,548;57900
-38,72808333;-72,57905;26-05-2016;22:08:04;97;93;42;236;0,345;57300
-38,72856667;-72,57996667;26-05-2016;22:08:12;96;96;43;236;0,345;58500
-38,72921667;-72,58118333;26-05-2016;22:08:22;94;129;46;236;0,32;57900
-38,72971667;-72,5821;26-05-2016;22:08:29;93;96;49;235;0,548;58000
-38,7302;-72,583;26-05-2016;22:08:36;92;95;49;236;0,687;58000
-38,73085;-72,58425;26-05-2016;22:08:46;91;131;47;236;0,288;57900
-38,73123333;-72,58496667;26-05-2016;22:08:53;89;75;39;236;0,279;57900
-38,7317;-72,58585;26-05-2016;22:09:03;87;92;33;236;0,196;58100
-38,73196667;-72,58633333;26-05-2016;22:09:08;85;52;37;235;0,218;58700
-38,7324;-72,58715;26-05-2016;22:09:15;84;86;44;235;0,248;57700
-38,73295;-72,58815;26-05-2016;22:09:23;83;106;48;235;0,277;58300
-38,73338333;-72,58895;26-05-2016;22:09:30;82;84;43;235;0,227;59000
-38,7339;-72,58986667;26-05-2016;22:09:38;80;99;44;235;0,251;59100
-38,73433333;-72,5907;26-05-2016;22:09:45;80;87;45;236;0,268;59400
-38,73471667;-72,59143333;26-05-2016;22:09:52;81;76;39;236;0,342;59200
-38,73483333;-72,59165;26-05-2016;22:09:56;81;24;21;237;0,353;58600
-38,73488333;-72,59173333;26-05-2016;22:10:00;81;8;7;230;0,352;58700
-38,73491667;-72,59181667;26-05-2016;22:10:55;84;9;0,6;249;0,359;59000
-38,73505;-72,59213333;26-05-2016;22:11:00;87;31;23;240;0,35;59200
-38,73528333;-72,5926;26-05-2016;22:11:05;89;47;34;237;0,321;58900
-38,73568333;-72,59336667;26-05-2016;22:11:12;92;81;42;236;0,28;58400
-38,73626667;-72,59446667;26-05-2016;22:11:21;94;115;46;236;0,453;58500
-38,73673333;-72,59533333;26-05-2016;22:11:29;96;92;41;235;0,362;58000
-38,73693333;-72,59568333;26-05-2016;22:11:34;97;37;26;235;0,38;57600
-38,737;-72,59581667;26-05-2016;22:11:39;98;15;11;237;0,404;57700
-38,737;-72,59583333;26-05-2016;22:11:45;98;1;0,8;226;0,396;59400
-38,73705;-72,59588333;26-05-2016;22:12:04;99;7;1,3;214;0,395;59800
-38,73711667;-72,59598333;26-05-2016;22:12:13;100;11;4;235;0,484;61600
-38,7373;-72,59633333;26-05-2016;22:12:19;102;37;22;237;0,589;61100
-38,73763333;-72,59693333;26-05-2016;22:12:27;102;65;29;234;0,486;61700
-38,73795;-72,59753333;26-05-2016;22:12:33;102;62;37;235;0,323;61900
-38,73848333;-72,59855;26-05-2016;22:12:42;102;106;42;236;0,255;62200
-38,73895;-72,59943333;26-05-2016;22:12:50;101;93;42;236;0,249;60100
-38,73935;-72,6002;26-05-2016;22:12:58;101;81;36;236;0,199;60300
-38,7398;-72,60103333;26-05-2016;22:13:05;99;87;45;236;0,173;60300
-38,7403;-72,60196667;26-05-2016;22:13:13;99;99;44;235;0,169;60600
-38,74051667;-72,60235;26-05-2016;22:13:18;98;41;30;233;0,169;60100
-38,74061667;-72,60248333;26-05-2016;22:13:22;98;15;14;230;0,17;60500
-38,74063333;-72,6025;26-05-2016;22:13:27;97;2;2;217;0,178;60600
-38,7406;-72,6025;26-05-2016;22:13:50;97;2;0,3;16;0,189;60900
-38,74068333;-72,6027;26-05-2016;22:13:56;96;20;12;242;0,181;60000
-38,74091667;-72,60315;26-05-2016;22:14:02;97;47;28;237;0,167;61200
-38,74133333;-72,60375;26-05-2016;22:14:08;98;70;42;228;0,227;61300
-38,74203333;-72,60465;26-05-2016;22:14:16;99;110;50;226;0,222;60400
-38,74301667;-72,60603333;26-05-2016;22:14:27;101;163;53;227;0,202;60700
-38,74406667;-72,60746667;26-05-2016;22:14:39;101;170;51;227;0,288;61800
-38,74441667;-72,60791667;26-05-2016;22:14:44;101;55;40;225;0,307;61400
-38,74463333;-72,6082;26-05-2016;22:14:49;101;35;25;225;0,302;62500
-38,7447;-72,60826667;26-05-2016;22:14:53;102;10;9;218;0,293;60900
-38,7447;-72,60825;26-05-2016;22:15:00;102;1;0,4;118;0,296;61700
-38,7447;-72,60826667;26-05-2016;22:15:16;102;1;0,2;316;0,589;62300
-38,74471667;-72,60835;26-05-2016;22:15:20;103;8;7;254;0,347;62700
-38,74493333;-72,60873333;26-05-2016;22:15:27;104;41;21;234;0,379;62600
-38,74503333;-72,60886667;26-05-2016;22:15:29;104;15;28;227;0,366;62300
-38,74528333;-72,60908333;26-05-2016;22:15:33;104;34;31;213;0,472;62400
-38,74558333;-72,60921667;26-05-2016;22:15:37;105;34;30;200;0,495;61600
-38,74575;-72,60946667;26-05-2016;22:15:42;104;28;21;229;0,583;63400
-38,74585;-72,60976667;26-05-2016;22:15:46;103;29;26;247;0,545;62700
-38,74631667;-72,61033333;26-05-2016;22:15:53;103;72;37;223;0,515;63700
-38,74685;-72,61095;26-05-2016;22:15:59;102;79;48;222;0,715;64100
-38,74788333;-72,61223333;26-05-2016;22:16:10;98;161;53;224;0,832;64000
-38,74873333;-72,61331667;26-05-2016;22:16:19;96;133;53;224;0,897;64600
-38,74911667;-72,61385;26-05-2016;22:16:24;94;63;45;228;0,905;64100
-38,74925;-72,61405;26-05-2016;22:16:27;93;24;28;231;0,924;64500
-38,74935;-72,61413333;26-05-2016;22:16:32;92;13;9;213;0,946;63500
-38,74935;-72,61411667;26-05-2016;22:16:46;90;1;0,3;88;1,1;62000
-38,74953333;-72,61436667;26-05-2016;22:16:51;89;29;21;225;1,11;64200
-38,7499;-72,61483333;26-05-2016;22:16:59;88;59;27;224;0,934;64200
-38,75023333;-72,61525;26-05-2016;22:17:07;86;52;23;224;0,982;63700
-38,75056667;-72,61566667;26-05-2016;22:17:14;86;52;27;225;0,851;64300
-38,75101667;-72,6163;26-05-2016;22:17:21;88;73;38;228;0,743;64300
-38,75125;-72,61665;26-05-2016;22:17:26;88;41;29;231;0,702;64000
-38,75133333;-72,6168;26-05-2016;22:17:31;88;17;12;231;0,716;64200
-38,75138333;-72,61696667;26-05-2016;22:17:37;87;14;9;250;0,711;64300
-38,75126667;-72,61708333;26-05-2016;22:17:42;88;18;13;321;0,737;63400
-38,75121667;-72,61713333;26-05-2016;22:17:47;88;7;5;326;0,747;63800
-38,7512;-72,61711667;26-05-2016;22:17:58;92;3;0,9;44;0,77;61900
-38,75118333;-72,61713333;26-05-2016;22:20:00;95;2;0,1;308;0,854;59800
-38,75118333;-72,61713333;26-05-2016;22:20:27;95;0;0;344;0,859;60100
-38,75121667;-72,61718333;26-05-2016;22:20:31;95;6;6;231;0,82;59600
-38,75123333;-72,61721667;26-05-2016;22:20:33;95;4;8;221;0,809;59700
-38,7514;-72,61713333;26-05-2016;22:20:39;97;19;11;158;0,791;58400
-38,75155;-72,6171;26-05-2016;22:20:46;100;17;9;168;0,767;59800
-38,75163333;-72,61713333;26-05-2016;22:20:52;100;10;6;198;0,707;60400
-38,75181667;-72,61735;26-05-2016;22:20:56;100;27;25;222;0,688;58300
-38,75231667;-72,61795;26-05-2016;22:21:04;99;77;34;224;0,934;55500
-38,75248333;-72,61815;26-05-2016;22:21:08;99;24;22;224;0,979;56800
-38,75253333;-72,61825;26-05-2016;22:21:13;100;11;8;236;1,03;54200
-38,75256667;-72,61836667;26-05-2016;22:21:17;99;11;10;253;1,45;56900
-38,75275;-72,61863333;26-05-2016;22:21:21;99;32;28;227;1,32;57300
-38,75338333;-72,6194;26-05-2016;22:21:29;98;97;44;223;1,26;55600
-38,75373333;-72,61981667;26-05-2016;22:21:34;96;52;37;224;1,89;55500
-38,75393333;-72,62008333;26-05-2016;22:21:39;93;33;24;226;2,11;56300
-38,75396667;-72,62013333;26-05-2016;22:21:42;93;5;6;231;2,09;55000
-38,754;-72,6202;26-05-2016;22:21:50;92;7;3;234;2,42;56300
-38,75411667;-72,6205;26-05-2016;22:21:55;91;30;22;243;2,38;56600
-38,75423333;-72,62106667;26-05-2016;22:22:01;90;50;30;256;2,34;56200
-38,7543;-72,62198333;26-05-2016;22:22:08;89;81;41;264;2,27;56900
-38,75436667;-72,62323333;26-05-2016;22:22:16;88;109;49;266;2,57;56500
-38,75446667;-72,62498333;26-05-2016;22:22:27;86;152;50;266;2,63;56800
-38,75453333;-72,62596667;26-05-2016;22:22:34;85;86;44;265;2,96;52100
-38,75456667;-72,62645;26-05-2016;22:22:39;85;41;30;265;3,16;52300
-38,75458333;-72,62671667;26-05-2016;22:22:44;85;23;17;266;3,05;52100
-38,7546;-72,62691667;26-05-2016;22:22:50;84;17;10;267;2,94;52400
-38,75461667;-72,62725;26-05-2016;22:22:55;84;30;21;267;2,75;50300
-38,75465;-72,62801667;26-05-2016;22:23:02;84;66;34;266;2,63;51800
-38,75468333;-72,62893333;26-05-2016;22:23:09;83;80;41;268;2,65;52400
-38,7547;-72,6304;26-05-2016;22:23:19;82;128;46;269;2,95;52900
-38,75471667;-72,63131667;26-05-2016;22:23:26;83;79;41;269;3,15;51500
-38,75473333;-72,63196667;26-05-2016;22:23:32;83;56;34;269;3,27;49100
-38,75475;-72,63268333;26-05-2016;22:23:40;83;62;28;269;3,15;50400
-38,75476667;-72,63351667;26-05-2016;22:23:47;83;73;37;268;2,95;51600
-38,75478333;-72,63438333;26-05-2016;22:23:53;83;75;45;269;3,16;49600
-38,7549;-72,63538333;26-05-2016;22:24:00;84;88;45;261;3,13;50500
-38,75516667;-72,6363;26-05-2016;22:24:07;84;85;44;250;3,09;50000
-38,75556667;-72,63763333;26-05-2016;22:24:16;85;124;49;249;3,09;50300
-38,75583333;-72,63855;26-05-2016;22:24:23;86;84;43;249;3,6;50100
-38,75593333;-72,63886667;26-05-2016;22:24:27;86;30;27;249;3,81;49100
-38,75601667;-72,63916667;26-05-2016;22:24:33;86;28;17;249;3,47;49600
-38,75618333;-72,63966667;26-05-2016;22:24:39;86;47;28;249;3,09;51400
-38,75638333;-72,64041667;26-05-2016;22:24:45;87;69;41;250;3,04;51800
-38,75651667;-72,64131667;26-05-2016;22:24:51;87;79;48;259;2,76;50000
-38,75661667;-72,64288333;26-05-2016;22:25:01;87;136;49;265;1,97;50800
-38,75678333;-72,64531667;26-05-2016;22:25:16;87;213;51;265;1,05;51500
-38,75691667;-72,64726667;26-05-2016;22:25:28;86;169;51;265;1,27;51500
-38,75701667;-72,64873333;26-05-2016;22:25:37;86;128;51;265;1,18;51500
-38,75715;-72,65056667;26-05-2016;22:25:48;85;161;53;265;1,21;48900
-38,75725;-72,65211667;26-05-2016;22:25:58;85;135;49;265;1,02;49100
-38,75731667;-72,65285;26-05-2016;22:26:03;85;64;46;263;0,921;49300
-38,75735;-72,65361667;26-05-2016;22:26:08;85;67;48;267;0,916;49100
-38,75743333;-72,65503333;26-05-2016;22:26:16;85;123;55;266;1,15;48900
-38,7574;-72,65618333;26-05-2016;22:26:22;86;100;60;272;0,988;48000
-38,75728333;-72,6576;26-05-2016;22:26:30;87;124;56;275;1,09;46700
-38,75721667;-72,65826667;26-05-2016;22:26:35;88;58;42;278;1,15;46800
-38,7572;-72,65838333;26-05-2016;22:26:38;89;10;12;280;1,15;48300
-38,75718333;-72,65848333;26-05-2016;22:26:51;90;8;2;284;1,01;50500
-38,75716667;-72,6588;26-05-2016;22:26:55;91;29;26;275;0,872;50200
-38,75711667;-72,65953333;26-05-2016;22:27:01;91;64;38;275;1;50500
-38,75703333;-72,66078333;26-05-2016;22:27:09;92;109;49;275;0,951;51400
-38,75706667;-72,66176667;26-05-2016;22:27:15;92;86;51;267;1,09;50100
-38,75715;-72,66298333;26-05-2016;22:27:22;92;106;54;265;1,08;51300
-38,75731667;-72,66418333;26-05-2016;22:27:29;91;105;54;260;1,2;51300
-38,75765;-72,66511667;26-05-2016;22:27:35;90;91;54;245;1,08;50400
-38,75823333;-72,6668;26-05-2016;22:27:45;87;159;57;246;0,961;49500
-38,75863333;-72,66836667;26-05-2016;22:27:54;85;143;57;252;0,967;51600
-38,7591;-72,67045;26-05-2016;22:28:06;84;189;57;254;1,09;51900
-38,75925;-72,67113333;26-05-2016;22:28:11;84;62;44;254;1,04;51900
-38,75946667;-72,67208333;26-05-2016;22:28:17;84;86;51;254;1,01;50200
-38,75988333;-72,67365;26-05-2016;22:28:26;83;143;57;251;0,838;50800
-38,76045;-72,6755;26-05-2016;22:28:36;83;173;62;249;1,07;50100
-38,761;-72,67708333;26-05-2016;22:28:45;82;151;60;246;0,961;50600
-38,7614;-72,67855;26-05-2016;22:28:53;80;134;60;251;0,924;50500
-38,7616;-72,67993333;26-05-2016;22:29:00;79;123;63;259;0,83;50100
-38,76171667;-72,68176667;26-05-2016;22:29:09;76;160;64;265;0,698;49500
-38,76181667;-72,68391667;26-05-2016;22:29:20;73;186;61;267;0,849;49000
-38,76198333;-72,68656667;26-05-2016;22:29:34;68;232;60;265;0,707;49400
-38,76215;-72,68896667;26-05-2016;22:29:47;65;209;58;265;0,802;49000
-38,7621;-72,69026667;26-05-2016;22:29:54;65;112;58;273;0,979;49600
-38,76195;-72,6912;26-05-2016;22:30:00;66;83;50;282;0,916;49600
-38,76175;-72,69206667;26-05-2016;22:30:07;68;78;40;286;0,994;48300
-38,7617;-72,69231667;26-05-2016;22:30:11;69;23;20;287;0,98;49000
-38,76161667;-72,69265;26-05-2016;22:30:17;70;31;18;286;0,872;48800
-38,76151667;-72,69311667;26-05-2016;22:30:22;71;43;31;286;0,773;47100
-38,76133333;-72,69385;26-05-2016;22:30:28;73;67;40;287;0,647;49000
-38,76111667;-72,6949;26-05-2016;22:30:35;75;94;48;285;0,599;48800
-38,76088333;-72,69623333;26-05-2016;22:30:43;77;119;54;283;0,637;48000
-38,76076667;-72,69746667;26-05-2016;22:30:50;76;108;55;276;0,647;48600
-38,76075;-72,69933333;26-05-2016;22:31:00;76;162;58;271;0,567;48200
-38,76076667;-72,70086667;26-05-2016;22:31:08;76;133;60;270;0,548;47700
-38,76076667;-72,7035;26-05-2016;22:31:22;76;228;59;270;0,476;48000
-38,76078333;-72,70608333;26-05-2016;22:31:36;75;225;58;270;0,463;47400
-38,76078333;-72,7081;26-05-2016;22:31:47;75;175;57;270;0,501;48300
-38,76078333;-72,71053333;26-05-2016;22:32:00;74;211;59;270;0,371;48500
-38,76078333;-72,71281667;26-05-2016;22:32:12;74;197;59;270;0,363;48000
-38,76076667;-72,71603333;26-05-2016;22:32:29;73;279;59;270;0,463;47500
-38,76075;-72,71773333;26-05-2016;22:32:38;73;147;59;270;0,514;48600
-38,76073333;-72,72136667;26-05-2016;22:32:57;74;316;60;270;0,317;47900
-38,76073333;-72,72483333;26-05-2016;22:33:15;73;301;60;270;0,345;48000
-38,76076667;-72,7261;26-05-2016;22:33:22;72;111;57;268;0,274;48000
-38,76095;-72,72713333;26-05-2016;22:33:28;72;91;55;257;0,311;47500
-38,7611;-72,72763333;26-05-2016;22:33:32;71;46;42;249;0,391;47800
-38,76125;-72,728;26-05-2016;22:33:37;71;36;26;243;0,435;47400
-38,76128333;-72,72806667;26-05-2016;22:33:41;71;7;7;231;0,505;46600
-38,76135;-72,72818333;26-05-2016;22:33:46;71;11;8;234;0,652;47400
-38,7615;-72,72846667;26-05-2016;22:33:50;71;30;27;237;0,322;47000
-38,76186667;-72,72908333;26-05-2016;22:33:56;71;67;40;233;0,232;47100
-38,76241667;-72,72995;26-05-2016;22:34:03;70;97;50;231;0,224;46900
-38,7636;-72,73181667;26-05-2016;22:34:17;67;210;54;231;0,266;46800
-38,76416667;-72,73285;26-05-2016;22:34:24;66;109;56;235;0,441;46000
-38,76443333;-72,7337;26-05-2016;22:34:29;65;80;57;248;0,488;45400
-38,7646;-72,73476667;26-05-2016;22:34:35;64;95;57;259;0,441;46100
-38,76466667;-72,73641667;26-05-2016;22:34:44;62;143;57;267;0,308;46000
-38,76475;-72,73891667;26-05-2016;22:34:58;61;217;56;267;0,361;45200
-38,76481667;-72,74053333;26-05-2016;22:35:07;61;140;56;267;0,335;45800
-38,7649;-72,74245;26-05-2016;22:35:18;61;166;54;267;0,345;45600
-38,76496667;-72,74436667;26-05-2016;22:35:29;62;167;55;268;0,29;44700
-38,76486667;-72,74553333;26-05-2016;22:35:36;63;102;53;276;0,368;44800
-38,76476667;-72,74698333;26-05-2016;22:35:45;63;126;50;276;0,325;45300
-38,76486667;-72,74775;26-05-2016;22:35:50;63;68;49;259;0,34;44800
-38,7651;-72,7487;26-05-2016;22:35:57;63;86;44;252;0,432;45200
-38,76516667;-72,74893333;26-05-2016;22:36:00;62;21;26;252;0,438;44800
-38,76525;-72,74923333;26-05-2016;22:36:06;62;28;17;251;0,407;44600
-38,76536667;-72,74976667;26-05-2016;22:36:12;62;49;29;253;0,367;44900
-38,76555;-72,75053333;26-05-2016;22:36:19;62;68;35;254;0,356;44100
-38,76568333;-72,75113333;26-05-2016;22:36:25;62;54;32;254;0,543;44700
-38,76576667;-72,75153333;26-05-2016;22:36:31;62;36;22;253;0,495;45400
-38,7659;-72,75206667;26-05-2016;22:36:37;61;49;29;253;0,553;44300
-38,76603333;-72,7527;26-05-2016;22:36:44;61;57;29;254;0,627;45900
-38,76603333;-72,75276667;26-05-2016;22:36:47;60;5;6;264;0,644;44800
-38,76605;-72,75283333;26-05-2016;22:37:02;60;7;2;261;1,09;45600
-38,76603333;-72,75291667;26-05-2016;22:37:05;60;7;8;287;0,914;45400
-38,76585;-72,75298333;26-05-2016;22:37:10;60;22;16;345;0,597;45400
-38,76536667;-72,75313333;26-05-2016;22:37:17;60;54;28;345;0,585;44400
-38,76501667;-72,75328333;26-05-2016;22:37:23;63;42;25;344;0,55;44400
-38,76458333;-72,75341667;26-05-2016;22:37:31;67;49;22;345;0,552;46000
-38,76431667;-72,75351667;26-05-2016;22:37:36;71;31;23;345;0,585;45800
-38,764;-72,75358333;26-05-2016;22:37:42;73;36;22;350;0,571;45100
-38,76393333;-72,75358333;26-05-2016;22:37:43;73;8;28;359;0,546;45500
-38,76333333;-72,75361667;26-05-2016;22:37:51;75;66;30;358;0,55;45300
-38,7631;-72,75361667;26-05-2016;22:37:56;75;26;19;0;0,544;44900
-38,763;-72,75366667;26-05-2016;22:38:01;77;12;9;341;0,556;45300
-38,76296667;-72,75368333;26-05-2016;22:38:07;78;3;2;315;0,552;45300
-38,763;-72,75398333;26-05-2016;22:38:15;78;25;11;265;0,835;44800
-38,76305;-72,7545;26-05-2016;22:38:22;79;45;23;263;1;45600
-38,76308333;-72,75526667;26-05-2016;22:38:30;80;67;30;266;0,821;45900
-38,76311667;-72,7561;26-05-2016;22:38:38;80;72;33;267;0,786;45800
-38,76315;-72,75676667;26-05-2016;22:38:45;79;58;30;267;0,999;45600
-38,76316667;-72,75751667;26-05-2016;22:38:53;78;65;29;267;1,11;45800
-38,76318333;-72,75765;26-05-2016;22:38:56;78;12;14;262;1,09;45800
-38,76331667;-72,75771667;26-05-2016;22:39:01;77;16;12;204;1,33;46800
-38,7636;-72,75771667;26-05-2016;22:39:09;77;31;14;178;1,67;45500
-38,76393333;-72,75768333;26-05-2016;22:39:16;77;37;19;177;1,28;47400
-38,76423333;-72,75765;26-05-2016;22:39:24;77;35;16;176;0,618;47200
-38,76445;-72,75768333;26-05-2016;22:39:30;77;24;14;185;0,555;47400
-38,76476667;-72,75765;26-05-2016;22:39:35;77;35;25;175;0,541;47000
-38,76531667;-72,7575;26-05-2016;22:39:42;76;63;32;168;0,506;47400
-38,76586667;-72,75735;26-05-2016;22:39:49;75;62;32;168;0,546;46700
-38,76646667;-72,75718333;26-05-2016;22:39:56;69;68;35;168;0,653;46600
-38,76668333;-72,75711667;26-05-2016;22:40:01;66;25;18;167;0,694;46100
-38,7667;-72,75711667;26-05-2016;22:40:06;66;2;1,1;161;0,682;45900
-38,76676667;-72,75708333;26-05-2016;22:40:47;66;9;0,8;165;0,555;45800
-38,76701667;-72,75701667;26-05-2016;22:40:52;66;27;19;166;0,563;46900
-38,76736667;-72,7569;26-05-2016;22:41:00;66;41;18;166;0,561;46500
-38,76766667;-72,75681667;26-05-2016;22:41:08;66;34;15;169;0,599;46000
-38,76778333;-72,75678333;26-05-2016;22:41:14;66;14;8;167;0,615;46700
-38,76793333;-72,75671667;26-05-2016;22:41:21;65;17;9;162;0,611;45200
-38,76811667;-72,75666667;26-05-2016;22:41:28;64;22;11;169;0,443;46600
-38,76825;-72,75668333;26-05-2016;22:41:31;64;14;17;183;0,353;46600
-38,76858333;-72,75661667;26-05-2016;22:41:39;63;38;17;173;0,327;45700
-38,76885;-72,75653333;26-05-2016;22:41:46;62;30;16;165;0,346;45500
-38,76908333;-72,75646667;26-05-2016;22:41:53;64;27;14;166;0,358;46100
-38,76933333;-72,75641667;26-05-2016;22:42:02;66;28;11;171;0,455;47500
-38,76941667;-72,7565;26-05-2016;22:42:08;67;12;7;222;0,42;47600
-38,7695;-72,75701667;26-05-2016;22:42:16;68;45;20;257;0,482;47300
-38,76963333;-72,75771667;26-05-2016;22:42:27;69;63;20;256;0,749;46700
-38,7697;-72,75815;26-05-2016;22:42:35;68;38;17;260;0,709;45200
-38,76973333;-72,75845;26-05-2016;22:42:43;68;27;12;262;0,613;44900
-38,76975;-72,75878333;26-05-2016;22:42:52;68;29;12;266;0,713;44700
-38,76985;-72,75925;26-05-2016;22:43:02;67;42;15;255;1,02;45000
-38,77;-72,7598;26-05-2016;22:43:12;66;51;18;252;1,33;47700
-38,77006667;-72,76026667;26-05-2016;22:43:21;65;41;16;260;1,33;47500
-38,77006667;-72,76046667;26-05-2016;22:43:27;65;18;11;268;1,23;47300
-38,77006667;-72,76048333;26-05-2016;22:43:29;65;2;3;297;1,34;47400
-38,76993333;-72,76055;26-05-2016;22:43:36;64;15;8;340;1,44;46600
-38,76965;-72,76053333;26-05-2016;22:43:44;65;32;14;3;1,17;46000
-38,76918333;-72,76053333;26-05-2016;22:43:55;65;51;17;0;1,18;45600
-38,76881667;-72,76048333;26-05-2016;22:44:05;66;43;15;5;1,17;48400
-38,76858333;-72,76041667;26-05-2016;22:44:12;64;26;13;13;1,2;45600
-38,76835;-72,76043333;26-05-2016;22:44:19;63;27;14;357;1,1;47800
-38,76808333;-72,76041667;26-05-2016;22:44:28;64;29;11;2;0,778;47400
-38,76775;-72,76041667;26-05-2016;22:44:36;64;37;17;0;0,692;47600
-38,76758333;-72,76043333;26-05-2016;22:44:42;65;20;12;358;0,635;47700
-38,76755;-72,76043333;26-05-2016;22:44:44;65;4;7;353;0,657;47400
-38,7675;-72,7606;26-05-2016;22:44:49;65;16;11;292;0,659;47200
-38,76755;-72,761;26-05-2016;22:44:58;66;35;14;261;0,784;45300
-38,76758333;-72,76141667;26-05-2016;22:45:05;68;36;18;264;0,931;45600
-38,7676;-72,76175;26-05-2016;22:45:11;69;29;17;264;1,21;45400
-38,76765;-72,76208333;26-05-2016;22:45:17;72;30;18;261;1,38;46000
-38,76775;-72,76275;26-05-2016;22:45:27;74;58;21;259;1,51;44000
-38,76781667;-72,76311667;26-05-2016;22:45:33;75;33;20;257;1,59;45100
-38,76791667;-72,76336667;26-05-2016;22:45:37;75;25;22;242;1,61;44100
-38,76823333;-72,76381667;26-05-2016;22:45:46;76;51;21;228;1,73;46900
-38,76845;-72,76411667;26-05-2016;22:45:54;75;35;16;228;1,71;47500
-38,76866667;-72,76445;26-05-2016;22:46:01;75;38;19;229;1,77;46000
-38,76876667;-72,76476667;26-05-2016;22:46:08;73;30;15;249;1,61;47100
-38,7686;-72,76483333;26-05-2016;22:46:13;72;18;13;342;1,68;47000
-38,7683;-72,76486667;26-05-2016;22:46:20;71;34;17;355;1,76;46700
-38,76786667;-72,76486667;26-05-2016;22:46:28;71;48;22;359;1,51;47200
-38,76775;-72,76488333;26-05-2016;22:46:32;72;13;12;355;1,48;47400
-38,76765;-72,76496667;26-05-2016;22:46:38;72;13;8;326;1,45;47000
-38,76766667;-72,76525;26-05-2016;22:46:42;72;24;21;268;1,31;48300
-38,76781667;-72,7661;26-05-2016;22:46:49;71;76;39;257;1,12;48000
-38,76806667;-72,7674;26-05-2016;22:46:58;67;117;47;257;1,04;48800
-38,76811667;-72,76828333;26-05-2016;22:47:05;66;77;39;266;0,877;48700
-38,76811667;-72,76913333;26-05-2016;22:47:11;66;73;44;269;1,08;47800
-38,76805;-72,77003333;26-05-2016;22:47:17;65;78;47;276;1,25;48900
-38,7678;-72,77106667;26-05-2016;22:47:24;65;95;49;288;1,17;47600
-38,76728333;-72,77291667;26-05-2016;22:47:36;65;170;51;289;1,23;47900
-38,7669;-72,77438333;26-05-2016;22:47:46;66;135;49;289;0,452;47800
-38,76678333;-72,7752;26-05-2016;22:47:52;64;72;43;279;0,829;47600
-38,76668333;-72,77678333;26-05-2016;22:48:03;62;137;45;275;1,1;48400
-38,76658333;-72,77845;26-05-2016;22:48:14;61;145;47;274;1,16;47600
-38,76648333;-72,77988333;26-05-2016;22:48:23;60;126;50;276;0,687;46800
-38,76633333;-72,78165;26-05-2016;22:48:34;58;154;50;276;0,344;48900
-38,76625;-72,78301667;26-05-2016;22:48:43;57;119;48;274;0,519;47600
-38,76625;-72,78375;26-05-2016;22:48:50;56;64;33;270;0,396;47700
-38,76618333;-72,78445;26-05-2016;22:48:59;56;61;25;277;0,248;49800
-38,76611667;-72,78531667;26-05-2016;22:49:09;55;75;27;275;0,259;50000
-38,76608333;-72,78601667;26-05-2016;22:49:16;55;61;31;274;0,245;52200
-38,766;-72,7872;26-05-2016;22:49:26;54;103;37;275;0,584;52500
-38,76598333;-72,78825;26-05-2016;22:49:35;54;91;37;272;0,905;53700
-38,76598333;-72,78848333;26-05-2016;22:49:39;54;19;17;270;0,897;54700
-38,76596667;-72,7885;26-05-2016;22:49:44;54;3;2;313;0,892;54500
-38,76596667;-72,7885;26-05-2016;22:49:49;54;0;0,2;311;0,958;55500
-38,766;-72,78843333;26-05-2016;22:49:55;54;7;4;121;0,902;54800
-38,766;-72,7884;26-05-2016;22:49:56;54;3;10;94;0,87;54400
-38,76601667;-72,78793333;26-05-2016;22:50:03;53;40;21;93;0,372;57700
-38,76606667;-72,7872;26-05-2016;22:50:10;52;63;32;95;0,427;55100
-38,76613333;-72,78606667;26-05-2016;22:50:19;51;99;39;95;0,293;56200
-38,7662;-72,7851;26-05-2016;22:50:27;51;86;39;94;0,323;57700
-38,76623333;-72,78438333;26-05-2016;22:50:34;51;62;32;94;0,521;59500
-38,76626667;-72,78378333;26-05-2016;22:50:41;50;52;27;95;0,614;59900
-38,76633333;-72,78303333;26-05-2016;22:50:48;50;65;34;95;0,541;58900
-38,76638333;-72,78216667;26-05-2016;22:50:54;50;75;45;96;0,498;61900
-38,76645;-72,78101667;26-05-2016;22:51:01;50;100;51;94;0,763;60200
-38,76653333;-72,77943333;26-05-2016;22:51:11;51;139;50;93;1,19;64500
-38,76668333;-72,77776667;26-05-2016;22:51:22;51;145;48;97;0,944;64400
-38,7667;-72,77698333;26-05-2016;22:51:28;51;68;41;92;0,933;61300
-38,76678333;-72,77623333;26-05-2016;22:51:34;51;65;39;97;0,982;60900
-38,76685;-72,77511667;26-05-2016;22:51:42;51;98;44;95;0,765;64400
-38,76698333;-72,77406667;26-05-2016;22:51:49;51;93;48;99;1,25;69500
-38,76736667;-72,77268333;26-05-2016;22:51:58;52;127;51;109;1,12;69900
-38,76785;-72,77101667;26-05-2016;22:52:09;53;155;51;110;0,977;60700
-38,76815;-72,76981667;26-05-2016;22:52:18;53;110;44;108;0,923;54000
-38,76823333;-72,76905;26-05-2016;22:52:23;52;67;48;98;1,05;55100
-38,76821667;-72,76826667;26-05-2016;22:52:29;53;68;41;89;1,32;53600
-38,76823333;-72,76808333;26-05-2016;22:52:32;54;16;19;91;1,26;53800
-38,76823333;-72,76806667;26-05-2016;22:52:36;55;2;2;83;1,34;54600
-38,7682;-72,7681;26-05-2016;22:52:43;57;5;2;321;1,3;54800
-38,76813333;-72,7679;26-05-2016;22:52:50;58;18;9;69;0,949;51800
-38,7681;-72,76751667;26-05-2016;22:52:55;59;33;24;83;1,21;48500
-38,768;-72,7666;26-05-2016;22:53:03;60;81;36;83;1,11;47500
-38,76783333;-72,76545;26-05-2016;22:53:10;60;102;52;79;0,818;47200
-38,76763333;-72,76451667;26-05-2016;22:53:16;61;84;51;75;1,13;47800
-38,76741667;-72,76365;26-05-2016;22:53:23;61;79;41;73;0,788;49200
-38,76725;-72,76288333;26-05-2016;22:53:31;61;69;31;74;0,704;48200
-38,76718333;-72,76221667;26-05-2016;22:53:36;59;57;41;83;0,604;47600
-38,7671;-72,76108333;26-05-2016;22:53:45;58;99;40;85;0,558;51700
-38,76706667;-72,76063333;26-05-2016;22:53:49;58;38;35;85;0,551;53200
-38,76718333;-72,76023333;26-05-2016;22:53:54;58;37;27;110;0,533;52400
-38,76775;-72,75963333;26-05-2016;22:54:02;57;83;37;141;0,515;53900
-38,7679;-72,75945;26-05-2016;22:54:04;58;23;41;133;0,492;53800
-38,76821667;-72,75871667;26-05-2016;22:54:10;57;72;43;119;0,504;57300
-38,76825;-72,75858333;26-05-2016;22:54:11;57;12;44;106;0,489;56800
-38,76823333;-72,75786667;26-05-2016;22:54:16;57;62;45;89;0,469;54500
-38,7682;-72,75771667;26-05-2016;22:54:17;57;13;46;74;0,458;55400
-38,76795;-72,7569;26-05-2016;22:54:24;57;76;39;69;0,56;56700
-38,76783333;-72,75648333;26-05-2016;22:54:29;56;38;27;71;0,537;56300
-38,76775;-72,75576667;26-05-2016;22:54:35;57;63;38;81;0,546;55200
-38,76756667;-72,75456667;26-05-2016;22:54:44;58;106;42;79;0,471;54600
-38,76741667;-72,75393333;26-05-2016;22:54:50;58;58;35;73;0,467;57700
-38,7673;-72,75336667;26-05-2016;22:54:57;58;51;26;75;0,484;57600
-38,76708333;-72,75268333;26-05-2016;22:55:03;58;63;38;69;0,54;56900
-38,7668;-72,75173333;26-05-2016;22:55:10;58;89;46;68;0,589;55500
-38,7664;-72,7506;26-05-2016;22:55:19;58;109;43;66;0,537;54600
-38,76608333;-72,74925;26-05-2016;22:55:29;59;122;44;73;0,451;55200
-38,76575;-72,74783333;26-05-2016;22:55:39;61;129;46;74;0,416;56500
-38,76556667;-72,747;26-05-2016;22:55:44;61;75;54;74;0,395;54900
-38,76525;-72,7455;26-05-2016;22:55:53;61;134;54;74;0,395;56700
-38,76511667;-72,74416667;26-05-2016;22:56:01;61;117;53;82;0,382;56400
-38,76506667;-72,74308333;26-05-2016;22:56:08;61;93;48;86;0,432;54300
-38,76503333;-72,74223333;26-05-2016;22:56:15;61;74;38;88;0,599;56700
-38,76503333;-72,7419;26-05-2016;22:56:20;61;29;21;89;0,635;55200
-38,76503333;-72,74186667;26-05-2016;22:56:24;61;3;3;86;0,675;55300
-38,76503333;-72,74175;26-05-2016;22:56:32;61;10;4;91;0,519;56400
-38,76501667;-72,74145;26-05-2016;22:56:36;61;27;24;88;0,475;57000
-38,765;-72,74088333;26-05-2016;22:56:41;61;48;35;87;0,365;59100
-38,76495;-72,73976667;26-05-2016;22:56:49;61;98;44;87;0,279;58700
-38,76486667;-72,73793333;26-05-2016;22:57:01;62;160;48;87;0,38;57400
-38,76478333;-72,7361;26-05-2016;22:57:12;62;160;52;87;0,361;59400
-38,7647;-72,73455;26-05-2016;22:57:21;62;134;54;86;0,347;58600
-38,76456667;-72,73353333;26-05-2016;22:57:27;64;90;54;79;0,334;59000
-38,76425;-72,73258333;26-05-2016;22:57:33;65;89;53;67;0,329;59000
-38,76378333;-72,7317;26-05-2016;22:57:39;67;92;55;57;0,363;58400
-38,76311667;-72,73068333;26-05-2016;22:57:47;68;116;52;50;0,341;59400
-38,76243333;-72,72961667;26-05-2016;22:57:55;70;119;54;50;0,383;58600
-38,76156667;-72,7282;26-05-2016;22:58:05;73;157;56;52;0,373;60300
-38,76116667;-72,72723333;26-05-2016;22:58:11;75;96;57;62;0,431;61200
-38,76095;-72,7263;26-05-2016;22:58:16;75;83;60;73;0,494;60900
-38,76085;-72,72513333;26-05-2016;22:58:22;76;102;61;84;0,445;60600
-38,76086667;-72,72341667;26-05-2016;22:58:31;77;149;60;90;0,418;59900
-38,76091667;-72,72141667;26-05-2016;22:58:42;76;174;57;92;0,574;60800
-38,76091667;-72,7194;26-05-2016;22:58:53;75;174;57;90;0,644;61200
-38,76093333;-72,71766667;26-05-2016;22:59:02;76;150;60;91;0,654;60900
-38,76093333;-72,71575;26-05-2016;22:59:12;75;167;60;90;0,52;61200
-38,76095;-72,71326667;26-05-2016;22:59:25;74;214;59;90;0,52;60200
-38,76093333;-72,71063333;26-05-2016;22:59:39;75;229;59;90;0,501;60600
-38,76095;-72,7093;26-05-2016;22:59:46;75;117;60;91;0,511;60400
-38,76098333;-72,70755;26-05-2016;22:59:55;76;151;60;91;0,517;61200
-38,76095;-72,70516667;26-05-2016;23:00:07;77;208;62;89;0,445;61000
-38,76093333;-72,70246667;26-05-2016;23:00:21;77;234;60;90;0,467;60800
-38,76091667;-72,70016667;26-05-2016;23:00:33;78;201;60;90;0,711;60500
-38,76091667;-72,6979;26-05-2016;23:00:45;79;196;59;90;0,8;60300
-38,761;-72,69645;26-05-2016;23:00:53;79;126;57;94;0,824;60900
-38,7612;-72,69526667;26-05-2016;23:01:00;80;106;54;102;0,863;60300
-38,76146667;-72,69405;26-05-2016;23:01:08;80;111;50;106;0,749;59500
-38,7616;-72,69348333;26-05-2016;23:01:13;79;50;36;106;0,789;59400
-38,76165;-72,69326667;26-05-2016;23:01:17;79;20;18;109;0,997;59800
-38,76171667;-72,69301667;26-05-2016;23:01:22;79;24;17;108;0,912;59700
-38,76185;-72,6924;26-05-2016;23:01:28;78;55;33;105;0,883;59800
-38,76201667;-72,6916;26-05-2016;23:01:34;78;72;43;105;1;59200
-38,76226667;-72,69025;26-05-2016;23:01:43;76;120;48;104;0,971;58700
-38,76231667;-72,68935;26-05-2016;23:01:49;75;78;47;94;0,616;59700
-38,76225;-72,68806667;26-05-2016;23:01:57;73;113;51;86;0,692;60300
-38,76216667;-72,68675;26-05-2016;23:02:05;73;114;51;85;0,771;60300
-38,76208333;-72,68536667;26-05-2016;23:02:13;73;121;54;85;0,792;60400
-38,762;-72,68385;26-05-2016;23:02:21;73;132;59;86;0,743;59600
-38,7618;-72,6807;26-05-2016;23:02:37;75;274;62;85;0,856;59800
-38,76168333;-72,67926667;26-05-2016;23:02:45;77;124;56;84;0,906;59700
-38,76148333;-72,67808333;26-05-2016;23:02:52;78;105;54;78;0,859;59800
-38,76115;-72,67693333;26-05-2016;23:02:59;79;108;55;69;0,901;59600
-38,76043333;-72,6748;26-05-2016;23:03:12;82;202;56;67;0,699;59400
-38,75993333;-72,67318333;26-05-2016;23:03:21;83;151;60;69;0,787;59500
-38,75958333;-72,6719;26-05-2016;23:03:28;84;118;61;71;0,696;59300
-38,75928333;-72,67056667;26-05-2016;23:03:36;86;120;54;73;0,733;59600
-38,7588;-72,66841667;26-05-2016;23:03:49;86;195;54;74;0,854;59500
-38,7584;-72,66663333;26-05-2016;23:03:59;87;161;58;74;0,852;59900
-38,75808333;-72,66563333;26-05-2016;23:04:05;87;94;57;68;0,788;58700
-38,75745;-72,664;26-05-2016;23:04:15;89;158;57;64;0,801;58600
-38,75726667;-72,6631;26-05-2016;23:04:20;89;81;58;76;0,827;59200
-38,75713333;-72,66163333;26-05-2016;23:04:28;90;128;58;83;0,879;57900
-38,75713333;-72,6604;26-05-2016;23:04:35;91;106;55;90;0,912;58600
-38,7573;-72,65883333;26-05-2016;23:04:44;92;137;55;98;0,881;58900
-38,75743333;-72,6573;26-05-2016;23:04:53;91;134;54;96;0,767;58900
-38,75753333;-72,65608333;26-05-2016;23:05:00;90;107;55;96;0,888;58600
-38,75761667;-72,65493333;26-05-2016;23:05:06;88;99;60;95;0,799;58100
-38,75755;-72,65381667;26-05-2016;23:05:12;87;97;58;86;0,754;58600
-38,75746667;-72,65241667;26-05-2016;23:05:20;85;122;55;85;0,809;58800
-38,75736667;-72,65106667;26-05-2016;23:05:28;84;118;53;85;0,865;58800
-38,75728333;-72,64986667;26-05-2016;23:05:35;83;104;53;84;0,839;58900
-38,75718333;-72,64845;26-05-2016;23:05:44;83;123;49;85;0,731;57300
-38,75713333;-72,64786667;26-05-2016;23:05:49;83;51;37;84;0,69;58500
-38,7571;-72,64725;26-05-2016;23:05:56;84;54;28;85;0,928;57400
-38,75703333;-72,64656667;26-05-2016;23:06:02;85;60;36;84;0,809;58700
-38,75696667;-72,64543333;26-05-2016;23:06:10;86;98;44;86;0,764;58900
-38,75688333;-72,64383333;26-05-2016;23:06:20;88;139;50;86;0,872;58000
-38,75675;-72,64196667;26-05-2016;23:06:32;89;162;49;85;1,69;58200
-38,75661667;-72,64061667;26-05-2016;23:06:41;89;119;47;83;1,57;58300
-38,7564;-72,63981667;26-05-2016;23:06:47;90;73;44;71;1,79;58800
-38,7563;-72,63951667;26-05-2016;23:06:51;90;28;25;67;1,77;59000
-38,75626667;-72,63945;26-05-2016;23:06:55;91;7;6;67;1,82;56800
-38,75625;-72,63936667;26-05-2016;23:07:37;91;7;0,6;67;1,64;58200
-38,75618333;-72,63911667;26-05-2016;23:07:41;91;24;22;71;1,68;57400
-38,756;-72,63851667;26-05-2016;23:07:47;92;55;33;69;1,54;57300
-38,75575;-72,63771667;26-05-2016;23:07:53;94;75;45;69;1,64;55600
-38,75538333;-72,63643333;26-05-2016;23:08:01;94;118;53;69;1,89;57600
-38,755;-72,63508333;26-05-2016;23:08:10;94;125;50;70;2,09;57400
-38,75491667;-72,63413333;26-05-2016;23:08:16;93;83;50;84;2,13;57400
-38,75488333;-72,63211667;26-05-2016;23:08:28;93;175;53;89;2,42;57600
-38,75481667;-72,62898333;26-05-2016;23:08:46;94;271;54;88;2,11;56400
-38,75473333;-72,62703333;26-05-2016;23:08:57;93;170;56;87;2,16;56900
-38,7546;-72,62496667;26-05-2016;23:09:09;93;181;54;85;1,95;56600
-38,75446667;-72,62281667;26-05-2016;23:09:22;93;187;52;85;2;57100
-38,75441667;-72,62228333;26-05-2016;23:09:26;93;45;41;83;2,16;57500
-38,75438333;-72,62203333;26-05-2016;23:09:30;92;23;21;79;2,13;57900
-38,75436667;-72,62198333;26-05-2016;23:09:34;91;5;4;77;2,13;57900
-38,75436667;-72,62195;26-05-2016;23:09:48;91;3;0,7;102;2,06;57600
-38,75441667;-72,62175;26-05-2016;23:09:56;91;17;8;104;1,97;57300
-38,75445;-72,6217;26-05-2016;23:09:58;91;6;11;125;1,99;58300
-38,75445;-72,62158333;26-05-2016;23:10:00;91;10;18;95;1,99;58000
-38,7544;-72,621;26-05-2016;23:10:07;91;50;26;84;2,14;57200
-38,7544;-72,62081667;26-05-2016;23:10:11;91;17;15;87;2,09;58000
-38,7544;-72,62078333;26-05-2016;23:10:16;90;3;2;86;2,06;58000
-38,7544;-72,62076667;26-05-2016;23:10:19;90;1;1;85;2,18;57800
-38,75438333;-72,62056667;26-05-2016;23:10:24;91;17;12;85;1,86;57700
-38,75425;-72,62031667;26-05-2016;23:10:29;91;27;19;57;1,74;57400
-38,75395;-72,61993333;26-05-2016;23:10:35;92;48;29;45;1,61;57600
-38,75355;-72,61941667;26-05-2016;23:10:41;92;63;38;45;1,59;56900
-38,75301667;-72,61873333;26-05-2016;23:10:48;95;84;43;45;1,36;57400
-38,75281667;-72,61848333;26-05-2016;23:10:52;96;31;28;44;1,39;57400
-38,75275;-72,61843333;26-05-2016;23:10:56;97;8;7;39;1,35;57700
-38,7527;-72,61833333;26-05-2016;23:11:18;98;10;2;48;1,03;59100
-38,75248333;-72,61805;26-05-2016;23:11:23;99;35;25;47;0,952;59300
-38,7521;-72,61758333;26-05-2016;23:11:29;100;58;35;44;0,931;59200
-38,75155;-72,61685;26-05-2016;23:11:37;101;88;40;45;1,03;58900
-38,75135;-72,61661667;26-05-2016;23:11:41;102;30;27;42;1,11;59900
-38,75125;-72,61655;26-05-2016;23:11:45;103;11;10;33;1,12;60100
-38,75125;-72,61655;26-05-2016;23:12:00;103;0;0,1;358;1,1;60200
-38,75115;-72,61635;26-05-2016;23:12:06;103;22;13;57;1,02;60500
-38,7509;-72,61595;26-05-2016;23:12:12;103;44;26;53;0,905;60500
-38,75046667;-72,61535;26-05-2016;23:12:19;103;70;36;47;0,75;60100
-38,74983333;-72,61453333;26-05-2016;23:12:29;103;101;36;45;0,767;59700
-38,74945;-72,6141;26-05-2016;23:12:36;104;57;29;42;0,673;59900
-38,74911667;-72,61365;26-05-2016;23:12:41;104;53;38;45;0,774;59800
-38,7484;-72,61273333;26-05-2016;23:12:50;104;113;45;45;0,464;59500
-38,74736667;-72,61148333;26-05-2016;23:13:02;104;158;47;44;0,323;58700
-38,74625;-72,61015;26-05-2016;23:13:15;106;170;47;43;0,243;58400
-38,74593333;-72,60975;26-05-2016;23:13:20;107;49;35;44;0,244;58300
-38,74585;-72,6095;26-05-2016;23:13:25;107;25;18;66;0,295;58500
-38,74583333;-72,60931667;26-05-2016;23:13:34;106;15;6;88;0,396;58500
-38,74583333;-72,60923333;26-05-2016;23:13:48;106;8;2;81;0,36;58000
-38,74581667;-72,6092;26-05-2016;23:13:49;106;4;13;80;0,366;58400
-38,74566667;-72,60901667;26-05-2016;23:13:54;106;23;16;42;0,43;57900
-38,74525;-72,60881667;26-05-2016;23:14:02;107;50;22;21;0,441;57300
-38,74505;-72,60856667;26-05-2016;23:14:09;108;30;15;43;0,49;57400
-38,74496667;-72,60845;26-05-2016;23:14:14;109;14;10;51;0,511;55400
-38,7448;-72,60818333;26-05-2016;23:14:19;110;30;22;48;0,463;56300
-38,74451667;-72,6078;26-05-2016;23:14:24;110;45;33;47;0,675;56200
-38,74391667;-72,60698333;26-05-2016;23:14:33;111;98;39;47;0,874;55000
-38,74328333;-72,60613333;26-05-2016;23:14:42;113;103;41;46;0,942;54600
-38,74276667;-72,60546667;26-05-2016;23:14:49;114;80;41;45;0,946;53900
-38,74236667;-72,60493333;26-05-2016;23:14:55;115;66;39;46;0,917;54200
-38,74206667;-72,60453333;26-05-2016;23:15:01;115;47;28;47;0,908;53400
-38,74195;-72,60436667;26-05-2016;23:15:06;115;20;15;46;0,883;54000
-38,74181667;-72,60416667;26-05-2016;23:15:14;115;22;10;48;0,804;53300
-38,74163333;-72,60391667;26-05-2016;23:15:20;116;30;18;48;0,777;53200
-38,74156667;-72,60368333;26-05-2016;23:15:25;116;21;15;71;0,784;53500
-38,74158333;-72,6036;26-05-2016;23:15:27;115;7;13;103;0,837;53100
-38,74166667;-72,60333333;26-05-2016;23:15:36;115;25;10;114;1,11;51300
-38,74166667;-72,60331667;26-05-2016;23:15:37;115;3;9;90;1,09;50200
-38,74163333;-72,60321667;26-05-2016;23:15:44;115;8;4;63;1,12;48200
-38,74165;-72,60321667;26-05-2016;23:15:50;115;1;0,7;121;1;45600
-38,74158333;-72,60321667;26-05-2016;23:15:54;115;7;6;352;0,841;48200
-38,74148333;-72,60326667;26-05-2016;23:16:01;115;12;6;338;0,784;45800
-38,74145;-72,60325;26-05-2016;23:16:09;115;4;2;24;0,78;46000
-38,74145;-72,60323333;26-05-2016;23:16:28;114;2;0,3;73;1,09;52600
-38,74145;-72,60321667;26-05-2016;23:17:11;113;2;0,2;73;1,12;52300
-38,74136667;-72,60308333;26-05-2016;23:27:56;109;22;2;17;1,02;52900
-38,74156667;-72,60278333;26-05-2016;23:28:00;101;34;30;131;1,03;52100
-38,74158333;-72,60228333;26-05-2016;23:28:10;99;44;16;92;1,06;50500
-38,7416;-72,60218333;26-05-2016;23:28:17;101;9;4;103;1;50000
-38,74143333;-72,60263333;26-05-2016;23:28:25;108;44;20;295;0,857;50600
-38,74151667;-72,60298333;26-05-2016;23:29:34;108;31;2;252;0,858;50500
-38,74148333;-72,60323333;26-05-2016;23:29:42;113;22;10;282;0,719;50200
-38,74136667;-72,60303333;26-05-2016;23:31:06;112;21;0,9;55;0,72;50400
-38,74146667;-72,60276667;26-05-2016;23:31:19;110;26;7;115;0,623;51400
-38,74158333;-72,60311667;26-05-2016;23:33:02;110;9;2;56;0,669;50200
-38,74156667;-72,6031;26-05-2016;23:33:08;111;2;1,3;12;0,726;52200
-38,74155;-72,60315;26-05-2016;23:33:26;111;4;0,7;303;0,631;52900
-38,74146667;-72,6032;26-05-2016;23:33:34;111;11;5;330;0,595;52200
-38,74148333;-72,60335;26-05-2016;23:34:41;118;12;0,7;263;0,651;53500
-38,74145;-72,60333333;26-05-2016;23:34:50;119;4;2;11;0,647;52800
-38,74145;-72,60333333;26-05-2016;23:35:03;113;1;0,4;207;0,668;52400
-38,74145;-72,6033;26-05-2016;23:35:14;109;4;1,3;87;0,715;51600
-38,74145;-72,60328333;26-05-2016;23:35:22;108;1;0,3;43;0,696;52200
-38,74146667;-72,60328333;26-05-2016;23:35:38;108;2;0,5;154;0,749;52400
-38,74155;-72,60321667;26-05-2016;23:35:47;108;11;5;155;0,74;52300
-38,74151667;-72,6032;26-05-2016;23:35:53;109;5;3;26;0,704;52500
-38,74145;-72,60316667;26-05-2016;23:36:04;109;8;2;24;0,689;50800
-38,74156667;-72,60325;26-05-2016;23:37:03;106;14;0,9;212;0,769;52100
-38,7416;-72,60328333;26-05-2016;23:37:10;103;5;2;223;0,757;52300
-38,74158333;-72,60328333;26-05-2016;23:38:16;103;2;0,1;359;0,724;52100
-38,7415;-72,60333333;26-05-2016;23:38:21;104;11;8;340;0,787;52000
-38,74128333;-72,60335;26-05-2016;23:38:31;104;23;8;357;0,712;52200
-38,7411;-72,60313333;26-05-2016;23:38:36;105;28;20;43;0,951;51800
-38,74073333;-72,60256667;26-05-2016;23:38:43;104;63;32;50;0,75;51800
-38,74031667;-72,60185;26-05-2016;23:38:50;105;79;41;54;0,781;52100
-38,73978333;-72,60081667;26-05-2016;23:38:59;104;106;42;56;0,809;50600
-38,73915;-72,59965;26-05-2016;23:39:09;104;124;45;56;0,871;52200
-38,7385;-72,59846667;26-05-2016;23:39:19;103;126;45;55;0,873;51800
-38,73795;-72,59743333;26-05-2016;23:39:28;103;109;44;55;0,976;50200
-38,73763333;-72,5969;26-05-2016;23:39:34;103;58;35;53;0,925;52100
-38,73751667;-72,59673333;26-05-2016;23:39:37;103;19;23;47;1,02;51800
-38,73743333;-72,59658333;26-05-2016;23:39:40;103;17;20;56;1,11;50400
-38,73723333;-72,59608333;26-05-2016;23:39:46;103;48;29;63;1,15;50600
-38,73681667;-72,59525;26-05-2016;23:39:55;104;85;34;58;1,18;52000
-38,73641667;-72,59445;26-05-2016;23:40:03;104;83;37;58;1,2;52200
-38,73591667;-72,59343333;26-05-2016;23:40:13;107;104;38;58;1,34;51400
-38,73536667;-72,59243333;26-05-2016;23:40:22;108;106;43;55;1,37;52500
-38,73498333;-72,59181667;26-05-2016;23:40:29;107;68;35;51;1,28;51800
-38,73496667;-72,59176667;26-05-2016;23:40:30;108;6;23;59;1,12;51800
-38,73496667;-72,59141667;26-05-2016;23:40:35;108;30;22;91;1,06;51700
-38,73505;-72,59076667;26-05-2016;23:40:42;107;56;29;100;0,918;50700
-38,73518333;-72,58998333;26-05-2016;23:40:50;105;70;32;102;0,846;50500
-38,73521667;-72,5898;26-05-2016;23:40:54;105;17;15;104;0,787;51400
-38,73523333;-72,58968333;26-05-2016;23:40:58;105;10;9;104;0,904;51900
-38,73511667;-72,58956667;26-05-2016;23:41:02;104;17;15;34;0,903;51700
-38,73458333;-72,58945;26-05-2016;23:41:11;104;60;24;10;0,754;50800
-38,73435;-72,58941667;26-05-2016;23:41:18;105;26;13;9;0,345;51500
-38,7342;-72,58936667;26-05-2016;23:41:23;104;17;13;14;0,338;50700
-38,73388333;-72,58926667;26-05-2016;23:41:27;104;36;32;13;0,348;50700
-38,73335;-72,58911667;26-05-2016;23:41:34;104;61;31;12;0,324;50800
-38,73326667;-72,5891;26-05-2016;23:41:38;104;9;8;10;0,361;50500
-38,7332;-72,58908333;26-05-2016;23:41:44;104;8;5;9;0,486;50600
-38,73301667;-72,58905;26-05-2016;23:41:49;103;21;15;9;1,4;50300
-38,73291667;-72,58921667;26-05-2016;23:41:53;103;19;17;311;1,42;49600
-38,73278333;-72,58998333;26-05-2016;23:42:01;106;68;30;282;1,43;50800
-38,73275;-72,59023333;26-05-2016;23:42:05;107;23;21;279;1,34;52100
-38,7327;-72,59073333;26-05-2016;23:42:12;108;42;22;277;0,929;51600
-38,73266667;-72,59116667;26-05-2016;23:42:19;108;38;20;276;0,787;50700
-38,73253333;-72,59175;26-05-2016;23:42:26;110;53;27;286;0,341;50300
-38,73241667;-72,59258333;26-05-2016;23:42:34;113;72;33;281;0,322;51300
-38,7324;-72,59288333;26-05-2016;23:42:39;113;27;20;272;0,546;52600
-38,73236667;-72,5933;26-05-2016;23:42:46;114;36;18;275;0,31;52400
-38,73221667;-72,59401667;26-05-2016;23:42:53;116;64;33;285;0,336;52200
-38,73205;-72,595;26-05-2016;23:43:01;118;88;39;283;0,484;52100
-38,732;-72,59546667;26-05-2016;23:43:06;120;41;30;279;0,342;52600
-38,73195;-72,59575;26-05-2016;23:43:12;121;26;15;282;0,391;52900
-38,73188333;-72,59613333;26-05-2016;23:43:18;124;33;20;282;0,39;52500
-38,7318;-72,59651667;26-05-2016;23:43:25;127;35;18;283;0,375;52500
-38,73175;-72,597;26-05-2016;23:43:32;128;41;21;278;0,412;52700
-38,73165;-72,5977;26-05-2016;23:43:41;129;63;25;281;0,386;52800
-38,73155;-72,59831667;26-05-2016;23:43:46;129;54;39;282;0,33;52000
-38,73138333;-72,59938333;26-05-2016;23:43:55;128;95;38;281;0,406;51600
-38,73133333;-72,59966667;26-05-2016;23:43:59;127;26;23;283;0,51;51600
-38,73128333;-72,59998333;26-05-2016;23:44:05;125;27;16;281;0,513;52100
-38,73146667;-72,60008333;26-05-2016;23:44:09;123;21;19;205;0,543;53100
-38,73216667;-72,60023333;26-05-2016;23:44:18;120;80;32;190;0,689;53200
-38,73301667;-72,60043333;26-05-2016;23:44:28;118;96;35;190;0,464;52800
-38,73336667;-72,60051667;26-05-2016;23:44:34;117;40;24;190;0,412;53200
-38,73343333;-72,60053333;26-05-2016;23:44:39;117;6;4;200;0,406;53500
-38,73341667;-72,6007;26-05-2016;23:44:44;116;14;10;272;0,435;52000
-38,7332;-72,60116667;26-05-2016;23:44:50;116;48;29;301;0,442;51700
-38,7329;-72,60166667;26-05-2016;23:44:55;115;54;39;308;0,538;50800
-38,73218333;-72,60273333;26-05-2016;23:45:06;116;123;40;310;0,735;52100
-38,73176667;-72,60338333;26-05-2016;23:45:12;116;74;44;310;0,767;52100
-38,73113333;-72,6044;26-05-2016;23:45:21;117;112;45;309;0,803;51900
-38,73045;-72,60541667;26-05-2016;23:45:31;118;116;42;310;0,855;50300
-38,73003333;-72,60611667;26-05-2016;23:45:38;118;77;40;308;0,869;52300
-38,72973333;-72,60686667;26-05-2016;23:45:44;118;74;44;297;0,589;52100
-38,72913333;-72,60856667;26-05-2016;23:45:56;117;161;48;294;0,68;52300
-38,72878333;-72,60956667;26-05-2016;23:46:04;117;95;43;295;0,713;52300
-38,7287;-72,60975;26-05-2016;23:46:07;117;18;21;296;0,722;52700
-38,72868333;-72,60978333;26-05-2016;23:46:11;116;4;3;311;0,801;52700
-38,72865;-72,60988333;26-05-2016;23:46:15;116;9;8;299;1,23;52700
-38,72853333;-72,61021667;26-05-2016;23:46:22;115;31;16;292;1,3;53200
-38,72833333;-72,61065;26-05-2016;23:46:29;115;45;23;302;1,29;52800
-38,72796667;-72,6111;26-05-2016;23:46:36;115;55;29;315;1,35;52300
-38,72746667;-72,61171667;26-05-2016;23:46:46;114;78;28;317;1,09;52300
-38,7273;-72,61193333;26-05-2016;23:46:51;114;26;19;315;0,933;53300
-38,7272;-72,61205;26-05-2016;23:46:58;114;15;8;315;0,87;52900
-38,72703333;-72,61225;26-05-2016;23:47:03;115;26;19;316;0,679;51900
-38,72653333;-72,61286667;26-05-2016;23:47:13;116;77;28;317;0,739;52800
-38,72615;-72,61333333;26-05-2016;23:47:21;119;59;26;316;0,951;53100
-38,72571667;-72,61385;26-05-2016;23:47:29;122;65;29;317;0,939;51800
-38,72528333;-72,61445;26-05-2016;23:47:38;124;71;28;313;0,963;50200
-38,72503333;-72,61491667;26-05-2016;23:47:44;126;49;29;304;1,05;51700
-38,72466667;-72,61586667;26-05-2016;23:47:54;129;93;33;297;1,17;49900
-38,72431667;-72,61698333;26-05-2016;23:48:05;134;104;34;292;0,95;52000
-38,7241;-72,61751667;26-05-2016;23:48:11;135;53;32;296;0,875;53000
-38,72363333;-72,61808333;26-05-2016;23:48:18;138;73;37;317;1,05;52600
-38,7231;-72,61838333;26-05-2016;23:48:24;140;63;38;336;0,838;51800
-38,72256667;-72,61851667;26-05-2016;23:48:30;142;61;36;348;0,599;50800
-38,72195;-72,61865;26-05-2016;23:48:36;145;70;42;350;0,564;51600
-38,72141667;-72,61885;26-05-2016;23:48:42;148;62;37;344;0,434;50200
-38,72098333;-72,61906667;26-05-2016;23:48:47;150;52;38;339;0,42;50400
-38,72076667;-72,61913333;26-05-2016;23:48:51;151;24;22;343;0,597;51500
-38,72048333;-72,61928333;26-05-2016;23:48:58;152;34;18;340;0,638;51800
-38,71991667;-72,61951667;26-05-2016;23:49:07;151;66;27;342;0,563;51700
-38,71921667;-72,61983333;26-05-2016;23:49:18;148;83;27;341;0,559;51900
-38,71901667;-72,61993333;26-05-2016;23:49:23;147;23;16;337;0,599;51500
-38,719;-72,61995;26-05-2016;23:49:28;147;2;1,3;338;0,724;51700
-38,71895;-72,62;26-05-2016;23:49:32;147;8;7;325;0,14;51600
-38,7188;-72,6202;26-05-2016;23:49:38;148;24;14;314;0,119;50400
-38,71868333;-72,62051667;26-05-2016;23:49:43;149;32;23;296;0,107;51500
-38,71856667;-72,62105;26-05-2016;23:49:49;149;47;28;286;0,185;51500
-38,7184;-72,62173333;26-05-2016;23:49:55;148;62;37;286;0,162;51500
-38,71818333;-72,62266667;26-05-2016;23:50:03;145;85;38;287;0,355;51600
-38,71798333;-72,62318333;26-05-2016;23:50:09;144;51;30;294;0,428;51600
-38,71795;-72,6233;26-05-2016;23:50:13;144;10;9;297;0,448;50300
-38,71791667;-72,62338333;26-05-2016;23:50:35;143;9;1,4;296;0,355;50700
-38,71778333;-72,62373333;26-05-2016;23:50:41;144;33;20;298;0,524;51300
-38,71751667;-72,62436667;26-05-2016;23:50:48;145;62;32;297;0,215;50500
-38,7173;-72,62511667;26-05-2016;23:50:55;146;70;36;291;0,253;51400
-38,71708333;-72,6262;26-05-2016;23:51:04;147;96;39;284;0,247;51400
-38,7169;-72,62693333;26-05-2016;23:51:11;148;68;35;288;0,26;51300
-38,71651667;-72,62773333;26-05-2016;23:51:19;149;81;37;303;0,199;50200
-38,716;-72,62873333;26-05-2016;23:51:28;151;104;42;303;0,182;50800
-38,71531667;-72,6301;26-05-2016;23:51:39;150;142;46;303;0,128;50700
-38,71471667;-72,63105;26-05-2016;23:51:47;149;105;47;309;0,111;50600
-38,71373333;-72,63215;26-05-2016;23:51:58;148;145;48;319;0,154;50600
-38,71328333;-72,63266667;26-05-2016;23:52:04;150;67;40;317;0,153;49900
-38,71266667;-72,63341667;26-05-2016;23:52:14;153;95;34;317;0,22;50800
-38,71213333;-72,63403333;26-05-2016;23:52:22;158;78;35;318;0,24;50400
-38,71148333;-72,63475;26-05-2016;23:52:30;161;96;43;319;0,244;50100
-38,71066667;-72,6356;26-05-2016;23:52:39;164;118;47;321;0,366;51800
-38,70983333;-72,63641667;26-05-2016;23:52:48;166;116;47;322;0,372;52100
-38,70901667;-72,6373;26-05-2016;23:52:57;168;119;48;320;0,361;52000
-38,70835;-72,63811667;26-05-2016;23:53:05;168;102;46;317;0,344;52900
-38,70771667;-72,63893333;26-05-2016;23:53:12;168;100;51;314;0,352;52400
-38,7073;-72,63978333;26-05-2016;23:53:18;168;87;52;303;0,339;52000
-38,70686667;-72,64075;26-05-2016;23:53:25;168;97;50;300;0,359;52600
-38,7063;-72,64176667;26-05-2016;23:53:32;168;108;56;305;0,353;51800
-38,70555;-72,64308333;26-05-2016;23:53:41;166;141;57;305;0,372;50100
-38,70503333;-72,64413333;26-05-2016;23:53:49;165;108;48;303;0,372;51700
-38,70461667;-72,64518333;26-05-2016;23:53:57;164;103;46;297;0,36;51700
-38,70421667;-72,64638333;26-05-2016;23:54:06;160;113;45;294;0,346;50700
-38,70373333;-72,64768333;26-05-2016;23:54:15;157;125;50;295;0,19;50200
-38,70335;-72,6483;26-05-2016;23:54:20;156;68;49;308;0,215;49300
-38,70255;-72,64926667;26-05-2016;23:54:29;155;123;49;317;0,209;51300
-38,70228333;-72,64951667;26-05-2016;23:54:32;155;37;45;323;0,172;50700
-38,70166667;-72,6498;26-05-2016;23:54:38;155;73;44;340;0,156;50500
-38,70063333;-72,65008333;26-05-2016;23:54:47;157;117;47;348;0,129;52200
-38,70008333;-72,65038333;26-05-2016;23:54:52;159;66;48;337;0,107;52200
-38,6997;-72,65093333;26-05-2016;23:54:57;161;65;47;312;0,131;50500
-38,69936667;-72,65181667;26-05-2016;23:55:03;163;84;50;295;0,162;52000
-38,69883333;-72,65325;26-05-2016;23:55:12;164;138;55;296;0,282;52700
-38,69851667;-72,65378333;26-05-2016;23:55:16;165;58;52;307;0,249;53100
-38,69808333;-72,6542;26-05-2016;23:55:21;165;60;43;322;0,203;52800
-38,6976;-72,65466667;26-05-2016;23:55:28;165;68;35;324;0,177;52900
-38,69715;-72,65521667;26-05-2016;23:55:35;165;70;36;316;0,328;51900
-38,6971;-72,65528333;26-05-2016;23:55:36;166;8;29;311;0,398;52200
-38,69698333;-72,6554;26-05-2016;23:55:41;166;17;12;322;0,366;52300
-38,69693333;-72,6554;26-05-2016;23:55:45;166;4;4;16;0,414;52400
-38,69691667;-72,65526667;26-05-2016;23:55:53;166;11;5;80;0,533;52600
-38,69693333;-72,6552;26-05-2016;23:56:00;165;5;3;99;0,496;52400
-38,69686667;-72,6552;26-05-2016;23:56:06;165;7;4;4;0,112;50500
-38,69693333;-72,6553;26-05-2016;23:56:11;164;12;8;233;0,177;52000
-38,69695;-72,65531667;26-05-2016;23:56:12;164;2;9;211;0,268;52000
-38,69703333;-72,65536667;26-05-2016;23:56:17;163;9;7;202;0,309;50400
-38,69716667;-72,65523333;26-05-2016;23:56:22;162;19;14;143;0,653;50400
-38,69748333;-72,65478333;26-05-2016;23:56:28;161;52;31;133;0,621;49800
-38,69798333;-72,65428333;26-05-2016;23:56:34;160;71;42;142;0,585;50500
-38,6984;-72,6539;26-05-2016;23:56:39;159;57;41;143;0,472;50400
-38,69871667;-72,65351667;26-05-2016;23:56:43;158;48;44;138;0,385;49800
-38,69908333;-72,65275;26-05-2016;23:56:49;158;78;47;122;0,566;50100
-38,6997;-72,65105;26-05-2016;23:57:01;161;163;49;115;0,622;49900
-38,70005;-72,65043333;26-05-2016;23:57:06;162;67;48;127;0,907;49200
-38,70058333;-72,6501;26-05-2016;23:57:11;163;66;48;153;0,661;49500
-38,70148333;-72,6498;26-05-2016;23:57:18;163;104;53;166;0,945;50400
-38,70225;-72,64951667;26-05-2016;23:57:24;162;89;53;164;0,869;50200
-38,70236667;-72,64945;26-05-2016;23:57:25;162;14;50;154;0,956;50300
-38,70305;-72,64868333;26-05-2016;23:57:32;161;101;52;139;0,893;49500
-38,70378333;-72,64768333;26-05-2016;23:57:40;159;119;54;133;0,972;50700
-38,70421667;-72,64641667;26-05-2016;23:57:48;155;119;54;114;1,09;50500
-38,70471667;-72,64495;26-05-2016;23:57:58;153;140;50;114;1,05;50700
-38,70521667;-72,64376667;26-05-2016;23:58:07;155;116;47;119;0,914;51400
-38,70566667;-72,64293333;26-05-2016;23:58:13;157;88;53;124;0,916;49400
-38,70628333;-72,64181667;26-05-2016;23:58:21;158;120;54;126;1,04;49600
-38,70705;-72,64043333;26-05-2016;23:58:32;160;147;48;125;0,953;50300
-38,70746667;-72,63946667;26-05-2016;23:58:39;162;96;49;120;1,26;49500
-38,70798333;-72,63853333;26-05-2016;23:58:46;161;99;51;125;1,27;51800
-38,70851667;-72,63788333;26-05-2016;23:58:52;161;83;50;137;1,29;50800
-38,70951667;-72,63678333;26-05-2016;23:59:03;162;147;48;139;1,12;51800
-38,71058333;-72,63568333;26-05-2016;23:59:14;164;152;50;141;1,31;51600
-38,71141667;-72,6348;26-05-2016;23:59:23;163;121;48;141;1,18;50400
-38,71255;-72,6336;26-05-2016;23:59:35;162;163;49;140;0,708;51900
-38,71325;-72,63275;26-05-2016;23:59:43;160;108;49;137;0,803;51700
-38,7138;-72,6321;26-05-2016;23:59:50;158;82;42;137;0,535;52300
-38,71463333;-72,63115;27-05-2016;00:00:00;155;125;45;138;1,14;52500
-38,71508333;-72,63058333;27-05-2016;00:00:06;153;70;42;136;0,711;52800
-38,71553333;-72,62973333;27-05-2016;00:00:13;152;89;46;124;0,639;52600
-38,71605;-72,62866667;27-05-2016;00:00:21;151;109;49;122;0,612;52900
-38,71656667;-72,62773333;27-05-2016;00:00:29;151;100;45;125;0,532;52600
-38,71696667;-72,62695;27-05-2016;00:00:36;150;81;42;124;0,576;53100
-38,71718333;-72,6261;27-05-2016;00:00:43;148;77;40;108;0,625;53000
-38,71743333;-72,62491667;27-05-2016;00:00:52;146;107;43;105;0,636;52600
-38,71763333;-72,62428333;27-05-2016;00:00:58;144;59;36;112;0,498;52000
-38,71781667;-72,6238;27-05-2016;00:01:04;143;47;28;116;0,496;51800
-38,71785;-72,6237;27-05-2016;00:01:07;142;9;11;112;0,515;53500
-38,7179;-72,62358333;27-05-2016;00:01:34;140;11;1,4;119;0,634;52900
-38,718;-72,62333333;27-05-2016;00:01:38;139;25;23;119;0,703;52400
-38,71818333;-72,62283333;27-05-2016;00:01:43;137;48;35;115;0,56;53300
-38,7184;-72,62201667;27-05-2016;00:01:50;134;75;38;108;0,324;53000
-38,71866667;-72,6208;27-05-2016;00:02:00;131;109;39;106;0,359;53300
-38,71876667;-72,6204;27-05-2016;00:02:05;130;37;27;107;0,373;53100
-38,71876667;-72,62033333;27-05-2016;00:02:08;130;5;6;103;0,367;53300
-38,71881667;-72,62023333;27-05-2016;00:02:29;131;10;2;117;0,355;55600
-38,71886667;-72,62013333;27-05-2016;00:02:31;131;10;18;125;0,383;54900
-38,71915;-72,61985;27-05-2016;00:02:36;132;41;29;141;0,486;56900
-38,71978333;-72,61953333;27-05-2016;00:02:43;132;75;38;159;0,555;53700
-38,72058333;-72,61921667;27-05-2016;00:02:51;134;93;42;162;0,513;53900
-38,72161667;-72,61875;27-05-2016;00:03:02;138;123;40;161;0,485;53900
-38,72223333;-72,61855;27-05-2016;00:03:08;140;70;42;166;0,375;52600
-38,72315;-72,61835;27-05-2016;00:03:17;140;104;42;170;0,723;53600
-38,72343333;-72,61823333;27-05-2016;00:03:21;140;33;30;161;0,514;53400
-38,72371667;-72,61805;27-05-2016;00:03:26;139;35;25;152;0,397;52900
-38,72405;-72,61765;27-05-2016;00:03:31;137;51;36;138;0,43;54200
-38,72431667;-72,61715;27-05-2016;00:03:36;135;53;38;122;0,81;53700
-38,72466667;-72,61603333;27-05-2016;00:03:45;132;105;42;112;0,719;54400
-38,72508333;-72,6149;27-05-2016;00:03:54;129;109;44;116;0,929;55000
-38,72538333;-72,61426667;27-05-2016;00:04:00;128;63;38;121;1,05;54700
-38,72575;-72,61378333;27-05-2016;00:04:06;126;59;36;134;1,08;54700
-38,72635;-72,61303333;27-05-2016;00:04:14;123;93;42;136;1,07;55500
-38,7268;-72,61248333;27-05-2016;00:04:21;120;70;36;136;1,14;57100
-38,727;-72,61226667;27-05-2016;00:04:26;117;29;21;140;1,13;57700
-38,7273;-72,61193333;27-05-2016;00:04:31;115;44;32;138;1,15;56600
-38,72785;-72,61123333;27-05-2016;00:04:39;111;86;38;136;1,02;59500
-38,72838333;-72,61058333;27-05-2016;00:04:47;107;82;37;136;0,88;58400
-38,72856667;-72,61033333;27-05-2016;00:04:52;105;30;22;133;0,888;59400
-38,72858333;-72,6103;27-05-2016;00:04:56;103;2;2;129;0,881;58200
-38,72855;-72,61026667;27-05-2016;00:05:17;97;5;0,8;49;0,81;59400
-38,72866667;-72,60985;27-05-2016;00:05:22;96;39;28;110;0,821;62300
-38,72891667;-72,60915;27-05-2016;00:05:28;95;66;39;115;0,544;65400
-38,7293;-72,60813333;27-05-2016;00:05:36;93;99;44;115;0,487;64000
-38,72978333;-72,60686667;27-05-2016;00:05:46;90;122;44;117;0,604;61600
-38,73008333;-72,60613333;27-05-2016;00:05:53;87;72;37;117;0,601;60400
-38,73055;-72,60533333;27-05-2016;00:06:01;89;87;39;127;0,604;60900
-38,73121667;-72,60428333;27-05-2016;00:06:11;92;117;42;129;0,586;61100
-38,73158333;-72,6037;27-05-2016;00:06:18;93;65;33;129;0,602;62300
-38,73218333;-72,60278333;27-05-2016;00:06:28;95;103;37;130;0,643;60500
-38,73283333;-72,6018;27-05-2016;00:06:39;98;113;37;130;0,59;62300
-38,73323333;-72,6013;27-05-2016;00:06:45;99;63;38;137;0,679;61800
-38,73351667;-72,60078333;27-05-2016;00:06:51;100;55;33;125;0,668;61400
-38,7336;-72,60056667;27-05-2016;00:06:54;100;20;24;114;0,651;65900
-38,7337;-72,60028333;27-05-2016;00:06:59;102;28;20;115;0,624;64400
-38,73378333;-72,59976667;27-05-2016;00:07:05;105;46;28;102;0,681;63700
-38,7339;-72,5989;27-05-2016;00:07:13;106;75;34;99;0,707;62700
-38,734;-72,59816667;27-05-2016;00:07:21;106;65;29;101;0,668;66500
-38,73408333;-72,59765;27-05-2016;00:07:28;106;46;24;101;0,653;64600
-38,73418333;-72,59705;27-05-2016;00:07:35;106;53;27;101;0,568;66600
-38,73428333;-72,59631667;27-05-2016;00:07:44;106;65;26;100;0,558;66600
-38,73436667;-72,5958;27-05-2016;00:07:50;106;46;27;100;0,473;66300
-38,73443333;-72,59525;27-05-2016;00:07:56;106;48;29;99;0,485;69500
-38,7345;-72,5949;27-05-2016;00:08:02;105;32;19;103;0,499;68500
-38,73456667;-72,59443333;27-05-2016;00:08:08;106;42;25;101;0,496;69000
-38,73471667;-72,59343333;27-05-2016;00:08:18;105;88;32;102;0,529;67100
-38,73486667;-72,59246667;27-05-2016;00:08:27;105;86;34;101;0,51;67700
-38,73505;-72,59131667;27-05-2016;00:08:38;105;102;33;102;0,407;67000
-38,73526667;-72,59;27-05-2016;00:08:50;105;118;35;102;0,41;70200
-38,73528333;-72,58988333;27-05-2016;00:08:51;105;9;34;101;0,391;69500
-38,73526667;-72,58961667;27-05-2016;00:08:56;105;23;17;86;0,379;67200
-38,73526667;-72,58963333;27-05-2016;00:09:05;105;1;0,4;323;0,345;66400
-38,73526667;-72,58965;27-05-2016;00:09:18;105;2;0,6;252;0,327;66700
-38,73533333;-72,58946667;27-05-2016;00:09:24;105;18;11;114;0,414;64800
-38,7354;-72,58901667;27-05-2016;00:09:31;104;39;20;101;0,47;71700
-38,73553333;-72,58841667;27-05-2016;00:09:41;103;54;19;105;0,488;68900
-38,73553333;-72,58838333;27-05-2016;00:09:45;103;4;3;98;0,475;70600
-38,73553333;-72,58838333;27-05-2016;00:09:57;103;0;0,1;20;0,463;69700
-38,7356;-72,5882;27-05-2016;00:10:03;103;18;11;117;0,458;70200
-38,73568333;-72,58778333;27-05-2016;00:10:08;103;37;27;104;0,456;69200
-38,73575;-72,58708333;27-05-2016;00:10:15;103;61;32;98;0,678;71200
-38,73581667;-72,5868;27-05-2016;00:10:20;104;25;18;107;0,683;71300
-38,73588333;-72,58676667;27-05-2016;00:10:22;104;8;15;156;0,7;70200
-38,73625;-72,58685;27-05-2016;00:10:27;105;40;29;191;0,691;70000
-38,73683333;-72,58703333;27-05-2016;00:10:33;105;68;41;193;0,693;68500
-38,73715;-72,58713333;27-05-2016;00:10:36;106;37;44;194;0,736;70300
-38,73796667;-72,5875;27-05-2016;00:10:45;107;96;38;200;0,734;69100
-38,73845;-72,5877;27-05-2016;00:10:53;108;56;25;197;0,718;69500
-38,73885;-72,5879;27-05-2016;00:11:02;111;49;19;201;0,66;70000
-38,73895;-72,58795;27-05-2016;00:11:08;111;12;7;206;0,731;68900
-38,7388;-72,58786667;27-05-2016;00:11:16;110;18;8;25;0,826;71200
-38,7388;-72,58785;27-05-2016;00:11:30;108;1;0,3;90;0,705;71200
-38,7391;-72,58798333;27-05-2016;00:11:36;108;35;21;198;0,618;68900
-38,73955;-72,58816667;27-05-2016;00:11:42;109;53;32;198;0,33;70800
-38,7401;-72,58835;27-05-2016;00:11:49;111;63;33;195;0,334;70000
-38,74061667;-72,58851667;27-05-2016;00:11:57;112;60;27;193;0,345;70100
-38,7409;-72,58851667;27-05-2016;00:12:00;112;30;36;182;0,381;70600
-38,74171667;-72,58861667;27-05-2016;00:12:11;111;91;30;185;0,326;70300
-38,74266667;-72,58873333;27-05-2016;00:12:23;108;106;32;186;0,303;70500
-38,74281667;-72,58876667;27-05-2016;00:12:27;109;17;15;190;0,245;72700
-38,74283333;-72,58876667;27-05-2016;00:12:33;109;3;2;171;0,273;72900
-38,7429;-72,58876667;27-05-2016;00:12:53;109;8;1,4;185;0,239;72200
-38,74316667;-72,58885;27-05-2016;00:12:58;110;31;22;191;0,211;70900
-38,74396667;-72,58903333;27-05-2016;00:13:09;112;90;29;191;0,196;72000
-38,74468333;-72,58923333;27-05-2016;00:13:18;111;82;33;192;0,194;71200
-38,74501667;-72,58933333;27-05-2016;00:13:24;109;37;22;193;0,185;73100
-38,7451;-72,58931667;27-05-2016;00:13:29;108;10;7;179;0,21;72800
-38,74511667;-72,58928333;27-05-2016;00:13:31;108;4;8;131;0,172;71300
-38,74505;-72,58891667;27-05-2016;00:13:35;105;33;30;77;0,193;72400
-38,74513333;-72,58833333;27-05-2016;00:13:41;108;51;31;99;0,216;70500
-38,74515;-72,58815;27-05-2016;00:13:45;109;16;14;98;0,235;70800
-38,74516667;-72,5881;27-05-2016;00:13:50;110;6;4;107;0,219;67400
-38,74526667;-72,58805;27-05-2016;00:13:54;110;12;11;164;0,206;70200
-38,74563333;-72,58813333;27-05-2016;00:14:00;111;40;24;190;0,189;69900
-38,74625;-72,58828333;27-05-2016;00:14:07;110;71;37;190;0,183;70800
-38,7468;-72,58836667;27-05-2016;00:14:13;110;61;37;186;0,196;70300
-38,74755;-72,58828333;27-05-2016;00:14:20;107;83;43;176;0,18;71600
-38,74876667;-72,58813333;27-05-2016;00:14:31;104;137;45;174;0,163;70900
-38,75038333;-72,5879;27-05-2016;00:14:45;102;181;47;174;0,161;68500
-38,75098333;-72,58785;27-05-2016;00:14:51;101;66;40;175;0,171;69200
-38,75151667;-72,58786667;27-05-2016;00:14:56;99;59;42;182;0,209;69400
-38,7522;-72,58805;27-05-2016;00:15:03;99;78;40;192;0,211;71000
-38,75258333;-72,58823333;27-05-2016;00:15:08;98;46;33;201;0,232;70700
-38,75285;-72,58841667;27-05-2016;00:15:12;97;35;31;208;0,187;71400
-38,7532;-72,58881667;27-05-2016;00:15:17;94;51;37;223;0,167;70300
-38,75336667;-72,5891;27-05-2016;00:15:20;93;31;37;231;0,212;70200
-38,75366667;-72,58933333;27-05-2016;00:15:24;92;38;34;212;0,192;68700
-38,7539;-72,58946667;27-05-2016;00:15:27;91;29;34;203;0,239;69600
-38,75423333;-72,58985;27-05-2016;00:15:32;90;51;37;223;0,279;69000
-38,7549;-72,59075;27-05-2016;00:15:41;91;108;43;226;0,278;70700
-38,75568333;-72,59165;27-05-2016;00:15:51;93;118;42;222;0,323;69100
-38,7565;-72,59258333;27-05-2016;00:16:01;98;121;44;221;0,388;70100
-38,75728333;-72,5935;27-05-2016;00:16:11;100;118;42;223;0,281;68500
-38,75775;-72,5943;27-05-2016;00:16:18;101;86;44;233;0,443;68600
-38,75825;-72,5953;27-05-2016;00:16:27;103;104;41;237;0,388;67200
-38,75838333;-72,59555;27-05-2016;00:16:31;103;26;23;236;0,373;66200
-38,75851667;-72,59558333;27-05-2016;00:16:35;103;16;15;191;0,371;67000
-38,75868333;-72,59543333;27-05-2016;00:16:38;103;22;26;143;0,358;65000
-38,75921667;-72,5949;27-05-2016;00:16:46;104;75;34;142;0,462;64200
-38,75935;-72,59473333;27-05-2016;00:16:50;105;22;19;138;0,443;67200
-38,75936667;-72,59471667;27-05-2016;00:16:51;106;2;8;148;0,425;66700
-38,75946667;-72,5948;27-05-2016;00:16:55;107;13;11;214;0,337;65100
-38,75948333;-72,59485;27-05-2016;00:16:56;108;5;18;236;0,378;66700
-38,75968333;-72,5953;27-05-2016;00:17:02;110;45;27;240;0,375;65400
-38,76015;-72,5962;27-05-2016;00:17:11;113;94;38;237;0,477;66200
-38,76023333;-72,59635;27-05-2016;00:17:13;113;16;28;234;0,595;65100
-38,76031667;-72,59645;27-05-2016;00:17:17;114;13;12;224;0,496;66900
-38,76043333;-72,59675;27-05-2016;00:17:23;113;28;17;246;0,528;65300
-38,76065;-72,5972;27-05-2016;00:17:28;114;46;33;237;0,591;66100
-38,76103333;-72,59795;27-05-2016;00:17:36;115;77;35;237;0,821;66200
-38,76156667;-72,59898333;27-05-2016;00:17:47;116;108;35;237;0,9;66300
-38,7621;-72,60006667;27-05-2016;00:17:58;116;111;36;237;0,547;66100
-38,76256667;-72,60101667;27-05-2016;00:18:07;117;97;39;238;0,545;64900
-38,7626;-72,6011;27-05-2016;00:18:08;117;8;30;241;0,715;66400
-38,76275;-72,60126667;27-05-2016;00:18:13;116;22;16;222;0,94;65100
-38,7628;-72,60123333;27-05-2016;00:18:15;116;7;13;155;0,968;65100
-38,76308333;-72,6009;27-05-2016;00:18:21;117;42;25;137;0,943;67500
-38,76348333;-72,6004;27-05-2016;00:18:29;120;63;28;136;0,988;67000
-38,76365;-72,60036667;27-05-2016;00:18:35;122;18;11;171;1,17;67100
-38,76373333;-72,60048333;27-05-2016;00:18:39;123;14;13;229;0,975;66800
-38,76395;-72,60095;27-05-2016;00:18:45;125;47;28;238;1,07;66800
-38,7642;-72,60145;27-05-2016;00:18:52;127;52;26;238;0,916;66700
-38,76433333;-72,6017;27-05-2016;00:18:57;126;25;18;235;0,934;66500
-38,76456667;-72,60211667;27-05-2016;00:19:03;124;46;28;234;1,54;67400
-38,76493333;-72,6028;27-05-2016;00:19:11;123;71;32;236;1,77;66400
-38,76513333;-72,60323333;27-05-2016;00:19:18;121;45;23;239;1,77;66500
-38,7653;-72,6036;27-05-2016;00:19:26;116;36;16;238;1,77;66800
-38,76541667;-72,6036;27-05-2016;00:19:32;114;14;8;180;1,73;67000
-38,76553333;-72,60345;27-05-2016;00:19:38;111;18;11;132;1,65;65600
-38,76571667;-72,6031;27-05-2016;00:19:45;108;36;18;124;1,56;66700
-38,76596667;-72,60286667;27-05-2016;00:19:53;107;35;16;143;1,55;66500
-38,76613333;-72,60275;27-05-2016;00:19:59;105;21;13;154;1,19;66700
-38,76626667;-72,60285;27-05-2016;00:20:04;103;17;12;211;1,11;66000
-38,76648333;-72,60323333;27-05-2016;00:20:10;100;41;25;232;0,976;66500
-38,76661667;-72,60348333;27-05-2016;00:20:14;98;25;23;237;0,956;65700
-38,76678333;-72,60356667;27-05-2016;00:20:19;96;21;15;202;0,921;65900
-38,76695;-72,60343333;27-05-2016;00:20:23;95;22;20;148;1,17;66200
-38,76761667;-72,60276667;27-05-2016;00:20:36;90;93;26;142;1,14;64200
-38,76825;-72,60213333;27-05-2016;00:20:49;83;89;25;142;1,02;65200
-38,76843333;-72,60203333;27-05-2016;00:20:53;81;21;19;154;0,787;65000
-38,76846667;-72,60191667;27-05-2016;00:20:57;80;11;10;113;1,21;64800
-38,7684;-72,60146667;27-05-2016;00:21:03;85;40;24;80;0,625;64400
-38,76833333;-72,60073333;27-05-2016;00:21:11;90;64;29;84;0,741;63800
-38,76831667;-72,60023333;27-05-2016;00:21:18;91;44;23;85;0,691;64300
-38,76828333;-72,5993;27-05-2016;00:21:29;92;80;26;88;0,667;62600
-38,7683;-72,59861667;27-05-2016;00:21:38;91;59;24;93;0,668;61900
-38,76826667;-72,59793333;27-05-2016;00:21:46;91;59;27;85;0,676;62600
-38,76821667;-72,59733333;27-05-2016;00:21:52;94;54;32;85;0,767;64300
-38,76818333;-72,59661667;27-05-2016;00:21:59;98;62;32;86;0,575;63600
-38,76818333;-72,59631667;27-05-2016;00:22:04;102;26;18;89;0,538;62500
-38,76818333;-72,5963;27-05-2016;00:22:07;104;3;3;100;0,436;64200
-38,76826667;-72,59628333;27-05-2016;00:22:12;107;10;7;175;0,483;62200
-38,76858333;-72,59641667;27-05-2016;00:22:17;109;37;27;199;0,42;62700
-38,76911667;-72,59661667;27-05-2016;00:22:23;111;61;37;197;0,351;62500
-38,76978333;-72,59695;27-05-2016;00:22:31;112;80;36;201;0,373;64200
-38,77031667;-72,5972;27-05-2016;00:22:38;111;63;33;200;0,359;61000
-38,77066667;-72,59736667;27-05-2016;00:22:42;110;41;37;200;0,606;60600
-38,7712;-72,5974;27-05-2016;00:22:48;109;60;36;184;0,485;61800
-38,77211667;-72,59735;27-05-2016;00:22:58;108;103;37;178;0,488;63600
-38,77275;-72,59746667;27-05-2016;00:23:05;106;71;36;187;0,487;58900
-38,77353333;-72,5977;27-05-2016;00:23:13;103;89;40;193;0,519;58500
-38,77371667;-72,59778333;27-05-2016;00:23:17;102;23;21;198;0,656;58900
-38,7738;-72,59781667;27-05-2016;00:23:19;101;9;16;195;0,754;59400
-38,77421667;-72,59788333;27-05-2016;00:23:25;100;46;28;188;0,795;58400
-38,77516667;-72,59806667;27-05-2016;00:23:37;97;109;33;189;0,894;59300
-38,7758;-72,59816667;27-05-2016;00:23:44;95;71;36;186;1,18;58900
-38,77628333;-72,59811667;27-05-2016;00:23:50;94;53;32;176;0,98;59400
-38,77636667;-72,59811667;27-05-2016;00:23:54;92;9;8;185;0,963;58500
-38,77626667;-72,59815;27-05-2016;00:24:02;91;12;5;350;0,868;59300
-38,77636667;-72,59821667;27-05-2016;00:24:09;88;13;7;211;1,06;59700
-38,77645;-72,59823333;27-05-2016;00:24:17;85;10;5;185;1,24;59200
-38,77646667;-72,59823333;27-05-2016;00:24:24;82;2;1,3;195;1,2;58900
-38,77653333;-72,5983;27-05-2016;00:24:40;77;9;2;218;0,969;59500
-38,7768;-72,59836667;27-05-2016;00:24:44;76;30;27;191;1,12;59300
-38,77743333;-72,59853333;27-05-2016;00:24:51;75;72;37;192;1,14;59900
-38,77798333;-72,59865;27-05-2016;00:24:58;74;61;31;189;1,15;59500
-38,77811667;-72,59865;27-05-2016;00:25:02;74;15;13;182;1,09;59900
-38,77821667;-72,59865;27-05-2016;00:25:11;74;12;5;176;0,685;58800
-38,77825;-72,5986;27-05-2016;00:25:20;75;5;2;118;0,915;57200
-38,77818333;-72,59853333;27-05-2016;00:25:38;78;8;2;37;0,976;57600
-38,77803333;-72,59853333;27-05-2016;00:25:44;80;18;11;2;1,12;58600
-38,77781667;-72,59851667;27-05-2016;00:25:51;82;23;12;5;0,927;54000
-38,7777;-72,5985;27-05-2016;00:25:57;83;13;8;5;0,705;56800
-38,77773333;-72,5985;27-05-2016;00:26:55;84;3;0,2;182;0,657;57900
-38,77763333;-72,59846667;27-05-2016;00:27:02;85;12;6;10;0,707;57200
-38,77733333;-72,59838333;27-05-2016;00:27:07;86;34;25;13;0,703;57700
-38,77665;-72,59823333;27-05-2016;00:27:16;87;77;31;10;0,768;57600
-38,77611667;-72,59811667;27-05-2016;00:27:24;88;60;27;9;0,809;57500
-38,77606667;-72,5981;27-05-2016;00:27:25;88;6;21;18;0,745;57300
-38,77566667;-72,59806667;27-05-2016;00:27:31;89;44;27;3;0,759;57500
-38,77501667;-72,59803333;27-05-2016;00:27:38;90;73;37;2;0,68;57400
-38,77473333;-72,59798333;27-05-2016;00:27:42;90;31;28;8;0,635;56200
-38,77456667;-72,59793333;27-05-2016;00:27:47;91;20;14;11;0,107;56700
-38,77425;-72,59786667;27-05-2016;00:27:53;92;36;21;9;0,097;55500
-38,77383333;-72,59778333;27-05-2016;00:28:00;93;46;24;10;0,059;56600
-38,77376667;-72,59776667;27-05-2016;00:28:03;93;9;11;6;0,055;56200
-38,77375;-72,59781667;27-05-2016;00:28:12;95;5;2;275;0,096;56800
-38,77361667;-72,59776667;27-05-2016;00:28:20;97;15;7;17;0,079;56700
-38,77343333;-72,59768333;27-05-2016;00:28:26;98;22;13;18;0,092;56300
-38,77333333;-72,59763333;27-05-2016;00:28:32;99;12;7;21;0,073;56400
-38,77336667;-72,59765;27-05-2016;00:28:45;100;3;0,7;189;0,081;54500
-38,77446667;-72,59421667;27-05-2016;00:30:50;78;67;40;85;0,114;53900
-38,77425;-72,59346667;27-05-2016;00:30:56;73;69;42;69;0,085;54800
-38,77396667;-72,59245;27-05-2016;00:31:04;66;94;42;70;0,067;54800
-38,7739;-72,59145;27-05-2016;00:31:12;61;87;39;85;0,091;56400
-38,7739;-72,58996667;27-05-2016;00:31:24;53;129;39;90;0,111;55500
-38,77385;-72,58901667;27-05-2016;00:31:32;48;83;37;86;0,114;57600
-38,77363333;-72,5883;27-05-2016;00:31:38;47;66;40;69;0,111;57300
-38,77316667;-72,587;27-05-2016;00:31:48;43;124;45;65;0,1;57100
-38,7729;-72,58633333;27-05-2016;00:31:54;41;66;39;63;0,102;58200
-38,7728;-72,58605;27-05-2016;00:31:58;39;26;24;64;0,093;57400
-38,77276667;-72,58586667;27-05-2016;00:32:01;38;17;20;80;0,073;57000
-38,7727;-72,58555;27-05-2016;00:32:07;36;29;17;74;0,062;57400
-38,77268333;-72,5855;27-05-2016;00:32:08;36;4;14;79;0,06;58300
-38,77281667;-72,58531667;27-05-2016;00:32:12;40;22;20;133;0,088;57400
-38,77326667;-72,58495;27-05-2016;00:32:18;46;60;36;147;0,12;58300
-38,7739;-72,58435;27-05-2016;00:32:26;56;88;39;143;0,084;58400
-38,77455;-72,5838;27-05-2016;00:32:33;59;86;44;147;0,084;57900
-38,77536667;-72,5832;27-05-2016;00:32:41;59;104;47;150;0,078;57700
-38,77651667;-72,5824;27-05-2016;00:32:52;62;146;48;152;0,096;57700
-38,77753333;-72,58176667;27-05-2016;00:33:01;62;127;51;154;0,101;57100
-38,7781;-72,58128333;27-05-2016;00:33:07;64;75;45;147;0,037;58100
-38,77896667;-72,58043333;27-05-2016;00:33:16;68;121;49;142;0,044;57300
-38,78038333;-72,57905;27-05-2016;00:33:30;74;198;51;143;0,069;57300
-38,7813;-72,57815;27-05-2016;00:33:39;76;129;52;143;0,077;57100
-38,78233333;-72,57715;27-05-2016;00:33:49;80;144;52;142;0,133;55600
-38,78333333;-72,5764;27-05-2016;00:33:58;84;130;52;150;0,18;56700
-38,7848;-72,57533333;27-05-2016;00:34:11;89;188;52;151;0,731;57400
-38,78558333;-72,5745;27-05-2016;00:34:19;91;112;50;140;0,739;57100
-38,78581667;-72,57415;27-05-2016;00:34:23;92;40;36;132;0,763;56900
-38,78596667;-72,57396667;27-05-2016;00:34:27;92;23;21;133;0,746;55200
-38,78596667;-72,5739;27-05-2016;00:34:31;92;6;5;95;0,652;55500
-38,78591667;-72,57386667;27-05-2016;00:34:37;92;7;4;25;0,699;55600
-38,78591667;-72,57388333;27-05-2016;00:35:42;92;3;0,1;239;0,754;55100
-38,78578333;-72,57408333;27-05-2016;00:35:48;92;23;14;313;0,995;54800
-38,78556667;-72,57438333;27-05-2016;00:35:52;93;36;32;314;0,624;54300
-38,78518333;-72,57485;27-05-2016;00:35:57;93;59;42;316;0,838;54100
-38,78458333;-72,57551667;27-05-2016;00:36:03;95;88;53;319;0,471;50600
-38,7837;-72,57638333;27-05-2016;00:36:11;96;123;56;322;0,59;50200
-38,78285;-72,57693333;27-05-2016;00:36:18;98;106;55;333;0,274;50500
-38,78186667;-72,57761667;27-05-2016;00:36:27;101;125;50;332;0,238;52800
-38,78078333;-72,57853333;27-05-2016;00:36:38;103;144;47;326;0,335;52800
-38,7799;-72,5793;27-05-2016;00:36:46;104;118;53;326;0,203;52600
-38,77885;-72,58041667;27-05-2016;00:36:56;103;153;55;320;0,406;53400
-38,77785;-72,58155;27-05-2016;00:37:06;102;148;53;318;0,68;53900
-38,77723333;-72,58208333;27-05-2016;00:37:13;101;82;42;326;0,8;52700
-38,7766;-72,58235;27-05-2016;00:37:19;100;74;45;342;0,824;50000
-38,7758;-72,58281667;27-05-2016;00:37:26;98;97;50;336;0,807;50100
-38,77475;-72,5835;27-05-2016;00:37:35;97;132;53;333;0,917;51300
-38,77383333;-72,58421667;27-05-2016;00:37:44;96;119;48;329;1,03;52800
-38,77335;-72,5846;27-05-2016;00:37:50;96;64;38;327;0,97;53400
-38,77275;-72,585;27-05-2016;00:37:59;94;75;30;333;0,925;53300
-38,77263333;-72,58506667;27-05-2016;00:38:03;93;13;12;335;0,874;53700
-38,77266667;-72,58505;27-05-2016;00:38:10;91;3;1,4;146;1,02;50600
-38,7727;-72,58505;27-05-2016;00:38:42;91;5;0,6;194;0,977;50000
-38,77255;-72,58523333;27-05-2016;00:38:48;91;23;14;320;0,824;51500
-38,7722;-72,58553333;27-05-2016;00:38:53;91;47;33;325;0,832;52000
-38,77165;-72,58603333;27-05-2016;00:38:59;91;74;45;325;0,584;50300
-38,77108333;-72,58653333;27-05-2016;00:39:05;91;77;46;325;0,524;48500
-38,77068333;-72,58671667;27-05-2016;00:39:09;91;49;44;341;0,525;51300
-38,76975;-72,58678333;27-05-2016;00:39:17;91;103;46;356;0,456;49300
-38,7685;-72,58681667;27-05-2016;00:39:28;91;141;46;359;0,534;49500
-38,76793333;-72,58688333;27-05-2016;00:39:34;91;62;37;356;0,597;49600
-38,76731667;-72,58703333;27-05-2016;00:39:43;91;71;28;349;0,602;50100
-38,76675;-72,58703333;27-05-2016;00:39:49;91;62;37;0;0,507;49400
-38,76596667;-72,58696667;27-05-2016;00:39:57;91;88;40;4;0,693;49700
-38,76541667;-72,58696667;27-05-2016;00:40:03;92;61;37;0;0,253;49800
-38,7651;-72,5871;27-05-2016;00:40:07;93;38;34;342;0,216;50600
-38,76453333;-72,58766667;27-05-2016;00:40:15;95;80;36;322;0,212;49700
-38,76421667;-72,58803333;27-05-2016;00:40:19;96;47;42;318;0,343;50600
-38,76408333;-72,58833333;27-05-2016;00:40:24;96;30;21;299;0,369;50500
-38,76396667;-72,5887;27-05-2016;00:40:30;96;35;21;292;0,388;50400
-38,76375;-72,5894;27-05-2016;00:40:38;97;66;30;292;0,246;51500
-38,76346667;-72,58991667;27-05-2016;00:40:44;98;55;33;306;0,283;51700
-38,76308333;-72,5905;27-05-2016;00:40:51;99;66;34;310;0,264;51500
-38,7629;-72,59065;27-05-2016;00:40:54;100;24;29;328;0,276;50500
-38,7626;-72,59073333;27-05-2016;00:40:58;101;35;31;347;0,185;49600
-38,7618;-72,59073333;27-05-2016;00:41:07;104;89;36;0;0,164;50700
-38,76135;-72,59086667;27-05-2016;00:41:13;105;51;31;347;0,344;49800
-38,76083333;-72,59105;27-05-2016;00:41:20;106;59;30;343;0,235;50200
-38,76021667;-72,59128333;27-05-2016;00:41:26;106;72;43;344;0,286;50000
-38,75973333;-72,5915;27-05-2016;00:41:31;105;57;41;342;0,225;49600
-38,75943333;-72,59178333;27-05-2016;00:41:35;105;42;38;323;0,289;49700
-38,75913333;-72,59226667;27-05-2016;00:41:41;105;53;32;309;0,63;48800
-38,75893333;-72,59233333;27-05-2016;00:41:46;104;22;16;342;0,699;49800
-38,75863333;-72,59215;27-05-2016;00:41:51;105;37;27;26;0,696;49900
-38,75821667;-72,59198333;27-05-2016;00:41:57;105;49;30;16;0,768;49700
-38,75771667;-72,59168333;27-05-2016;00:42:03;104;61;37;25;0,859;50000
-38,75683333;-72,59115;27-05-2016;00:42:13;103;109;39;26;0,798;49300
-38,75638333;-72,59083333;27-05-2016;00:42:19;103;57;34;29;0,811;47900
-38,75621667;-72,5907;27-05-2016;00:42:22;102;23;27;30;0,89;48600
-38,75596667;-72,59073333;27-05-2016;00:42:27;102;27;19;354;0,917;48400
-38,75591667;-72,59078333;27-05-2016;00:42:28;102;8;28;322;0,913;48700
-38,75555;-72,5913;27-05-2016;00:42:35;102;60;31;312;0,688;48600
-38,75546667;-72,59145;27-05-2016;00:42:38;102;16;19;303;0,786;48500
-38,75531667;-72,59141667;27-05-2016;00:42:43;101;18;13;7;0,76;47200
-38,75493333;-72,59105;27-05-2016;00:42:49;99;53;32;38;0,699;48300
-38,75441667;-72,59036667;27-05-2016;00:42:55;99;83;50;46;0,685;48100
-38,75368333;-72,58931667;27-05-2016;00:43:04;97;123;49;48;0,738;45800
-38,75326667;-72,5889;27-05-2016;00:43:10;96;57;34;38;0,78;45300
-38,7529;-72,58848333;27-05-2016;00:43:17;95;56;29;41;0,688;46900
-38,75255;-72,58825;27-05-2016;00:43:23;93;44;26;27;0,893;45700
-38,75198333;-72,58795;27-05-2016;00:43:30;93;68;35;23;0,878;47300
-38,75143333;-72,58778333;27-05-2016;00:43:36;93;62;37;13;0,864;46700
-38,75073333;-72,58781667;27-05-2016;00:43:43;93;78;40;358;0,811;45600
-38,74978333;-72,58796667;27-05-2016;00:43:52;94;107;43;353;0,679;46000
-38,74856667;-72,58815;27-05-2016;00:44:02;94;136;49;353;0,585;45900
-38,74738333;-72,58831667;27-05-2016;00:44:12;95;131;47;354;0,434;45900
-38,74668333;-72,5884;27-05-2016;00:44:19;94;78;40;354;0,423;44800
-38,74631667;-72,58831667;27-05-2016;00:44:24;94;42;30;9;0,438;45600
-38,74573333;-72,58816667;27-05-2016;00:44:30;95;66;40;12;0,419;43600
-38,7453;-72,58806667;27-05-2016;00:44:35;96;50;36;10;0,344;45000
-38,74516667;-72,58803333;27-05-2016;00:44:38;97;15;18;12;0,335;45400
-38,74515;-72,58783333;27-05-2016;00:44:42;97;18;16;84;0,339;45700
-38,74528333;-72,58701667;27-05-2016;00:44:51;98;72;29;102;0,333;45800
-38,7453;-72,58673333;27-05-2016;00:44:56;97;25;18;94;0,333;45000
-38,7453;-72,58665;27-05-2016;00:44:59;97;8;9;86;0,339;45700
-38,74543333;-72,58666667;27-05-2016;00:45:06;97;15;8;188;0,255;45300
-38,74548333;-72,58668333;27-05-2016;00:45:08;97;7;13;194;0,259;45100
-38,74583333;-72,58678333;27-05-2016;00:45:14;97;39;23;194;0,265;45200
-38,74625;-72,58691667;27-05-2016;00:45:20;96;48;29;193;0,231;42800
-38,74643333;-72,58698333;27-05-2016;00:45:25;95;21;15;195;0,187;44000
-38,74641667;-72,58703333;27-05-2016;00:45:43;94;5;0,9;272;0,177;43600
-38,74628333;-72,58695;27-05-2016;00:45:48;93;17;12;22;0,173;43600
-38,74621667;-72,58693333;27-05-2016;00:45:49;92;8;27;13;0,175;44700
-38,74558333;-72,5868;27-05-2016;00:45:57;90;71;32;10;0,122;44300
-38,7454;-72,58678333;27-05-2016;00:46:01;89;21;19;5;0,138;45000
-38,74535;-72,58675;27-05-2016;00:46:03;89;6;10;19;0,187;45600
-38,74535;-72,58653333;27-05-2016;00:46:07;89;19;17;91;0,235;45400
-38,74555;-72,58561667;27-05-2016;00:46:16;89;83;33;105;0,254;45600
-38,7456;-72,58535;27-05-2016;00:46:20;89;24;22;107;0,309;46000
-38,74563333;-72,58515;27-05-2016;00:46:28;90;18;8;100;0,338;45800
-38,7457;-72,58478333;27-05-2016;00:46:33;90;32;23;103;0,388;45000
-38,74576667;-72,5841;27-05-2016;00:46:41;91;60;27;97;0,274;45900
-38,74578333;-72,58396667;27-05-2016;00:46:45;91;13;12;96;0,28;46500
-38,74578333;-72,58391667;27-05-2016;00:46:54;91;4;2;105;0,372;46000
-38,74581667;-72,58363333;27-05-2016;00:46:59;91;25;18;99;0,385;46000
-38,7459;-72,58306667;27-05-2016;00:47:05;92;49;29;99;0,384;46000
-38,74596667;-72,58241667;27-05-2016;00:47:12;94;57;29;98;0,443;45300
-38,7461;-72,58178333;27-05-2016;00:47:20;95;58;26;106;0,723;45700
-38,74615;-72,58165;27-05-2016;00:47:24;95;12;11;117;0,673;44600
-38,74621667;-72,5815;27-05-2016;00:47:31;97;16;8;117;0,607;44900
-38,74628333;-72,58116667;27-05-2016;00:47:36;97;30;22;106;0,607;45100
-38,74641667;-72,58053333;27-05-2016;00:47:43;96;57;29;104;0,641;44900
-38,74643333;-72,58038333;27-05-2016;00:47:47;97;14;12;100;0,606;45300
-38,74648333;-72,58021667;27-05-2016;00:47:52;96;14;10;109;0,593;45000
-38,74655;-72,5799;27-05-2016;00:47:56;96;29;26;107;0,631;45200
-38,7467;-72,57915;27-05-2016;00:48:04;96;68;31;105;0,67;45300
-38,74673333;-72,579;27-05-2016;00:48:06;97;13;24;103;0,673;45300
-38,74666667;-72,57883333;27-05-2016;00:48:10;97;16;15;59;0,788;44800
-38,7466;-72,57881667;27-05-2016;00:48:11;97;6;23;17;0,797;45500
-38,74606667;-72,57868333;27-05-2016;00:48:18;96;62;32;10;0,713;44600
-38,74555;-72,57856667;27-05-2016;00:48:25;96;58;30;10;0,664;45000
-38,74545;-72,57855;27-05-2016;00:48:30;96;11;8;10;0,657;45100
-38,74518333;-72,57848333;27-05-2016;00:48:36;97;30;18;10;0,724;45400
-38,7447;-72,57835;27-05-2016;00:48:43;97;56;29;11;0,744;45200
-38,74455;-72,57833333;27-05-2016;00:48:47;98;16;14;7;0,741;45100
-38,74441667;-72,5783;27-05-2016;00:48:53;99;16;10;13;0,729;45100
-38,74411667;-72,5782;27-05-2016;00:48:58;99;34;25;15;0,709;44400
-38,74366667;-72,57808333;27-05-2016;00:49:05;99;51;26;11;0,75;44400
-38,7436;-72,57808333;27-05-2016;00:49:08;98;7;9;356;0,955;45300
-38,74346667;-72,57836667;27-05-2016;00:49:15;97;29;15;300;0,77;44200
-38,7434;-72,5789;27-05-2016;00:49:21;97;47;28;280;0,755;45000
-38,74333333;-72,57938333;27-05-2016;00:49:27;97;43;26;278;0,738;45000
-38,74328333;-72,57975;27-05-2016;00:49:34;96;33;17;283;0,845;45000
-38,74315;-72,58035;27-05-2016;00:49:41;96;53;27;285;0,962;45200
-38,74313333;-72,5805;27-05-2016;00:49:43;96;13;24;284;0,852;44100
-38,7431;-72,58073333;27-05-2016;00:49:49;95;20;12;276;0,69;44600
-38,74305;-72,58101667;27-05-2016;00:49:54;95;26;19;285;0,679;45200
-38,74291667;-72,58161667;27-05-2016;00:50:02;94;55;25;286;0,721;44600
-38,74278333;-72,58233333;27-05-2016;00:50:10;93;63;28;282;0,779;44500
-38,7427;-72,58316667;27-05-2016;00:50:19;91;74;29;277;0,747;44700
-38,7427;-72,5834;27-05-2016;00:50:24;91;20;15;272;0,78;44300
-38,74265;-72,58375;27-05-2016;00:50:30;89;31;18;281;0,658;43700
-38,74253333;-72,58438333;27-05-2016;00:50:37;88;56;29;284;0,633;42700
-38,74245;-72,58505;27-05-2016;00:50:45;88;59;26;278;0,474;43800
-38,74236667;-72,58545;27-05-2016;00:50:52;86;36;19;285;0,335;43600
-38,74233333;-72,58555;27-05-2016;00:50:57;86;9;7;296;0,339;43500
-38,7423;-72,5855;27-05-2016;00:51:07;86;5;2;50;0,297;43700
-38,74238333;-72,58531667;27-05-2016;00:51:13;86;19;11;117;0,381;43700
-38,74238333;-72,58525;27-05-2016;00:51:14;86;6;21;102;0,382;43600
-38,74246667;-72,58461667;27-05-2016;00:51:21;86;55;28;99;0,383;43500
-38,74263333;-72,5837;27-05-2016;00:51:31;87;82;29;103;0,418;43100
-38,74268333;-72,58336667;27-05-2016;00:51:36;87;29;21;100;0,5;43200
-38,74266667;-72,58328333;27-05-2016;00:51:40;88;8;7;84;0,534;43800
-38,74255;-72,5832;27-05-2016;00:51:44;88;15;14;26;0,537;43900
-38,7421;-72,5831;27-05-2016;00:51:51;88;51;26;11;0,535;44000
-38,7418;-72,58301667;27-05-2016;00:51:57;88;34;21;12;0,47;42200
-38,74161667;-72,58298333;27-05-2016;00:52:03;88;21;12;8;0,454;43400
-38,74145;-72,58295;27-05-2016;00:52:09;89;18;11;11;0,478;42900
-38,74131667;-72,5829;27-05-2016;00:52:12;89;17;20;14;0,491;42800
-38,74105;-72,58265;27-05-2016;00:52:18;91;35;21;36;0,495;42900
-38,74098333;-72,58248333;27-05-2016;00:52:20;91;17;31;60;0,505;42600
-38,7406;-72,58151667;27-05-2016;00:52:29;91;93;37;63;0,449;42200
-38,74;-72,58043333;27-05-2016;00:52:41;92;116;35;56;0,415;42200
-38,73991667;-72,58021667;27-05-2016;00:52:45;91;21;19;61;0,42;41200
-38,7399;-72,58018333;27-05-2016;00:52:48;92;3;4;65;0,409;40700
-38,7398;-72,5803;27-05-2016;00:52:54;92;15;9;316;0,353;40200
-38,73978333;-72,58036667;27-05-2016;00:52:55;92;7;24;292;0,378;41000
-38,7397;-72,5809;27-05-2016;00:53:00;92;47;34;282;0,369;41000
-38,73961667;-72,5819;27-05-2016;00:53:08;92;88;40;276;0,353;41300
-38,73955;-72,58233333;27-05-2016;00:53:13;93;37;27;281;0,18;40800
-38,7395;-72,58273333;27-05-2016;00:53:21;95;36;16;278;0,242;41800
-38,73945;-72,58318333;27-05-2016;00:53:26;96;39;28;278;0,3;41800
-38,73943333;-72,58363333;27-05-2016;00:53:32;98;39;23;274;0,359;41300
-38,73945;-72,58373333;27-05-2016;00:53:37;99;8;6;257;0,346;40700
-38,73943333;-72,58368333;27-05-2016;00:53:45;99;5;2;64;0,312;40900
-38,7394;-72,58396667;27-05-2016;00:53:51;100;25;15;277;0,399;41400
-38,73933333;-72,5845;27-05-2016;00:53:56;101;46;33;279;0,52;42000
-38,73925;-72,58495;27-05-2016;00:54:01;101;41;29;283;0,416;42100
-38,73911667;-72,58513333;27-05-2016;00:54:06;101;20;15;312;0,383;42000
-38,73848333;-72,58568333;27-05-2016;00:54:29;100;87;14;327;0,316;42200
-38,73886667;-72,58636667;27-05-2016;00:54:38;101;74;30;234;0,331;42200
-38,73886667;-72,58736667;27-05-2016;00:54:47;101;86;35;270;0,35;40700
-38,73886667;-72,58743333;27-05-2016;00:54:48;101;6;21;274;0,335;41900
-38,73893333;-72,58773333;27-05-2016;00:54:54;101;28;17;254;0,305;40900
-38,73895;-72,58778333;27-05-2016;00:54:59;99;5;3;245;0,272;41400
-38,73895;-72,58778333;27-05-2016;00:55:08;99;1;0,3;54;0,232;41100
-38,73881667;-72,58785;27-05-2016;00:55:15;101;15;8;334;0,271;41100
-38,73881667;-72,5879;27-05-2016;00:55:16;101;4;14;284;0,37;41100
-38,73878333;-72,58841667;27-05-2016;00:55:24;102;45;20;275;0,376;40800
-38,73871667;-72,58911667;27-05-2016;00:55:33;100;62;25;277;0,361;39900
-38,73865;-72,58988333;27-05-2016;00:55:41;99;67;30;276;0,381;40200
-38,73856667;-72,59033333;27-05-2016;00:55:47;98;40;24;284;0,394;40300
-38,73848333;-72,59048333;27-05-2016;00:55:52;98;16;11;302;0,406;40000
-38,73795;-72,59836667;27-05-2016;00:57:36;97;61;9;251;0,422;39500
-38,73903333;-72,60075;27-05-2016;00:57:45;92;239;95;240;0,445;40000
-38,73988333;-72,60226667;27-05-2016;00:57:56;91;163;53;234;0,509;39900
-38,74048333;-72,60311667;27-05-2016;00:58:03;91;99;51;227;0,522;40600
-38,74093333;-72,60355;27-05-2016;00:58:07;97;62;56;217;0,514;39800
-38,74125;-72,60381667;27-05-2016;00:58:12;98;42;30;215;0,489;40600
-38,74156667;-72,60411667;27-05-2016;00:58:19;98;44;23;215;0,5;40400
-38,7419;-72,60448333;27-05-2016;00:58:25;101;49;30;222;0,69;40200
-38,74235;-72,60506667;27-05-2016;00:58:32;100;71;37;225;0,66;40500
-38,74293333;-72,60588333;27-05-2016;00:58:40;100;96;43;227;0,659;39700
-38,74365;-72,60685;27-05-2016;00:58:49;100;115;46;226;0,652;40000
-38,74435;-72,6078;27-05-2016;00:58:58;99;115;46;227;0,654;40400
-38,74453333;-72,60805;27-05-2016;00:59:02;99;30;27;227;0,621;40700
-38,74466667;-72,60826667;27-05-2016;00:59:08;100;24;14;233;0,651;40600
-38,74475;-72,6084;27-05-2016;00:59:15;101;15;8;230;0,646;40000
-38,74478333;-72,60855;27-05-2016;00:59:19;102;13;12;255;0,707;39900
-38,7447;-72,60893333;27-05-2016;00:59:24;102;34;25;287;0,708;40900
-38,74446667;-72,60975;27-05-2016;00:59:31;102;75;39;290;0,565;40700
-38,74431667;-72,61041667;27-05-2016;00:59:37;102;60;36;286;0,517;41000
-38,74418333;-72,61091667;27-05-2016;00:59:43;103;47;28;288;0,547;40900
-38,74403333;-72,6115;27-05-2016;00:59:49;103;53;32;290;0,402;40300
-38,74405;-72,61201667;27-05-2016;00:59:55;103;45;27;266;0,432;40200
-38,74421667;-72,61273333;27-05-2016;01:00:01;103;65;39;255;0,475;40800
-38,74443333;-72,61358333;27-05-2016;01:00:08;103;78;40;252;0,475;40400
-38,74456667;-72,6142;27-05-2016;01:00:15;104;56;29;254;0,483;46600
-38,74473333;-72,615;27-05-2016;01:00:22;104;72;37;256;0,464;40000
-38,74508333;-72,61646667;27-05-2016;01:00:34;104;133;40;253;0,441;40400
-38,7452;-72,61691667;27-05-2016;01:00:39;105;41;30;250;0,463;41100
-38,74525;-72,61705;27-05-2016;01:00:44;106;13;10;245;0,629;40800
-38,74551667;-72,61703333;27-05-2016;01:00:49;105;28;21;178;0,614;40800
-38,74603333;-72,61715;27-05-2016;01:00:56;105;60;31;189;0,557;41300
-38,74618333;-72,61718333;27-05-2016;01:01:00;105;16;14;190;0,553;40600
-38,74621667;-72,61715;27-05-2016;01:01:02;105;5;9;145;0,542;40700
-38,7462;-72,61705;27-05-2016;01:01:09;105;9;5;78;0,585;40600
-38,7462;-72,61701667;27-05-2016;01:01:17;106;2;1;68;0,708;40900
-38,7462;-72,61706667;27-05-2016;01:01:28;108;5;1,5;255;0,645;40200
-38,74621667;-72,61705;27-05-2016;01:01:34;110;3;2;139;0,613;41100
-38,74621667;-72,61706667;27-05-2016;01:02:04;110;2;0,2;310;0,629;40800
-38,74618333;-72,61708333;27-05-2016;01:02:11;110;5;2;334;0,598;40900
-38,74618333;-72,61708333;27-05-2016;01:02:25;110;1;0,3;110;0,539;40600
-38,7462;-72,61696667;27-05-2016;01:02:30;109;10;7;103;0,637;40100
-38,74611667;-72,61685;27-05-2016;01:02:36;108;14;8;46;0,606;39400
-38,74611667;-72,61663333;27-05-2016;01:02:40;107;19;17;91;0,637;40100
-38,74626667;-72,61591667;27-05-2016;01:02:48;105;64;29;105;0,604;40200
-38,7463;-72,61573333;27-05-2016;01:02:52;105;16;15;103;0,55;39900
-38,74636667;-72,61548333;27-05-2016;01:02:57;104;23;17;112;0,575;39400
-38,74645;-72,61515;27-05-2016;01:03:03;103;31;19;105;0,587;40300
-38,74645;-72,61511667;27-05-2016;01:03:04;103;3;11;97;0,575;40100
-38,74633333;-72,615;27-05-2016;01:03:09;101;16;12;35;0,042;40100
-38,74595;-72,61486667;27-05-2016;01:03:16;97;43;22;16;0,032;40500
