﻿Latitud;Longitud;Fecha;Hora;Altitud;Profundidad;Velocidad;Referencia;Dust-Track;P-Track
-38,74968333;-72,61543333;01-07-2016;20:39:11;101;12;15;103;1,18;82200
-38,7496;-72,6153;01-07-2016;20:39:16;101;15;11;50;1,14;82500
-38,74956667;-72,61528333;01-07-2016;20:39:17;101;5;18;26;1,15;82500
-38,74918333;-72,6151;01-07-2016;20:39:25;101;45;20;19;1,28;86200
-38,74885;-72,61495;01-07-2016;20:39:32;102;39;20;21;1,45;87800
-38,74851667;-72,61486667;01-07-2016;20:39:37;103;37;27;11;1,48;90700
-38,74818333;-72,61498333;01-07-2016;20:39:42;103;39;28;345;1,34;91300
-38,74793333;-72,61506667;01-07-2016;20:39:47;104;28;20;346;1,34;85100
-38,74785;-72,61498333;01-07-2016;20:39:49;104;12;22;35;1,31;85900
-38,74763333;-72,61476667;01-07-2016;20:39:56;105;30;16;37;1,33;83500
-38,7475;-72,61466667;01-07-2016;20:40:04;106;18;8;32;1,44;90900
-38,74733333;-72,6145;01-07-2016;20:40:08;107;24;21;38;1,51;96600
-38,74678333;-72,61396667;01-07-2016;20:40:17;109;76;30;36;1,6;105000
-38,7462;-72,61353333;01-07-2016;20:40:25;111;75;34;31;1,64;99600
-38,74601667;-72,6135;01-07-2016;20:40:29;112;21;19;5;1,69;99700
-38,74591667;-72,61368333;01-07-2016;20:40:33;113;18;17;306;1,76;104000
-38,74576667;-72,61431667;01-07-2016;20:40:40;114;58;30;286;1,54;109000
-38,74573333;-72,61461667;01-07-2016;20:40:44;115;26;24;279;1,53;103000
-38,7457;-72,61486667;01-07-2016;20:40:49;115;21;15;282;1,47;106000
-38,74556667;-72,61536667;01-07-2016;20:40:57;116;46;21;290;1,49;108000
-38,74555;-72,61546667;01-07-2016;20:41:03;117;10;6;280;1,59;109000
-38,74558333;-72,61561667;01-07-2016;20:41:54;116;12;0,9;251;1,48;106000
-38,74558333;-72,61573333;01-07-2016;20:42:00;115;11;7;272;1,61;106000
-38,74555;-72,61595;01-07-2016;20:42:04;115;19;17;278;1,41;106000
-38,74543333;-72,61651667;01-07-2016;20:42:11;114;51;26;285;1,42;111000
-38,7455;-72,61671667;01-07-2016;20:42:15;114;19;17;249;1,47;113000
-38,74553333;-72,61673333;01-07-2016;20:42:16;114;5;17;198;1,47;113000
-38,74588333;-72,61683333;01-07-2016;20:42:24;113;40;18;192;1,37;112000
-38,74618333;-72,6169;01-07-2016;20:42:32;113;33;15;191;1,26;104000
-38,74625;-72,61695;01-07-2016;20:42:35;112;9;11;208;1,23;103000
-38,74625;-72,61706667;01-07-2016;20:42:42;113;10;5;270;1,33;104000
-38,74625;-72,61706667;01-07-2016;20:42:57;113;0;0,1;250;1,38;109000
-38,74631667;-72,61715;01-07-2016;20:43:02;112;10;8;225;1,3;114000
-38,74661667;-72,61726667;01-07-2016;20:43:11;111;34;14;196;1,28;108000
-38,74683333;-72,61736667;01-07-2016;20:43:16;111;25;18;200;1,27;107000
-38,74736667;-72,61758333;01-07-2016;20:43:25;109;62;25;198;1,23;116000
-38,74756667;-72,61766667;01-07-2016;20:43:30;107;24;18;197;1,25;104000
-38,74778333;-72,61773333;01-07-2016;20:43:38;105;25;11;194;1,19;116000
-38,74806667;-72,61783333;01-07-2016;20:43:43;104;32;23;196;1,18;115000
-38,7485;-72,618;01-07-2016;20:43:49;103;51;31;196;1,12;104000
-38,74873333;-72,61815;01-07-2016;20:43:53;102;28;25;206;1,09;103000
-38,74911667;-72,61856667;01-07-2016;20:43:59;101;56;34;220;1,14;83100
-38,74955;-72,619;01-07-2016;20:44:05;101;61;37;217;1,13;78500
-38,74981667;-72,61913333;01-07-2016;20:44:09;101;31;28;202;1,05;89700
-38,74995;-72,61923333;01-07-2016;20:44:13;101;17;15;213;1,11;90100
-38,74996667;-72,61928333;01-07-2016;20:44:15;101;6;10;244;1,16;84900
-38,74995;-72,61953333;01-07-2016;20:44:19;101;22;20;274;1,14;81800
-38,74976667;-72,62026667;01-07-2016;20:44:26;102;66;34;289;1,19;82100
-38,74948333;-72,6213;01-07-2016;20:44:34;101;96;43;289;1,36;79900
-38,74913333;-72,62268333;01-07-2016;20:44:44;100;126;45;288;1,35;81200
-38,74891667;-72,6236;01-07-2016;20:44:51;101;83;43;288;1,61;173000
-38,74866667;-72,62451667;01-07-2016;20:44:58;101;84;43;289;1,93;112000
-38,74831667;-72,62583333;01-07-2016;20:45:08;101;121;43;289;2,38;133000
-38,7482;-72,6263;01-07-2016;20:45:13;101;43;31;287;2,13;129000
-38,74813333;-72,62653333;01-07-2016;20:45:18;100;21;15;288;2,26;130000
-38,74805;-72,62685;01-07-2016;20:45:23;100;30;21;288;2,31;129000
-38,7479;-72,62751667;01-07-2016;20:45:30;99;60;31;287;2,12;138000
-38,74771667;-72,62836667;01-07-2016;20:45:38;97;77;35;286;2,05;128000
-38,74758333;-72,62895;01-07-2016;20:45:44;95;52;31;285;2,13;128000
-38,74738333;-72,62941667;01-07-2016;20:45:50;94;47;28;299;2,34;132000
-38,74695;-72,63008333;01-07-2016;20:45:57;93;76;39;310;2,28;128000
-38,74641667;-72,63096667;01-07-2016;20:46:05;93;97;44;308;2;130000
-38,74576667;-72,632;01-07-2016;20:46:14;92;115;46;309;2,15;127000
-38,74536667;-72,63258333;01-07-2016;20:46:20;92;67;40;310;2,3;125000
-38,7451;-72,63298333;01-07-2016;20:46:26;92;46;28;310;2,03;129000
-38,74496667;-72,63318333;01-07-2016;20:46:31;92;23;16;311;2,18;127000
-38,74491667;-72,6333;01-07-2016;20:46:35;92;12;11;307;2,23;126000
-38,74478333;-72,63328333;01-07-2016;20:46:39;92;15;13;6;2,32;130000
-38,74473333;-72,63323333;01-07-2016;20:46:40;92;6;22;39;2,33;130000
-38,74436667;-72,63281667;01-07-2016;20:46:46;93;55;33;42;2,28;132000
-38,74378333;-72,63215;01-07-2016;20:46:53;93;86;44;42;2,36;131000
-38,7429;-72,63115;01-07-2016;20:47:03;93;132;48;41;2,37;136000
-38,74253333;-72,63095;01-07-2016;20:47:08;93;45;32;22;2,53;132000
-38,7424;-72,6309;01-07-2016;20:47:12;93;15;13;16;2,59;131000
-38,74238333;-72,6309;01-07-2016;20:47:18;93;2;1,5;23;2,38;140000
-38,74228333;-72,63086667;01-07-2016;20:47:24;93;11;7;13;2,39;132000
-38,74198333;-72,63075;01-07-2016;20:47:29;94;34;25;16;2,37;143000
-38,74153333;-72,63058333;01-07-2016;20:47:34;95;53;38;16;2,32;134000
-38,74076667;-72,6303;01-07-2016;20:47:41;96;89;46;16;2,21;132000
-38,73976667;-72,62993333;01-07-2016;20:47:49;98;115;52;16;1,97;130000
-38,73915;-72,6297;01-07-2016;20:47:55;98;73;44;16;2,02;128000
-38,73888333;-72,6296;01-07-2016;20:47:59;98;30;27;17;2;125000
-38,73873333;-72,62953333;01-07-2016;20:48:04;97;19;13;18;2,09;124000
-38,73868333;-72,62953333;01-07-2016;20:48:10;98;5;3;15;2,17;130000
-38,7386;-72,6295;01-07-2016;20:48:44;98;10;1;16;2,03;159000
-38,73836667;-72,6294;01-07-2016;20:48:49;98;27;19;17;2,13;136000
-38,73803333;-72,62926667;01-07-2016;20:48:54;98;40;29;17;2,09;174000
-38,7373;-72,62898333;01-07-2016;20:49:02;99;85;38;17;2,01;161000
-38,73653333;-72,6287;01-07-2016;20:49:09;99;88;45;16;1,98;171000
-38,7358;-72,62843333;01-07-2016;20:49:16;99;85;44;16;2,01;143000
-38,73541667;-72,6283;01-07-2016;20:49:21;100;45;32;16;1,95;140000
-38,73526667;-72,62823333;01-07-2016;20:49:25;100;18;16;15;2,2;129000
-38,73525;-72,62823333;01-07-2016;20:49:30;100;2;2;14;2,19;142000
-38,73515;-72,6282;01-07-2016;20:50:08;100;10;1;14;1,56;145000
-38,7349;-72,62811667;01-07-2016;20:50:13;100;30;21;16;1,6;152000
-38,73436667;-72,62791667;01-07-2016;20:50:19;101;62;37;16;1,55;150000
-38,73331667;-72,62751667;01-07-2016;20:50:29;102;122;44;16;1,48;133000
-38,73216667;-72,62708333;01-07-2016;20:50:40;102;133;44;16;1,51;123000
-38,73125;-72,62675;01-07-2016;20:50:50;102;105;38;16;1,56;114000
-38,73083333;-72,62658333;01-07-2016;20:50:56;101;48;29;17;1,5;112000
-38,7307;-72,62653333;01-07-2016;20:51:01;101;16;12;17;1,59;112000
-38,7307;-72,62653333;01-07-2016;20:51:10;101;0;0,2;14;1,59;127000
-38,7306;-72,6265;01-07-2016;20:51:20;101;11;4;17;1,4;118000
-38,73035;-72,6264;01-07-2016;20:51:25;101;28;20;16;1,33;123000
-38,73005;-72,62643333;01-07-2016;20:51:30;101;35;25;356;1,28;138000
-38,72956667;-72,62651667;01-07-2016;20:51:36;101;53;32;351;1,33;149000
-38,72873333;-72,62671667;01-07-2016;20:51:46;104;94;34;350;1,17;126000
-38,72838333;-72,6267;01-07-2016;20:51:50;106;39;35;2;1,18;112000
-38,7277;-72,62648333;01-07-2016;20:51:58;107;79;35;13;1,37;108000
-38,7271;-72,6263;01-07-2016;20:52:06;105;70;32;14;1,48;142000
-38,7269;-72,62623333;01-07-2016;20:52:10;104;23;20;14;1,49;144000
-38,72683333;-72,6262;01-07-2016;20:52:15;103;8;6;16;1,51;144000
-38,72675;-72,62618333;01-07-2016;20:52:35;103;9;2;11;1,51;111000
-38,72668333;-72,62615;01-07-2016;20:52:37;103;9;16;16;1,46;129000
-38,72648333;-72,62621667;01-07-2016;20:52:42;103;21;15;348;1,61;140000
-38,72645;-72,62641667;01-07-2016;20:52:45;103;18;22;286;1,41;99500
-38,72641667;-72,62708333;01-07-2016;20:52:52;103;58;30;273;1,1;95500
-38,72626667;-72,6277;01-07-2016;20:52:58;103;57;34;286;1,05;83800
-38,72588333;-72,62853333;01-07-2016;20:53:06;103;84;38;301;0,999;75700
-38,72555;-72,62923333;01-07-2016;20:53:12;102;72;43;301;0,91;76100
-38,72538333;-72,62985;01-07-2016;20:53:17;103;57;41;289;0,9;83000
-38,72525;-72,63053333;01-07-2016;20:53:23;104;61;36;284;0,886;71700
-38,72516667;-72,63106667;01-07-2016;20:53:30;109;47;24;283;0,826;119000
-38,72511667;-72,63133333;01-07-2016;20:53:35;113;24;17;280;0,917;145000
-38,72506667;-72,6317;01-07-2016;20:53:40;115;33;24;281;0,832;165000
-38,72503333;-72,63186667;01-07-2016;20:53:42;116;15;28;288;0,709;186000
-38,72478333;-72,63226667;01-07-2016;20:53:48;119;45;27;308;0,724;181000
-38,72465;-72,63245;01-07-2016;20:53:53;122;20;15;312;0,71;112000
-38,72465;-72,63245;01-07-2016;20:54:02;124;0;0,1;237;0,756;63700
-38,72458333;-72,63256667;01-07-2016;20:54:07;124;12;9;309;0,838;67400
-38,72435;-72,63291667;01-07-2016;20:54:15;125;41;19;310;1,04;118000
-38,7241;-72,63331667;01-07-2016;20:54:23;127;44;20;309;0,988;129000
-38,7239;-72,63368333;01-07-2016;20:54:30;128;39;20;306;1,11;122000
-38,7236;-72,63423333;01-07-2016;20:54:38;131;58;26;305;1,14;138000
-38,72331667;-72,63481667;01-07-2016;20:54:45;132;59;30;301;1,25;124000
-38,72306667;-72,63541667;01-07-2016;20:54:51;132;59;35;298;1,27;116000
-38,72281667;-72,63623333;01-07-2016;20:54:58;132;76;39;291;1,09;96200
-38,72273333;-72,63688333;01-07-2016;20:55:04;133;58;35;279;1,11;105000
-38,7227;-72,63753333;01-07-2016;20:55:11;133;56;29;274;1,05;103000
-38,72268333;-72,63788333;01-07-2016;20:55:17;133;30;18;275;1,27;94100
-38,72266667;-72,63793333;01-07-2016;20:55:21;134;6;5;286;1,24;103000
-38,72266667;-72,63803333;01-07-2016;20:55:26;134;8;6;270;0,861;99200
-38,72266667;-72,63835;01-07-2016;20:55:33;135;28;14;272;0,92;86800
-38,72266667;-72,6387;01-07-2016;20:55:37;135;30;27;271;0,852;130000
-38,72261667;-72,63955;01-07-2016;20:55:45;136;74;33;274;0,804;137000
-38,72251667;-72,64033333;01-07-2016;20:55:52;137;70;36;278;0,755;136000
-38,72226667;-72,64155;01-07-2016;20:56:02;140;109;39;285;0,62;114000
-38,72201667;-72,6425;01-07-2016;20:56:10;143;87;39;288;0,624;124000
-38,72186667;-72,64331667;01-07-2016;20:56:17;145;73;38;283;0,466;129000
-38,72171667;-72,64386667;01-07-2016;20:56:22;147;52;37;290;0,439;74200
-38,7214;-72,64443333;01-07-2016;20:56:29;149;60;31;305;0,497;79300
-38,72091667;-72,64511667;01-07-2016;20:56:38;153;80;32;313;0,412;130000
-38,7206;-72,64553333;01-07-2016;20:56:44;155;50;30;313;0,416;134000
-38,72041667;-72,64585;01-07-2016;20:56:50;157;33;20;308;0,491;118000
-38,7202;-72,64623333;01-07-2016;20:56:57;157;42;21;306;0,372;79200
-38,71995;-72,6467;01-07-2016;20:57:04;156;49;25;305;0,592;66800
-38,71946667;-72,64755;01-07-2016;20:57:16;155;91;27;305;0,907;95100
-38,71911667;-72,64818333;01-07-2016;20:57:25;155;67;27;305;0,955;98200
-38,71896667;-72,64821667;01-07-2016;20:57:30;155;17;12;350;0,98;84800
-38,71871667;-72,64805;01-07-2016;20:57:36;155;31;19;28;0,899;79900
-38,71838333;-72,64785;01-07-2016;20:57:42;155;42;25;24;0,924;76200
-38,71813333;-72,64785;01-07-2016;20:57:46;155;27;24;1;1,06;73800
-38,7179;-72,64783333;01-07-2016;20:57:50;154;27;24;3;1,27;73800
-38,71761667;-72,64771667;01-07-2016;20:57:55;154;32;23;17;1,72;80100
-38,71736667;-72,64746667;01-07-2016;20:58:00;153;35;25;38;2,93;92700
-38,71718333;-72,64728333;01-07-2016;20:58:04;153;27;24;38;3,35;112000
-38,71675;-72,64711667;01-07-2016;20:58:12;151;51;23;17;3,6;125000
-38,71666667;-72,6471;01-07-2016;20:58:15;151;10;12;7;3,17;124000
-38,71656667;-72,64726667;01-07-2016;20:58:21;151;18;11;302;2,9;125000
-38,71645;-72,6477;01-07-2016;20:58:29;150;41;18;291;2,86;130000
-38,71631667;-72,6481;01-07-2016;20:58:36;150;37;19;291;2,57;132000
-38,7163;-72,6482;01-07-2016;20:58:40;150;8;7;284;2,92;131000
-38,71633333;-72,6483;01-07-2016;20:58:46;149;10;6;249;2,9;134000
-38,71663333;-72,64841667;01-07-2016;20:58:53;149;34;18;197;2,96;131000
-38,71703333;-72,64858333;01-07-2016;20:58:59;149;47;28;198;2,89;129000
-38,7176;-72,64888333;01-07-2016;20:59:07;149;69;31;203;2,18;125000
-38,71816667;-72,64923333;01-07-2016;20:59:15;149;70;32;205;1,96;104000
-38,7184;-72,64935;01-07-2016;20:59:19;149;27;24;204;1,68;103000
-38,71848333;-72,64941667;01-07-2016;20:59:24;150;11;8;206;1,82;94900
-38,71846667;-72,64945;01-07-2016;21:00:37;149;4;0,2;296;1,41;96700
-38,71831667;-72,64993333;01-07-2016;21:00:43;150;44;27;293;1,46;91300
-38,71815;-72,65066667;01-07-2016;21:00:49;150;66;40;286;0,985;94900
-38,71801667;-72,65126667;01-07-2016;21:00:54;151;55;40;285;1,08;74600
-38,71781667;-72,65161667;01-07-2016;21:00:59;150;37;27;307;1,07;75800
-38,71763333;-72,65171667;01-07-2016;21:01:03;150;21;19;336;0,993;74500
-38,71711667;-72,65185;01-07-2016;21:01:11;149;58;26;348;0,772;72000
-38,71653333;-72,65211667;01-07-2016;21:01:19;148;70;32;341;0,712;66000
-38,7158;-72,65241667;01-07-2016;21:01:27;147;86;39;342;0,832;65100
-38,71488333;-72,6528;01-07-2016;21:01:37;150;107;38;341;1,15;74600
-38,71453333;-72,65296667;01-07-2016;21:01:42;151;41;30;340;1,35;79100
-38,7144;-72,65303333;01-07-2016;21:01:45;152;16;20;340;1,36;86600
-38,71428333;-72,65326667;01-07-2016;21:01:50;152;23;17;303;1,25;90600
-38,7143;-72,65333333;01-07-2016;21:01:51;152;7;25;256;1,45;85100
-38,7144;-72,65378333;01-07-2016;21:01:56;152;40;29;254;1,32;78100
-38,71441667;-72,65468333;01-07-2016;21:02:05;153;79;31;269;2,7;85500
-38,7143;-72,65546667;01-07-2016;21:02:13;152;69;31;280;2,86;109000
-38,71425;-72,65576667;01-07-2016;21:02:18;151;27;19;283;3,33;107000
-38,71425;-72,6558;01-07-2016;21:02:19;150;3;11;288;3,27;109000
-38,7141;-72,65586667;01-07-2016;21:02:23;149;17;15;341;3,18;114000
-38,71383333;-72,65593333;01-07-2016;21:02:27;147;31;28;348;3,4;113000
-38,71353333;-72,65616667;01-07-2016;21:02:32;146;38;27;329;3,51;125000
-38,7135;-72,65621667;01-07-2016;21:02:33;146;6;23;313;3,43;117000
-38,71335;-72,65671667;01-07-2016;21:02:40;147;46;24;291;0,828;97900
-38,71328333;-72,65743333;01-07-2016;21:02:48;148;63;28;277;0,611;56300
-38,71318333;-72,6583;01-07-2016;21:02:58;151;77;28;277;0,759;52800
-38,7131;-72,6588;01-07-2016;21:03:04;153;44;26;283;0,94;59800
-38,71305;-72,65963333;01-07-2016;21:03:14;153;73;26;275;1,1;66900
-38,71318333;-72,66001667;01-07-2016;21:03:20;153;38;23;245;0,907;64000
-38,71333333;-72,66021667;01-07-2016;21:03:25;153;23;17;228;0,958;57100
-38,71325;-72,6603;01-07-2016;21:03:30;153;12;8;327;0,895;55600
-38,7132;-72,66028333;01-07-2016;21:03:31;153;5;18;5;0,786;56900
-38,71281667;-72,66021667;01-07-2016;21:03:36;152;42;30;9;0,61;49400
-38,71228333;-72,66008333;01-07-2016;21:03:42;151;61;37;10;0,719;44100
-38,71211667;-72,66003333;01-07-2016;21:03:46;150;19;17;15;0,753;47500
-38,71203333;-72,66001667;01-07-2016;21:03:50;150;9;8;10;0,728;47300
-38,71201667;-72,6601;01-07-2016;21:03:54;150;8;7;287;0,667;43300
-38,71201667;-72,6604;01-07-2016;21:03:59;151;26;18;269;0,734;43100
-38,71195;-72,66103333;01-07-2016;21:04:06;152;56;29;277;0,553;47900
-38,71183333;-72,66215;01-07-2016;21:04:17;154;98;32;278;0,799;45900
-38,71175;-72,66288333;01-07-2016;21:04:25;157;64;29;278;0,708;53700
-38,71166667;-72,66358333;01-07-2016;21:04:33;160;62;28;278;0,914;52400
-38,71158333;-72,664;01-07-2016;21:04:39;161;37;22;284;0,978;51400
-38,7115;-72,66401667;01-07-2016;21:04:43;162;10;9;355;1,02;53000
-38,71123333;-72,6639;01-07-2016;21:04:50;164;30;16;19;1,14;52200
-38,71101667;-72,66381667;01-07-2016;21:04:54;164;25;22;16;0,705;60100
-38,71038333;-72,66353333;01-07-2016;21:05:04;165;75;27;19;1,02;54100
-38,7101;-72,66343333;01-07-2016;21:05:10;161;33;20;16;1,05;58000
-38,71;-72,66345;01-07-2016;21:05:15;158;12;9;350;1,01;59000
-38,70993333;-72,66366667;01-07-2016;21:05:20;155;19;14;289;0,758;65200
-38,7099;-72,66405;01-07-2016;21:05:25;154;34;24;278;0,904;57800
-38,70978333;-72,66491667;01-07-2016;21:05:34;153;77;31;279;0,84;50800
-38,70973333;-72,6653;01-07-2016;21:05:39;152;34;24;279;0,623;41900
-38,70971667;-72,66545;01-07-2016;21:05:44;151;12;9;280;0,467;39900
-38,70971667;-72,66545;01-07-2016;21:05:45;151;1;3;260;0,499;40500
-38,70973333;-72,66548333;01-07-2016;21:05:47;151;3;6;242;0,524;40300
-38,7099;-72,66551667;01-07-2016;21:05:52;151;18;13;190;0,476;34400
-38,71028333;-72,66546667;01-07-2016;21:05:59;150;44;23;174;0,379;31900
-38,7105;-72,66541667;01-07-2016;21:06:03;151;23;21;169;0,357;27800
-38,71066667;-72,66555;01-07-2016;21:06:08;150;21;15;210;0,357;26600
-38,71075;-72,6657;01-07-2016;21:06:12;151;17;16;232;0,451;24900
-38,7109;-72,66576667;01-07-2016;21:06:15;151;16;20;201;0,376;26300
-38,71098333;-72,66583333;01-07-2016;21:06:17;150;10;19;205;0,411;26800
-38,71111667;-72,66603333;01-07-2016;21:06:23;149;23;14;231;0,526;28400
-38,7111;-72,66611667;01-07-2016;21:06:25;148;8;14;273;0,541;29100
-38,711;-72,66663333;01-07-2016;21:06:33;147;45;20;285;0,362;40700
-38,71093333;-72,6671;01-07-2016;21:06:41;146;41;19;280;0,19;27200
-38,7109;-72,66716667;01-07-2016;21:06:44;146;7;8;301;0,253;19600
-38,71081667;-72,6672;01-07-2016;21:06:48;146;10;9;345;0,248;19400
-38,7105;-72,66705;01-07-2016;21:06:55;146;38;20;19;0,206;21600
-38,71028333;-72,66695;01-07-2016;21:07:01;147;26;16;21;0,131;28600
-38,71025;-72,66693333;01-07-2016;21:07:06;147;4;3;19;0,119;18800
-38,71011667;-72,66688333;01-07-2016;21:08:38;149;15;0,6;17;0,167;21400
-38,71005;-72,66686667;01-07-2016;21:08:40;149;8;15;9;0,291;21600
-38,70965;-72,66668333;01-07-2016;21:08:47;148;48;25;20;0,16;18900
-38,70906667;-72,66645;01-07-2016;21:08:56;144;68;27;18;0,152;17700
-38,70883333;-72,66635;01-07-2016;21:09:02;142;28;17;19;0,137;23200
-38,70878333;-72,66633333;01-07-2016;21:09:04;142;5;8;22;0,141;19300
-38,70876667;-72,6662;01-07-2016;21:09:08;141;12;10;78;0,151;15100
-38,70883333;-72,66563333;01-07-2016;21:09:16;140;50;23;98;0,159;15700
-38,70883333;-72,66555;01-07-2016;21:09:17;140;6;22;94;0,157;16000
-38,70883333;-72,66543333;01-07-2016;21:09:19;140;11;20;87;0,151;19000
-38,70885;-72,66521667;01-07-2016;21:09:25;139;19;12;96;0,253;18800
-38,70885;-72,66518333;01-07-2016;21:09:26;139;3;9;84;0,334;18900
-38,70875;-72,66508333;01-07-2016;21:09:30;139;14;13;40;0,477;23200
-38,70835;-72,66491667;01-07-2016;21:09:37;138;47;24;18;1,47;27600
-38,70771667;-72,66465;01-07-2016;21:09:47;136;75;27;18;0,112;20900
-38,70753333;-72,66456667;01-07-2016;21:09:53;134;21;13;20;0,127;14200
-38,7075;-72,66453333;01-07-2016;21:10:01;134;5;2;32;0,107;11700
-38,70751667;-72,66455;01-07-2016;21:10:13;135;3;0,9;208;0,105;17900
-38,70758333;-72,66461667;01-07-2016;21:10:22;136;9;4;213;0,143;25300
-38,70758333;-72,66461667;01-07-2016;21:10:23;136;0;0;0;0,149;23900
-38,70758333;-72,66453333;01-07-2016;21:10:27;136;7;6;88;0,143;22700
-38,70765;-72,66405;01-07-2016;21:10:37;136;42;15;99;0,148;15300
-38,70768333;-72,6636;01-07-2016;21:10:45;135;39;18;97;0,249;14700
-38,70776667;-72,66301667;01-07-2016;21:10:54;134;52;21;100;0,324;18600
-38,70776667;-72,66295;01-07-2016;21:10:58;134;6;5;89;0,321;20600
-38,70778333;-72,66283333;01-07-2016;21:11:10;134;10;3;93;0,455;23900
-38,7078;-72,66261667;01-07-2016;21:11:17;133;19;10;100;0,277;28400
-38,70781667;-72,6626;01-07-2016;21:11:18;133;1;4;113;0,303;28300
-38,70788333;-72,66256667;01-07-2016;21:11:22;133;8;7;159;0,514;22600
-38,70813333;-72,66266667;01-07-2016;21:11:28;132;30;18;197;0,536;28500
-38,70841667;-72,66278333;01-07-2016;21:11:34;132;34;20;197;0,668;30300
-38,7085;-72,66281667;01-07-2016;21:11:39;132;9;7;198;0,801;32800
-38,70873333;-72,6629;01-07-2016;21:11:45;132;26;16;198;0,959;50800
-38,70883333;-72,66291667;01-07-2016;21:11:48;132;12;14;187;0,916;51500
-38,7089;-72,66283333;01-07-2016;21:11:52;133;10;9;133;0,975;56600
-38,70893333;-72,6625;01-07-2016;21:11:58;134;30;18;100;1,29;60100
-38,70903333;-72,66178333;01-07-2016;21:12:06;135;64;29;99;1,08;62700
-38,7091;-72,66133333;01-07-2016;21:12:12;135;39;23;101;0,79;57500
-38,70911667;-72,66116667;01-07-2016;21:12:17;135;15;11;98;0,586;47600
-38,70911667;-72,66113333;01-07-2016;21:12:20;135;3;3;105;0,598;50200
-38,70921667;-72,66111667;01-07-2016;21:12:24;136;10;9;169;0,676;44500
-38,70951667;-72,66123333;01-07-2016;21:12:30;136;36;21;197;0,873;43200
-38,70998333;-72,66143333;01-07-2016;21:12:37;137;54;28;198;1,02;48300
-38,71011667;-72,66148333;01-07-2016;21:12:41;138;16;14;197;1,16;54000
-38,71016667;-72,6615;01-07-2016;21:12:45;138;5;4;199;1,73;59600
-38,71021667;-72,66141667;01-07-2016;21:12:49;138;10;9;130;2,08;79500
-38,71021667;-72,66113333;01-07-2016;21:12:54;139;24;18;89;1,98;101000
-38,71018333;-72,66025;01-07-2016;21:13:04;139;76;27;88;1,67;95800
-38,71023333;-72,65985;01-07-2016;21:13:10;138;35;21;96;1,31;101000
-38,71025;-72,65965;01-07-2016;21:13:14;138;17;15;98;1,7;129000
-38,71033333;-72,65921667;01-07-2016;21:13:20;139;39;23;105;1,48;116000
-38,7105;-72,6586;01-07-2016;21:13:27;139;57;29;108;1,68;114000
-38,71055;-72,65833333;01-07-2016;21:13:32;140;24;17;108;1,81;112000
-38,71063333;-72,65801667;01-07-2016;21:13:36;140;29;26;105;2,04;114000
-38,71083333;-72,65708333;01-07-2016;21:13:45;140;84;34;106;2,24;126000
-38,71091667;-72,6567;01-07-2016;21:13:50;139;33;24;106;1,84;114000
-38,711;-72,65633333;01-07-2016;21:13:56;139;34;21;105;2,01;114000
-38,71113333;-72,65566667;01-07-2016;21:14:03;138;60;31;105;2,39;124000
-38,71123333;-72,65528333;01-07-2016;21:14:08;139;34;25;109;2,54;122000
-38,71126667;-72,65511667;01-07-2016;21:14:12;139;16;14;104;2,63;123000
-38,71136667;-72,65471667;01-07-2016;21:14:18;137;37;22;107;2,66;128000
-38,71151667;-72,65418333;01-07-2016;21:14:25;136;49;25;109;2,71;127000
-38,71156667;-72,65401667;01-07-2016;21:14:30;136;15;10;109;2,81;128000
-38,7116;-72,65386667;01-07-2016;21:14:37;137;14;7;110;2,6;128000
-38,7116;-72,65381667;01-07-2016;21:14:38;137;4;14;95;2,55;135000
-38,71151667;-72,65368333;01-07-2016;21:14:41;136;15;18;51;2,29;144000
-38,71103333;-72,65348333;01-07-2016;21:14:48;137;57;29;18;1,83;126000
-38,71053333;-72,65325;01-07-2016;21:14:55;139;59;30;21;1,66;120000
-38,70983333;-72,6528;01-07-2016;21:15:04;140;88;35;26;0,853;87600
-38,7094;-72,65251667;01-07-2016;21:15:10;140;54;33;27;0,667;71900
-38,7092;-72,65238333;01-07-2016;21:15:15;139;26;19;29;0,645;62400
-38,70913333;-72,65226667;01-07-2016;21:15:19;137;13;11;53;0,573;61800
-38,70916667;-72,65191667;01-07-2016;21:15:24;136;30;21;100;0,585;62300
-38,70935;-72,65118333;01-07-2016;21:15:33;134;67;27;107;0,566;63600
-38,70936667;-72,65111667;01-07-2016;21:15:34;133;7;24;109;0,571;62300
-38,7095;-72,65091667;01-07-2016;21:15:38;133;22;20;132;0,592;58000
-38,70985;-72,65065;01-07-2016;21:15:44;133;46;27;149;0,593;69800
-38,71013333;-72,65058333;01-07-2016;21:15:48;133;32;29;168;0,62;62500
-38,71078333;-72,6507;01-07-2016;21:15:57;132;73;29;189;0,586;59400
-38,71118333;-72,65086667;01-07-2016;21:16:04;131;47;24;197;0,613;61900
-38,71133333;-72,65091667;01-07-2016;21:16:08;131;16;15;196;0,737;64600
-38,71173333;-72,6511;01-07-2016;21:16:16;130;48;22;200;0,803;66700
-38,71211667;-72,65126667;01-07-2016;21:16:23;130;45;23;198;0,975;74500
-38,71223333;-72,65131667;01-07-2016;21:16:28;130;13;9;201;0,717;80000
-38,71238333;-72,65138333;01-07-2016;21:16:32;130;18;16;200;0,803;70300
-38,71261667;-72,65146667;01-07-2016;21:16:38;131;26;16;195;0,813;73000
-38,71271667;-72,6515;01-07-2016;21:16:43;131;11;8;198;1,32;73400
-38,71305;-72,65163333;01-07-2016;21:16:51;133;40;18;197;1,89;91300
-38,71355;-72,65183333;01-07-2016;21:17:02;137;57;19;198;1,56;106000
-38,71368333;-72,6519;01-07-2016;21:17:05;138;17;20;199;1,32;97400
-38,71408333;-72,65205;01-07-2016;21:17:14;143;45;18;197;1,21;72500
-38,71421667;-72,65211667;01-07-2016;21:17:19;146;16;12;198;1,29;78400
-38,71431667;-72,65213333;01-07-2016;21:17:23;148;11;10;189;1,25;82600
-38,71438333;-72,652;01-07-2016;21:17:27;149;13;12;121;1,32;79100
-38,71441667;-72,6513;01-07-2016;21:17:36;149;61;24;95;2,2;84700
-38,71453333;-72,65053333;01-07-2016;21:17:44;148;68;31;100;2,46;110000
-38,71475;-72,64971667;01-07-2016;21:17:51;146;74;38;109;2,63;116000
-38,71508333;-72,6487;01-07-2016;21:17:59;143;96;43;113;2,35;114000
-38,7154;-72,64775;01-07-2016;21:18:07;141;89;40;113;2,46;116000
-38,71565;-72,64691667;01-07-2016;21:18:15;140;78;35;111;2,68;116000
-38,71571667;-72,64671667;01-07-2016;21:18:19;139;19;17;111;2,91;119000
-38,71571667;-72,64661667;01-07-2016;21:18:24;138;9;6;99;2,67;120000
-38,7156;-72,64655;01-07-2016;21:18:28;138;14;13;27;2,75;131000
-38,7153;-72,64643333;01-07-2016;21:18:34;137;36;21;15;2,67;124000
-38,7149;-72,64625;01-07-2016;21:18:42;136;47;21;20;2,63;123000
-38,71481667;-72,64621667;01-07-2016;21:18:44;136;10;19;18;2,59;123000
-38,71471667;-72,64618333;01-07-2016;21:18:46;136;11;19;11;2,43;122000
-38,71425;-72,646;01-07-2016;21:18:56;136;55;20;17;1,65;118000
-38,7141;-72,64595;01-07-2016;21:19:03;136;16;8;17;1,33;128000
-38,7139;-72,64585;01-07-2016;21:19:11;136;25;11;19;1,06;105000
-38,71378333;-72,64581667;01-07-2016;21:19:16;136;12;9;18;0,92;89800
-38,71371667;-72,64586667;01-07-2016;21:19:20;135;10;9;327;0,965;81400
-38,71363333;-72,64611667;01-07-2016;21:19:25;134;23;16;294;0,988;78400
-38,71346667;-72,64663333;01-07-2016;21:19:32;134;49;25;292;0,896;82800
-38,71325;-72,64741667;01-07-2016;21:19:41;133;71;29;290;1,14;74700
-38,71301667;-72,64825;01-07-2016;21:19:49;133;76;34;289;1,1;82200
-38,71273333;-72,64938333;01-07-2016;21:19:59;132;104;37;289;1,25;77500
-38,7125;-72,65025;01-07-2016;21:20:07;132;80;36;289;0,907;78800
-38,71243333;-72,65048333;01-07-2016;21:20:09;132;21;38;288;0,772;74000
-38,71218333;-72,65088333;01-07-2016;21:20:14;131;44;32;309;0,743;73800
-38,712;-72,65103333;01-07-2016;21:20:18;131;25;23;329;0,844;70300
-38,71185;-72,6511;01-07-2016;21:20:24;130;18;11;340;0,834;75000
-38,71181667;-72,6511;01-07-2016;21:20:25;130;4;13;6;0,816;76000
-38,71138333;-72,65091667;01-07-2016;21:20:34;129;50;20;18;0,854;69700
-38,71106667;-72,6508;01-07-2016;21:20:40;129;36;22;17;0,456;71000
-38,71098333;-72,65073333;01-07-2016;21:20:44;128;11;10;24;0,484;60800
-38,71101667;-72,65058333;01-07-2016;21:20:50;128;14;8;106;0,527;57400
-38,71103333;-72,65045;01-07-2016;21:20:53;128;12;14;101;0,545;55200
-38,71098333;-72,64993333;01-07-2016;21:21:01;128;46;21;84;0,694;61100
-38,71098333;-72,64948333;01-07-2016;21:21:08;129;40;21;89;0,649;65800
-38,71098333;-72,64941667;01-07-2016;21:21:09;129;5;17;96;0,611;63700
-38,71091667;-72,64925;01-07-2016;21:21:13;130;17;15;65;0,644;68500
-38,71083333;-72,6492;01-07-2016;21:21:15;130;10;18;21;0,714;64400
-38,71041667;-72,64898333;01-07-2016;21:21:23;132;50;23;22;0,775;75900
-38,70996667;-72,6487;01-07-2016;21:21:31;132;57;25;26;0,71;74800
-38,7095;-72,64845;01-07-2016;21:21:39;134;55;25;23;0,67;70500
-38,70923333;-72,64831667;01-07-2016;21:21:46;135;34;17;21;0,617;72000
-38,70913333;-72,64825;01-07-2016;21:21:51;136;13;9;29;0,705;63600
-38,70911667;-72,64821667;01-07-2016;21:21:52;137;3;10;64;0,724;63600
-38,7092;-72,648;01-07-2016;21:21:58;140;22;13;117;0,694;73800
-38,70926667;-72,64775;01-07-2016;21:22:04;141;22;13;108;0,649;83100
-38,70928333;-72,64745;01-07-2016;21:22:11;144;27;14;95;0,823;85600
-38,70935;-72,64713333;01-07-2016;21:22:17;147;28;17;104;0,788;90000
-38,70936667;-72,6469;01-07-2016;21:22:21;148;20;18;100;0,809;99400
-38,70931667;-72,64668333;01-07-2016;21:22:26;149;20;14;70;1,02;94400
-38,70928333;-72,64666667;01-07-2016;21:22:27;149;4;14;32;1,1;91900
-38,70896667;-72,64643333;01-07-2016;21:22:35;151;42;19;30;1,26;87100
-38,70876667;-72,6463;01-07-2016;21:22:39;152;24;21;29;1,27;87300
-38,7084;-72,64603333;01-07-2016;21:22:47;153;47;21;28;1,14;90600
-38,70803333;-72,64575;01-07-2016;21:22:56;153;48;19;30;1,09;86200
-38,70783333;-72,64561667;01-07-2016;21:23:02;152;24;15;30;1,09;88600
-38,70781667;-72,64558333;01-07-2016;21:23:03;152;4;13;53;1,09;89300
-38,70785;-72,64533333;01-07-2016;21:23:08;151;22;16;100;1,08;77800
-38,70803333;-72,6448;01-07-2016;21:23:17;152;51;20;113;1,39;73500
-38,70808333;-72,64461667;01-07-2016;21:23:22;153;16;12;112;1,26;74700
-38,70808333;-72,6446;01-07-2016;21:23:23;153;2;7;97;1,2;74300
-38,70796667;-72,64448333;01-07-2016;21:23:28;153;16;11;35;0,988;77100
-38,70758333;-72,64433333;01-07-2016;21:23:35;154;45;23;18;0,778;71500
-38,70716667;-72,64415;01-07-2016;21:23:41;153;49;29;19;0,793;65400
-38,70703333;-72,6441;01-07-2016;21:23:43;153;15;26;15;0,77;64800
-38,70693333;-72,64405;01-07-2016;21:23:45;153;12;22;19;0,716;65000
-38,70645;-72,64385;01-07-2016;21:23:54;153;57;23;19;0,731;71600
-38,70613333;-72,6437;01-07-2016;21:24:00;153;37;22;21;0,779;69300
-38,70586667;-72,64358333;01-07-2016;21:24:05;153;31;23;16;0,795;78400
-38,70563333;-72,6435;01-07-2016;21:24:09;153;27;25;18;0,765;84800
-38,70553333;-72,6434;01-07-2016;21:24:13;153;14;13;35;0,697;85600
-38,7055;-72,64335;01-07-2016;21:24:18;153;6;5;53;0,709;88600
-38,70548333;-72,64333333;01-07-2016;21:24:27;154;2;0,6;66;0,647;90200
-38,70555;-72,64315;01-07-2016;21:24:32;154;17;13;114;0,528;114000
-38,70576667;-72,64276667;01-07-2016;21:24:37;154;41;29;125;0,498;118000
-38,70611667;-72,64215;01-07-2016;21:24:43;153;66;39;127;0,456;109000
-38,70651667;-72,64145;01-07-2016;21:24:49;153;75;45;126;0,397;83900
-38,70698333;-72,64063333;01-07-2016;21:24:56;153;87;45;126;0,413;82500
-38,7074;-72,63973333;01-07-2016;21:25:04;154;92;41;120;0,405;85200
-38,70776667;-72,63893333;01-07-2016;21:25:10;155;80;48;121;0,388;67400
-38,7083;-72,63818333;01-07-2016;21:25:16;154;88;53;132;0,346;101000
-38,70933333;-72,63701667;01-07-2016;21:25:27;157;154;50;139;0,283;101000
-38,71005;-72,63623333;01-07-2016;21:25:35;159;105;47;140;0,477;83600
-38,71071667;-72,63555;01-07-2016;21:25:43;159;95;43;141;1,01;136000
-38,7109;-72,63536667;01-07-2016;21:25:47;159;25;22;142;1,18;138000
-38,71096667;-72,63528333;01-07-2016;21:25:53;159;12;7;140;1,11;113000
-38,71101667;-72,63518333;01-07-2016;21:25:58;159;10;7;121;0,805;171000
-38,71088333;-72,63496667;01-07-2016;21:26:05;160;25;13;51;0,742;76600
-38,71066667;-72,63491667;01-07-2016;21:26:11;160;23;14;13;0,522;68800
-38,71038333;-72,63486667;01-07-2016;21:26:18;160;33;17;7;0,282;67600
-38,71028333;-72,63485;01-07-2016;21:26:22;160;10;9;9;0,614;57400
-38,71028333;-72,63471667;01-07-2016;21:26:26;159;12;11;82;1,13;55500
-38,71035;-72,63461667;01-07-2016;21:26:28;159;12;21;141;1,14;61400
-38,7106;-72,63438333;01-07-2016;21:26:35;160;34;18;142;1,17;70900
-38,71085;-72,63411667;01-07-2016;21:26:43;160;36;16;140;1,18;72600
-38,7111;-72,63381667;01-07-2016;21:26:50;161;38;20;137;1,13;81300
-38,71118333;-72,63368333;01-07-2016;21:26:53;161;15;18;132;0,995;83500
-38,71151667;-72,63338333;01-07-2016;21:27:01;162;45;20;143;0,606;77600
-38,71163333;-72,63321667;01-07-2016;21:27:06;161;20;14;136;0,471;57500
-38,71176667;-72,6332;01-07-2016;21:27:11;161;15;11;171;0,484;49800
-38,71205;-72,63328333;01-07-2016;21:27:17;161;32;19;193;0,61;49700
-38,71236667;-72,6334;01-07-2016;21:27:23;161;36;21;196;0,838;56700
-38,71248333;-72,63343333;01-07-2016;21:27:28;161;14;10;197;0,835;60800
-38,71255;-72,63346667;01-07-2016;21:28:15;162;8;0,6;195;0,665;84400
-38,7127;-72,63336667;01-07-2016;21:28:19;161;18;17;152;0,596;92100
-38,713;-72,633;01-07-2016;21:28:25;161;46;28;137;0,594;77500
-38,71348333;-72,63243333;01-07-2016;21:28:32;160;74;38;137;0,537;92400
-38,71421667;-72,6316;01-07-2016;21:28:41;157;109;44;138;0,845;65700
-38,71463333;-72,63113333;01-07-2016;21:28:47;155;61;36;139;1,27;89400
-38,71466667;-72,63108333;01-07-2016;21:28:48;155;6;22;136;1,31;94600
-38,71471667;-72,63086667;01-07-2016;21:28:53;154;20;14;105;1,02;118000
-38,71451667;-72,63056667;01-07-2016;21:29:01;152;33;15;51;1,19;87000
-38,71448333;-72,63055;01-07-2016;21:29:02;152;4;14;25;1,25;84700
-38,71413333;-72,63043333;01-07-2016;21:29:09;150;41;21;13;1,01;78800
-38,7136;-72,63025;01-07-2016;21:29:17;148;60;27;15;0,849;78300
-38,71328333;-72,63015;01-07-2016;21:29:23;147;37;22;14;0,859;74000
-38,7132;-72,6301;01-07-2016;21:29:27;147;10;9;31;0,958;68500
-38,71323333;-72,62993333;01-07-2016;21:29:31;147;14;13;99;1,7;63800
-38,71336667;-72,62941667;01-07-2016;21:29:38;145;48;25;110;2,3;68800
-38,7135;-72,6289;01-07-2016;21:29:44;144;47;28;107;1,46;85400
-38,71361667;-72,62841667;01-07-2016;21:29:53;142;44;18;106;1,81;110000
-38,71365;-72,62823333;01-07-2016;21:29:59;141;15;9;107;1,7;114000
-38,7137;-72,628;01-07-2016;21:30:07;139;22;10;104;1,72;118000
-38,71376667;-72,62773333;01-07-2016;21:30:13;138;24;15;107;1,41;112000
-38,71386667;-72,62738333;01-07-2016;21:30:21;138;33;15;112;1,24;104000
-38,71383333;-72,6273;01-07-2016;21:30:25;139;8;7;60;1,42;108000
-38,71373333;-72,62725;01-07-2016;21:30:29;138;12;11;21;1,48;110000
-38,71346667;-72,62715;01-07-2016;21:30:36;137;32;16;15;1,85;114000
-38,7131;-72,62703333;01-07-2016;21:30:43;136;42;22;14;2,3;122000
-38,713;-72,627;01-07-2016;21:30:48;137;10;7;18;2,27;130000
-38,713;-72,62688333;01-07-2016;21:30:53;138;11;8;83;2,2;141000
-38,7131;-72,62638333;01-07-2016;21:31:03;138;45;16;106;2,54;143000
-38,71321667;-72,6259;01-07-2016;21:31:11;137;44;20;105;2,04;112000
-38,71328333;-72,62553333;01-07-2016;21:31:18;134;32;17;105;1,64;117000
-38,71333333;-72,6254;01-07-2016;21:31:23;133;13;9;119;1,36;153000
-38,71351667;-72,62533333;01-07-2016;21:31:27;132;20;18;162;0,843;130000
-38,71393333;-72,62521667;01-07-2016;21:31:34;131;48;25;168;0,736;103000
-38,71411667;-72,62521667;01-07-2016;21:31:40;132;21;12;181;0,705;86700
-38,71418333;-72,62503333;01-07-2016;21:31:45;133;17;12;115;0,743;130000
-38,7142;-72,62471667;01-07-2016;21:31:50;133;28;20;95;0,936;113000
-38,71413333;-72,62446667;01-07-2016;21:31:54;132;24;21;71;1,07;103000
-38,71393333;-72,6244;01-07-2016;21:31:58;132;23;21;13;1,38;123000
-38,71383333;-72,62443333;01-07-2016;21:32:00;131;12;21;349;1,71;119000
-38,71353333;-72,62438333;01-07-2016;21:32:06;128;33;20;8;1,96;133000
-38,71348333;-72,62418333;01-07-2016;21:32:10;127;18;16;72;2,19;116000
-38,71361667;-72,62361667;01-07-2016;21:32:17;125;51;26;107;2;122000
-38,71376667;-72,62263333;01-07-2016;21:32:26;122;88;35;102;2,29;129000
-38,71376667;-72,62223333;01-07-2016;21:32:29;121;35;42;90;2,32;131000
-38,71385;-72,62156667;01-07-2016;21:32:35;119;58;35;100;2,43;142000
-38,71383333;-72,62138333;01-07-2016;21:32:39;117;17;15;78;2,16;149000
-38,71375;-72,62141667;01-07-2016;21:32:41;116;9;17;343;1,57;143000
-38,71326667;-72,62185;01-07-2016;21:32:50;111;66;26;325;1,46;103000
-38,71275;-72,62225;01-07-2016;21:32:58;110;67;30;328;1,78;114000
-38,71225;-72,62268333;01-07-2016;21:33:06;108;67;30;326;2,59;134000
-38,71171667;-72,62331667;01-07-2016;21:33:16;105;81;29;318;2,72;159000
-38,71135;-72,62373333;01-07-2016;21:33:24;103;54;24;317;2,71;154000
-38,71126667;-72,62381667;01-07-2016;21:33:28;103;13;12;324;2,74;153000
-38,711;-72,62378333;01-07-2016;21:33:33;103;29;21;6;2,74;157000
-38,71048333;-72,62386667;01-07-2016;21:33:41;103;58;26;352;2,47;161000
-38,70995;-72,62403333;01-07-2016;21:33:49;103;61;28;347;2,13;151000
-38,70951667;-72,62425;01-07-2016;21:33:56;103;52;27;338;1,77;146000
-38,70931667;-72,62436667;01-07-2016;21:34:00;103;25;23;336;1,85;146000
-38,70913333;-72,62461667;01-07-2016;21:34:06;103;29;17;314;1,61;135000
-38,70903333;-72,6251;01-07-2016;21:34:15;105;44;17;285;1,56;124000
-38,70903333;-72,62518333;01-07-2016;21:34:18;105;7;8;279;1,53;122000
-38,70893333;-72,62515;01-07-2016;21:34:23;107;12;8;12;1,49;119000
-38,70853333;-72,62495;01-07-2016;21:34:31;108;47;21;21;1,34;122000
-38,70815;-72,62476667;01-07-2016;21:34:38;109;47;24;20;1,2;111000
-38,70775;-72,6246;01-07-2016;21:34:44;111;46;27;18;0,903;103000
-38,7076;-72,62451667;01-07-2016;21:34:49;112;19;14;22;0,984;105000
-38,70756667;-72,62443333;01-07-2016;21:34:53;112;8;7;67;1,01;89000
-38,70765;-72,62405;01-07-2016;21:35:00;113;35;18;106;0,718;89200
-38,70778333;-72,62338333;01-07-2016;21:35:09;113;60;24;104;0,286;51500
-38,70781667;-72,62325;01-07-2016;21:35:13;113;12;11;103;0,399;42900
-38,70796667;-72,6232;01-07-2016;21:35:19;114;17;10;167;0,636;54200
-38,70833333;-72,62335;01-07-2016;21:35:26;115;44;23;196;0,955;63700
-38,70893333;-72,62351667;01-07-2016;21:35:35;116;68;27;193;1,3;89900
-38,70911667;-72,62356667;01-07-2016;21:35:38;116;21;25;191;1,34;94000
-38,70928333;-72,62346667;01-07-2016;21:35:43;117;20;15;155;1,36;119000
-38,70935;-72,6228;01-07-2016;21:35:53;115;59;21;98;0,746;99400
-38,70941667;-72,6223;01-07-2016;21:36:00;114;44;23;100;0,411;71300
-38,70945;-72,62203333;01-07-2016;21:36:05;114;23;17;96;0,33;51400
-38,70953333;-72,62175;01-07-2016;21:36:11;113;27;16;113;0,306;40600
-38,70966667;-72,62171667;01-07-2016;21:36:14;113;14;17;167;0,296;41300
-38,7102;-72,62166667;01-07-2016;21:36:22;111;60;27;177;0,336;44400
-38,71071667;-72,62165;01-07-2016;21:36:30;110;57;25;178;0,322;47200
-38,71075;-72,62165;01-07-2016;21:36:34;109;5;4;184;0,288;38100
-38,71073333;-72,62166667;01-07-2016;21:37:05;111;2;0,2;336;0,319;37300
-38,71075;-72,62163333;01-07-2016;21:37:16;112;3;0,9;100;0,451;45900
-38,71075;-72,62163333;01-07-2016;21:37:51;112;1;0,1;214;0,427;41300
-38,71085;-72,62158333;01-07-2016;21:38:02;113;11;4;157;0,616;42100
-38,71086667;-72,62158333;01-07-2016;21:39:43;114;2;0,1;175;0,692;58200
-38,71083333;-72,62155;01-07-2016;21:40:59;118;4;0,2;33;0,97;78600
-38,7108;-72,62158333;01-07-2016;21:41:08;119;4;1,4;323;1,43;79200
-38,7108;-72,6216;01-07-2016;21:41:16;120;3;1,2;306;0,909;79500
-38,71078333;-72,62161667;01-07-2016;21:41:19;120;1;1,3;279;0,823;88800
-38,71078333;-72,62166667;01-07-2016;21:41:23;121;4;4;272;0,856;89000
-38,71076667;-72,6217;01-07-2016;21:41:26;120;4;4;309;1,53;110000
-38,71076667;-72,62168333;01-07-2016;21:41:31;118;1;0,9;72;1,6;111000
-38,71076667;-72,62168333;01-07-2016;21:41:44;118;0;0,1;52;1,62;110000
-38,71075;-72,62166667;01-07-2016;21:43:02;117;1;0,1;41;1,75;120000
-38,71091667;-72,62165;01-07-2016;21:43:10;115;19;8;175;2,06;124000
-38,71118333;-72,62161667;01-07-2016;21:43:18;114;29;13;175;1,75;127000
-38,7116;-72,62158333;01-07-2016;21:43:27;111;47;19;176;1,62;130000
-38,71181667;-72,62155;01-07-2016;21:43:31;110;23;20;175;1,55;123000
-38,71198333;-72,62143333;01-07-2016;21:43:36;109;22;16;150;1,68;117000
-38,71216667;-72,62103333;01-07-2016;21:43:42;107;39;24;120;1,9;131000
-38,71248333;-72,62035;01-07-2016;21:43:52;107;70;25;121;1,92;134000
-38,71268333;-72,61993333;01-07-2016;21:43:59;107;43;22;121;2,13;139000
-38,71276667;-72,61976667;01-07-2016;21:44:05;107;16;10;120;2,14;138000
-38,7129;-72,6197;01-07-2016;21:44:10;107;17;12;158;1,88;139000
-38,71321667;-72,61966667;01-07-2016;21:44:16;108;36;21;175;1,43;120000
-38,71353333;-72,61963333;01-07-2016;21:44:22;110;34;20;176;1,56;110000
-38,7138;-72,61961667;01-07-2016;21:44:28;112;30;18;176;1,33;125000
-38,71421667;-72,61956667;01-07-2016;21:44:35;114;46;24;176;1,28;131000
-38,71431667;-72,61956667;01-07-2016;21:44:40;114;12;9;174;1,44;126000
-38,71451667;-72,61953333;01-07-2016;21:44:46;115;21;13;174;1,48;123000
-38,7148;-72,61951667;01-07-2016;21:44:53;117;32;17;176;1,46;144000
-38,71505;-72,61948333;01-07-2016;21:44:58;118;28;20;176;1,38;124000
-38,71528333;-72,61958333;01-07-2016;21:45:02;119;27;24;198;1,67;117000
-38,71576667;-72,62;01-07-2016;21:45:10;123;65;29;214;1,75;152000
-38,71583333;-72,62006667;01-07-2016;21:45:12;124;10;18;216;2,21;166000
-38,71581667;-72,6203;01-07-2016;21:45:17;125;21;15;275;2,01;167000
-38,71576667;-72,62053333;01-07-2016;21:45:20;125;20;24;284;1,96;169000
-38,71585;-72,62093333;01-07-2016;21:45:27;126;37;19;257;1,75;176000
-38,716;-72,62138333;01-07-2016;21:45:33;128;42;25;247;1,85;189000
-38,71613333;-72,62161667;01-07-2016;21:45:37;128;25;23;232;1,58;192000
-38,71641667;-72,6219;01-07-2016;21:45:44;129;40;21;218;1,54;169000
-38,71671667;-72,62211667;01-07-2016;21:45:52;129;38;17;210;0,997;165000
-38,71705;-72,62231667;01-07-2016;21:46:00;132;41;18;205;0,968;119000
-38,7171;-72,62235;01-07-2016;21:46:01;132;5;18;203;0,934;117000
-38,71743333;-72,62246667;01-07-2016;21:46:09;135;39;18;196;0,746;108000
-38,7176;-72,62255;01-07-2016;21:46:15;138;21;12;200;0,744;99500
-38,71768333;-72,62258333;01-07-2016;21:46:17;139;9;17;197;0,64;94800
-38,71798333;-72,6227;01-07-2016;21:46:24;141;34;18;197;0,761;95200
-38,71806667;-72,62275;01-07-2016;21:46:29;142;11;8;204;0,823;95300
-38,7181;-72,62276667;01-07-2016;21:46:31;143;3;5;203;1,18;116000
-38,71808333;-72,62291667;01-07-2016;21:46:36;144;14;10;272;1,53;129000
-38,71798333;-72,62321667;01-07-2016;21:46:43;146;29;15;294;1,38;112000
-38,71796667;-72,62325;01-07-2016;21:46:48;147;3;2;302;1,38;114000
-38,71793333;-72,62336667;01-07-2016;21:47:05;147;11;2;293;1,38;119000
-38,718;-72,62358333;01-07-2016;21:47:10;148;20;15;245;1,41;134000
-38,71806667;-72,6236;01-07-2016;21:47:11;148;7;24;196;1,43;136000
-38,71831667;-72,62366667;01-07-2016;21:47:16;150;29;21;193;1,63;132000
-38,71831667;-72,62381667;01-07-2016;21:47:22;152;13;8;270;1,42;105000
-38,71823333;-72,62423333;01-07-2016;21:47:30;153;37;17;284;1,29;94600
-38,71816667;-72,62455;01-07-2016;21:47:37;155;28;14;286;1,26;91000
-38,71811667;-72,62478333;01-07-2016;21:47:43;156;22;13;285;1,18;91700
-38,71808333;-72,6249;01-07-2016;21:47:47;157;10;9;288;1,19;122000
-38,71803333;-72,6252;01-07-2016;21:47:52;158;26;19;281;1,77;117000
-38,71796667;-72,6257;01-07-2016;21:47:59;159;45;23;281;0,99;109000
-38,71788333;-72,62616667;01-07-2016;21:48:07;160;41;18;282;0,892;105000
-38,71785;-72,62633333;01-07-2016;21:48:13;161;15;9;287;1,06;121000
-38,71785;-72,62635;01-07-2016;21:48:15;161;1;3;279;1,71;125000
-38,71793333;-72,6264;01-07-2016;21:48:20;161;11;8;208;1,19;130000
-38,71811667;-72,62648333;01-07-2016;21:48:26;163;23;14;197;1,07;144000
-38,71848333;-72,62663333;01-07-2016;21:48:35;168;42;17;198;1,03;118000
-38,71865;-72,6267;01-07-2016;21:48:39;169;19;17;197;0,747;105000
-38,71898333;-72,62683333;01-07-2016;21:48:47;169;39;17;197;0,915;108000
-38,71908333;-72,62688333;01-07-2016;21:48:52;169;12;9;199;1,12;121000
-38,7191;-72,62686667;01-07-2016;21:48:54;168;2;4;163;0,965;100000
-38,71911667;-72,62683333;01-07-2016;21:48:58;168;4;3;118;0,822;105000
-38,71913333;-72,62661667;01-07-2016;21:49:05;167;19;10;96;0,802;107000
-38,7192;-72,62615;01-07-2016;21:49:14;165;41;16;100;1,05;105000
-38,71928333;-72,62561667;01-07-2016;21:49:22;163;47;21;100;1,24;92500
-38,71933333;-72,62521667;01-07-2016;21:49:28;160;36;21;101;1,77;112000
-38,71943333;-72,62465;01-07-2016;21:49:36;157;50;22;101;1,76;105000
-38,71948333;-72,62428333;01-07-2016;21:49:42;155;32;19;103;1,57;114000
-38,71953333;-72,62411667;01-07-2016;21:49:48;154;15;9;106;1,57;107000
-38,7196;-72,6241;01-07-2016;21:49:52;154;8;7;160;1,59;109000
-38,71986667;-72,62416667;01-07-2016;21:49:58;154;32;19;191;1,62;105000
-38,7203;-72,62426667;01-07-2016;21:50:04;153;49;29;191;1,57;105000
-38,72058333;-72,62435;01-07-2016;21:50:08;153;31;28;193;1,48;98400
-38,72108333;-72,62443333;01-07-2016;21:50:14;152;57;34;188;1,44;97100
-38,72181667;-72,62465;01-07-2016;21:50:21;150;85;44;193;1,28;94700
-38,72275;-72,62493333;01-07-2016;21:50:30;145;105;42;193;1,34;91200
-38,72333333;-72,62511667;01-07-2016;21:50:36;136;67;40;194;1,46;98100
-38,7234;-72,62513333;01-07-2016;21:50:37;135;8;28;193;1,46;98700
-38,72358333;-72,62518333;01-07-2016;21:50:41;130;22;19;193;1,63;97700
-38,7237;-72,62508333;01-07-2016;21:50:46;125;16;11;145;1,58;98400
-38,72376667;-72,62461667;01-07-2016;21:50:54;117;40;18;99;1,51;96900
-38,72385;-72,62411667;01-07-2016;21:51:00;112;45;27;104;1,56;97200
-38,7239;-72,62386667;01-07-2016;21:51:03;110;22;26;104;1,84;100000
-38,7239;-72,62358333;01-07-2016;21:51:08;107;26;18;90;1,72;105000
-38,72391667;-72,62338333;01-07-2016;21:51:11;107;17;20;91;1,83;110000
-38,72396667;-72,62311667;01-07-2016;21:51:17;105;24;14;106;2,08;111000
-38,72405;-72,62313333;01-07-2016;21:51:22;105;10;7;185;2,11;113000
-38,72428333;-72,62335;01-07-2016;21:51:28;106;31;19;217;2,5;119000
-38,72466667;-72,62355;01-07-2016;21:51:35;108;47;24;202;2,48;129000
-38,7252;-72,62375;01-07-2016;21:51:43;108;62;28;197;2,63;128000
-38,7255;-72,62386667;01-07-2016;21:51:49;107;35;21;197;2,81;138000
-38,72561667;-72,62375;01-07-2016;21:51:54;106;17;13;140;2,56;134000
-38,72565;-72,6237;01-07-2016;21:51:55;106;5;17;116;2,73;136000
-38,72576667;-72,62316667;01-07-2016;21:52:03;103;47;21;106;2,83;134000
-38,72586667;-72,62265;01-07-2016;21:52:11;100;46;21;104;3,24;142000
-38,7259;-72,62251667;01-07-2016;21:52:16;100;12;9;106;2,74;136000
-38,7259;-72,6225;01-07-2016;21:52:18;100;2;3;91;2,26;134000
-38,72585;-72,62241667;01-07-2016;21:52:22;100;9;8;53;2,54;131000
-38,72558333;-72,62231667;01-07-2016;21:52:28;102;29;18;16;2,06;122000
-38,7253;-72,62221667;01-07-2016;21:52:34;103;33;20;15;1,87;123000
-38,7251;-72,62215;01-07-2016;21:52:40;106;23;14;14;1,86;124000
-38,72486667;-72,62208333;01-07-2016;21:52:45;109;26;19;14;1,75;124000
-38,72436667;-72,6219;01-07-2016;21:52:53;114;59;27;16;1,61;126000
-38,72426667;-72,62186667;01-07-2016;21:52:57;115;11;10;15;1,64;167000
-38,72423333;-72,62185;01-07-2016;21:53:00;116;3;3;22;1,65;139000
-38,72425;-72,62168333;01-07-2016;21:53:06;118;14;9;92;1,55;133000
-38,72428333;-72,62153333;01-07-2016;21:53:09;118;15;17;108;1,55;140000
-38,72435;-72,62121667;01-07-2016;21:53:16;120;28;14;106;1,56;131000
-38,72436667;-72,62111667;01-07-2016;21:53:28;120;9;3;97;1,44;120000
-38,72436667;-72,62098333;01-07-2016;21:53:34;119;12;7;92;1,64;137000
-38,72446667;-72,62096667;01-07-2016;21:53:39;119;12;8;170;1,81;139000
-38,7248;-72,62108333;01-07-2016;21:53:46;120;37;19;195;1,53;175000
-38,72525;-72,62123333;01-07-2016;21:53:53;119;52;27;196;1,18;160000
-38,72543333;-72,6213;01-07-2016;21:53:56;118;21;25;196;1,03;171000
-38,72556667;-72,62123333;01-07-2016;21:54:00;118;16;15;158;0,976;178000
-38,72566667;-72,62085;01-07-2016;21:54:05;117;36;26;108;1,05;192000
-38,7257;-72,6207;01-07-2016;21:54:07;117;14;25;109;0,974;188000
-38,72586667;-72,62046667;01-07-2016;21:54:11;117;27;24;133;0,999;170000
-38,72628333;-72,62008333;01-07-2016;21:54:18;117;56;29;145;1,03;192000
-38,72638333;-72,62;01-07-2016;21:54:22;117;14;13;148;1,3;194000
-38,72648333;-72,61991667;01-07-2016;21:54:28;117;13;8;145;1,35;191000
-38,72643333;-72,61978333;01-07-2016;21:54:32;117;13;11;62;1,33;169000
-38,72625;-72,61953333;01-07-2016;21:54:37;116;31;22;48;1,41;185000
-38,72598333;-72,61911667;01-07-2016;21:54:43;116;47;28;51;1,36;166000
-38,72558333;-72,61855;01-07-2016;21:54:51;116;65;29;48;0,999;166000
-38,72521667;-72,618;01-07-2016;21:54:58;117;64;33;50;1,22;161000
-38,72471667;-72,61731667;01-07-2016;21:55:07;121;80;32;47;1,49;172000
-38,72456667;-72,61715;01-07-2016;21:55:12;123;23;17;40;1,54;163000
-38,72453333;-72,6171;01-07-2016;21:55:17;126;5;4;41;1,52;154000
-38,7245;-72,61706667;01-07-2016;21:55:24;128;5;3;46;1,31;151000
-38,72443333;-72,61701667;01-07-2016;21:55:36;129;8;3;32;1,51;150000
-38,72441667;-72,61701667;01-07-2016;21:55:37;129;1;5;15;1,47;158000
-38,72428333;-72,6171;01-07-2016;21:55:42;130;17;12;333;1,46;158000
-38,72408333;-72,61751667;01-07-2016;21:55:48;132;43;26;302;1,7;159000
-38,72366667;-72,618;01-07-2016;21:55:54;134;61;36;318;1,67;154000
-38,7235;-72,61813333;01-07-2016;21:55:56;135;23;41;328;1,77;152000
-38,723;-72,61835;01-07-2016;21:56:02;138;60;36;341;1,58;148000
-38,72246667;-72,61845;01-07-2016;21:56:08;141;60;36;352;1,39;145000
-38,72195;-72,61856667;01-07-2016;21:56:14;145;58;35;350;1,43;146000
-38,72181667;-72,61853333;01-07-2016;21:56:18;147;15;14;9;1,74;143000
-38,72181667;-72,61843333;01-07-2016;21:56:21;148;9;11;97;1,83;142000
-38,72193333;-72,61801667;01-07-2016;21:56:27;151;38;23;110;1,56;138000
-38,7221;-72,61733333;01-07-2016;21:56:34;153;62;32;107;1,55;137000
-38,72208333;-72,61708333;01-07-2016;21:56:38;153;22;20;85;1,57;132000
-38,72203333;-72,61705;01-07-2016;21:56:39;153;6;21;29;1,18;129000
-38,72155;-72,61685;01-07-2016;21:56:46;150;57;29;17;1,15;120000
-38,72105;-72,61663333;01-07-2016;21:56:53;148;59;30;18;1,2;122000
-38,72093333;-72,61658333;01-07-2016;21:56:57;147;15;13;17;1,3;116000
-38,72085;-72,6167;01-07-2016;21:57:01;146;12;11;311;2,32;134000
-38,72073333;-72,61716667;01-07-2016;21:57:08;144;43;22;288;2,48;146000
-38,72063333;-72,61756667;01-07-2016;21:57:14;142;37;22;287;2,49;144000
-38,72058333;-72,61781667;01-07-2016;21:57:18;141;22;20;286;2,1;145000
-38,72043333;-72,61841667;01-07-2016;21:57:25;140;55;29;288;3,05;133000
-38,72031667;-72,61888333;01-07-2016;21:57:31;142;42;25;287;2,21;138000
-38,72028333;-72,61901667;01-07-2016;21:57:35;142;12;11;292;1,67;136000
-38,72023333;-72,61905;01-07-2016;21:57:38;142;6;8;326;1,3;122000
-38,71998333;-72,61895;01-07-2016;21:57:44;143;28;17;18;1,5;117000
-38,71963333;-72,61873333;01-07-2016;21:57:51;144;43;22;25;1,02;97700
-38,7196;-72,61871667;01-07-2016;21:57:52;144;5;18;21;0,851;91700
-38,71928333;-72,61861667;01-07-2016;21:57:58;145;37;22;15;0,893;90800
-38,7191;-72,61856667;01-07-2016;21:58:02;145;20;18;12;1,42;110000
-38,71885;-72,61851667;01-07-2016;21:58:08;145;29;18;8;1,37;110000
-38,7185;-72,6184;01-07-2016;21:58:13;145;40;29;15;1,35;105000
-38,71831667;-72,61833333;01-07-2016;21:58:17;145;20;18;13;1,04;97200
-38,71826667;-72,61833333;01-07-2016;21:58:21;146;6;6;10;1,04;97400
-38,7182;-72,61843333;01-07-2016;21:58:25;146;12;10;308;0,987;95300
-38,71813333;-72,61875;01-07-2016;21:58:31;147;28;17;284;0,927;97800
-38,71811667;-72,61886667;01-07-2016;21:58:35;147;12;10;287;1,12;117000
-38,71801667;-72,6189;01-07-2016;21:58:39;147;10;9;345;1,51;104000
-38,71761667;-72,6188;01-07-2016;21:58:46;147;45;23;11;1,62;125000
-38,7171;-72,61865;01-07-2016;21:58:53;145;60;31;13;0,673;114000
-38,71673333;-72,61853333;01-07-2016;21:58:58;142;42;30;14;0,687;86000
-38,71651667;-72,61846667;01-07-2016;21:59:02;140;24;22;14;0,955;110000
-38,71611667;-72,61835;01-07-2016;21:59:09;136;46;24;13;0,692;111000
-38,71558333;-72,61818333;01-07-2016;21:59:16;131;62;32;13;0,557;83000
-38,71521667;-72,61806667;01-07-2016;21:59:22;127;42;25;15;0,516;77900
-38,71475;-72,61791667;01-07-2016;21:59:30;120;52;23;14;0,524;57000
-38,71466667;-72,61788333;01-07-2016;21:59:33;117;11;13;16;0,471;57400
-38,71456667;-72,61768333;01-07-2016;21:59:37;115;21;19;59;0,463;56200
-38,7145;-72,61716667;01-07-2016;21:59:42;112;46;33;81;0,446;57700
-38,71448333;-72,61631667;01-07-2016;21:59:48;109;74;44;88;0,445;66800
-38,71451667;-72,6155;01-07-2016;21:59:54;109;71;42;94;0,489;64500
-38,71466667;-72,61506667;01-07-2016;21:59:58;110;41;37;114;0,815;94100
-38,71521667;-72,61411667;01-07-2016;22:00:08;112;102;37;126;1,45;106000
-38,71533333;-72,6139;01-07-2016;22:00:11;113;24;29;126;1,83;128000
-38,71573333;-72,61328333;01-07-2016;22:00:19;114;69;31;130;1,95;135000
-38,7159;-72,61298333;01-07-2016;22:00:24;115;33;24;126;2,16;133000
-38,71605;-72,61283333;01-07-2016;22:00:31;116;21;11;138;2,12;138000
-38,71631667;-72,61253333;01-07-2016;22:00:38;117;40;21;139;2,09;148000
-38,71645;-72,6124;01-07-2016;22:00:41;117;19;22;145;2,07;149000
-38,7169;-72,61225;01-07-2016;22:00:49;115;51;23;165;1,82;136000
-38,71708333;-72,61225;01-07-2016;22:00:52;115;20;24;181;0,661;62400
-38,71748333;-72,61238333;01-07-2016;22:01:00;114;46;21;194;0,514;66700
-38,71791667;-72,6126;01-07-2016;22:01:08;113;52;24;201;0,604;64000
-38,71813333;-72,61268333;01-07-2016;22:01:13;113;25;18;199;0,606;62100
-38,71838333;-72,6128;01-07-2016;22:01:19;113;30;18;199;0,687;64900
-38,7189;-72,61301667;01-07-2016;22:01:27;115;60;27;198;0,811;55600
-38,7191;-72,6131;01-07-2016;22:01:30;115;24;29;199;0,684;49200
-38,71926667;-72,61315;01-07-2016;22:01:33;116;19;23;194;0,503;49900
-38,71951667;-72,61326667;01-07-2016;22:01:40;119;29;15;200;0,457;54500
-38,71955;-72,61328333;01-07-2016;22:01:41;120;4;15;207;0,487;61200
-38,71981667;-72,6136;01-07-2016;22:01:49;123;40;18;221;0,539;58200
-38,71986667;-72,61365;01-07-2016;22:01:54;124;8;6;226;0,635;62200
-38,71991667;-72,61368333;01-07-2016;22:02:00;125;7;4;205;1,12;90200
-38,7201;-72,61356667;01-07-2016;22:02:06;126;23;14;150;0,985;85500
-38,72036667;-72,6132;01-07-2016;22:02:14;129;44;20;133;0,977;83700
-38,7206;-72,61288333;01-07-2016;22:02:20;131;37;22;133;0,752;72000
-38,72098333;-72,61238333;01-07-2016;22:02:28;134;60;27;135;0,615;62300
-38,7214;-72,61183333;01-07-2016;22:02:36;137;68;30;134;0,656;64000
-38,72185;-72,61123333;01-07-2016;22:02:45;138;72;29;133;0,681;67500
-38,72193333;-72,61111667;01-07-2016;22:02:48;139;13;15;135;0,728;107000
-38,7221;-72,61123333;01-07-2016;22:02:53;140;21;15;207;0,847;99400
-38,7222;-72,61133333;01-07-2016;22:02:55;140;15;27;213;1,28;118000
-38,72266667;-72,61151667;01-07-2016;22:03:02;141;54;28;198;1,26;149000
-38,72313333;-72,61173333;01-07-2016;22:03:09;140;55;28;199;1,22;119000
-38,7237;-72,61196667;01-07-2016;22:03:16;137;67;34;198;1,5;119000
-38,72436667;-72,61223333;01-07-2016;22:03:24;131;76;34;198;1,4;149000
-38,72501667;-72,6125;01-07-2016;22:03:31;126;77;40;197;1,35;139000
-38,72561667;-72,61273333;01-07-2016;22:03:38;122;69;36;198;0,993;105000
-38,72573333;-72,6128;01-07-2016;22:03:40;120;15;27;199;0,743;102000
-38,72603333;-72,6131;01-07-2016;22:03:47;116;42;22;219;0,765;88600
-38,72615;-72,61323333;01-07-2016;22:03:53;114;18;11;223;1,06;97100
-38,72616667;-72,61326667;01-07-2016;22:04:00;113;3;1,4;214;1,05;109000
-38,72621667;-72,61328333;01-07-2016;22:04:05;112;5;4;200;1,08;105000
-38,72638333;-72,61311667;01-07-2016;22:04:10;111;24;17;145;1,04;136000
-38,72663333;-72,6128;01-07-2016;22:04:15;110;39;28;135;1,16;135000
-38,72683333;-72,61255;01-07-2016;22:04:20;108;31;22;134;1,03;125000
-38,72696667;-72,61236667;01-07-2016;22:04:24;107;21;19;134;0,996;102000
-38,72698333;-72,6122;01-07-2016;22:04:28;107;16;14;100;0,951;94000
-38,72696667;-72,61216667;01-07-2016;22:04:29;106;4;15;35;1,01;143000
-38,72671667;-72,612;01-07-2016;22:04:34;105;31;22;29;0,944;117000
-38,72631667;-72,61166667;01-07-2016;22:04:40;104;53;32;32;0,948;112000
-38,7257;-72,6112;01-07-2016;22:04:49;108;79;32;31;0,961;110000
-38,72565;-72,61115;01-07-2016;22:04:50;109;7;24;38;0,915;106000
-38,72561667;-72,61095;01-07-2016;22:04:55;111;18;13;78;0,932;98200
-38,72565;-72,61091667;01-07-2016;22:04:56;111;5;16;144;0,97;92800
-38,726;-72,6106;01-07-2016;22:05:03;113;48;25;144;0,961;99000
-38,72618333;-72,61045;01-07-2016;22:05:08;114;23;16;146;0,989;92100
-38,72631667;-72,61031667;01-07-2016;22:05:15;114;20;10;144;0,827;83700
-38,72645;-72,61018333;01-07-2016;22:05:20;114;18;13;142;0,724;73700
-38,72675;-72,60991667;01-07-2016;22:05:26;114;40;24;145;0,348;53700
-38,7271;-72,60961667;01-07-2016;22:05:32;112;48;29;146;0,333;49400
-38,72725;-72,60948333;01-07-2016;22:05:37;112;21;15;145;0,405;48100
-38,72736667;-72,60938333;01-07-2016;22:05:42;112;15;11;148;0,46;60100
-38,72768333;-72,60901667;01-07-2016;22:05:49;112;47;24;137;0,473;59000
-38,72785;-72,60866667;01-07-2016;22:05:53;111;37;33;122;0,461;58000
-38,728;-72,60786667;01-07-2016;22:06:00;111;71;37;103;0,301;51500
-38,72798333;-72,60711667;01-07-2016;22:06:06;111;65;39;89;0,257;48500
-38,72783333;-72,60625;01-07-2016;22:06:13;112;77;40;78;0,265;40100
-38,72781667;-72,60613333;01-07-2016;22:06:14;112;10;38;81;0,153;35300
-38,72788333;-72,60533333;01-07-2016;22:06:21;114;70;36;96;0,219;33700
-38,72791667;-72,60496667;01-07-2016;22:06:25;115;32;28;95;0,213;35500
-38,72793333;-72,60478333;01-07-2016;22:06:28;115;17;20;99;0,22;33200
-38,72811667;-72,60448333;01-07-2016;22:06:34;117;32;19;127;0,225;31700
-38,7283;-72,60433333;01-07-2016;22:06:38;118;24;21;149;0,122;30600
-38,72833333;-72,60416667;01-07-2016;22:06:42;119;15;14;103;0,138;21400
-38,72828333;-72,60406667;01-07-2016;22:06:44;119;11;19;61;0,183;27300
-38,72798333;-72,60366667;01-07-2016;22:06:51;119;48;25;46;0,186;29100
-38,72793333;-72,60361667;01-07-2016;22:06:52;119;6;23;33;0,195;27300
-38,7277;-72,60348333;01-07-2016;22:06:57;119;29;21;25;0,194;27800
-38,72741667;-72,60313333;01-07-2016;22:07:03;118;44;26;43;0,296;47900
-38,72736667;-72,60305;01-07-2016;22:07:04;118;8;30;58;0,982;64500
-38,72716667;-72,60263333;01-07-2016;22:07:10;117;43;26;58;0,964;54300
-38,72703333;-72,60241667;01-07-2016;22:07:17;116;24;12;53;0,989;58400
-38,727;-72,6024;01-07-2016;22:07:18;116;4;13;21;0,985;52900
-38,72685;-72,60225;01-07-2016;22:07:22;117;22;20;35;1,05;55500
-38,72675;-72,60218333;01-07-2016;22:07:24;117;13;23;27;0,979;59900
-38,72623333;-72,60201667;01-07-2016;22:07:33;118;58;23;14;0,823;53500
-38,72613333;-72,60198333;01-07-2016;22:07:38;118;13;9;13;0,64;54400
-38,7261;-72,60198333;01-07-2016;22:07:41;118;2;2;12;0,657;50700
-38,72605;-72,60208333;01-07-2016;22:07:45;117;11;10;308;0,711;57600
-38,72601667;-72,60246667;01-07-2016;22:07:52;117;34;17;276;0,77;51300
-38,72601667;-72,60251667;01-07-2016;22:07:53;117;4;13;264;0,77;51700
-38,72615;-72,60263333;01-07-2016;22:07:57;117;18;16;219;0,813;51700
-38,72656667;-72,60301667;01-07-2016;22:08:05;116;57;26;216;0,731;50400
-38,72695;-72,60348333;01-07-2016;22:08:13;115;58;26;223;0,879;59900
-38,7271;-72,60363333;01-07-2016;22:08:20;115;22;11;219;1,12;53400
-38,72713333;-72,60363333;01-07-2016;22:08:26;114;2;1,4;181;0,754;47200
-38,72711667;-72,60363333;01-07-2016;22:08:47;114;2;0,3;42;0,382;33400
-38,727;-72,60353333;01-07-2016;22:08:52;113;14;10;32;0,402;33100
-38,7267;-72,60316667;01-07-2016;22:09:00;112;47;21;43;0,4;31200
-38,72648333;-72,60293333;01-07-2016;22:09:06;112;31;18;41;0,495;31400
-38,72646667;-72,60293333;01-07-2016;22:09:07;112;3;11;8;0,466;30600
-38,7264;-72,60306667;01-07-2016;22:09:11;112;13;12;303;0,289;28400
-38,72636667;-72,6036;01-07-2016;22:09:19;111;47;21;274;0,23;27600
-38,72635;-72,604;01-07-2016;22:09:25;110;35;21;275;0,231;24900
-38,72615;-72,6043;01-07-2016;22:09:31;110;33;20;309;0,219;24200
-38,72603333;-72,60435;01-07-2016;22:09:34;110;15;18;345;0,211;23300
-38,7258;-72,60436667;01-07-2016;22:09:41;109;25;13;355;0,206;22400
-38,72556667;-72,6046;01-07-2016;22:09:47;110;34;20;323;0,198;22000
-38,72528333;-72,6049;01-07-2016;22:09:53;110;40;24;319;0,19;21700
-38,72498333;-72,60521667;01-07-2016;22:09:59;110;44;27;321;0,189;21400
-38,72476667;-72,60545;01-07-2016;22:10:04;111;32;23;321;0,128;20900
-38,7247;-72,6055;01-07-2016;22:10:08;111;9;8;332;0,128;18000
-38,72456667;-72,60531667;01-07-2016;22:10:13;110;22;16;48;0,161;20000
-38,72453333;-72,60526667;01-07-2016;22:10:14;110;6;20;51;0,49;24200
-38,7243;-72,60493333;01-07-2016;22:10:20;109;37;22;49;0,226;23000
-38,72418333;-72,60473333;01-07-2016;22:10:25;109;22;16;54;0,175;43900
-38,72418333;-72,60468333;01-07-2016;22:10:27;109;5;9;74;0,168;44600
-38,7243;-72,6044;01-07-2016;22:10:32;109;28;20;119;0,262;26400
-38,72436667;-72,60423333;01-07-2016;22:10:34;109;15;28;117;0,19;25300
-38,72456667;-72,60348333;01-07-2016;22:10:42;110;69;31;108;0,172;25400
-38,72463333;-72,60331667;01-07-2016;22:10:44;110;17;30;121;0,207;25600
-38,72473333;-72,60316667;01-07-2016;22:10:46;110;16;29;129;0,249;27300
-38,72501667;-72,60295;01-07-2016;22:10:50;110;37;33;149;0,286;26300
-38,72578333;-72,6027;01-07-2016;22:10:59;109;87;35;166;0,547;48300
-38,72595;-72,60265;01-07-2016;22:11:03;108;20;18;167;0,795;48000
-38,72605;-72,60258333;01-07-2016;22:11:08;108;12;8;151;0,525;41800
-38,72608333;-72,60215;01-07-2016;22:11:16;108;38;17;97;0,535;52500
-38,72611667;-72,60173333;01-07-2016;22:11:22;107;36;22;96;0,567;56700
-38,72618333;-72,60103333;01-07-2016;22:11:29;107;61;31;96;0,546;60800
-38,72621667;-72,60035;01-07-2016;22:11:36;106;60;31;94;0,81;66700
-38,72623333;-72,60006667;01-07-2016;22:11:41;106;24;17;96;0,521;62200
-38,72626667;-72,59968333;01-07-2016;22:11:46;106;34;24;95;0,538;58800
-38,72631667;-72,59886667;01-07-2016;22:11:55;107;72;29;95;0,604;64600
-38,72631667;-72,5988;01-07-2016;22:11:56;107;5;19;94;0,877;60500
-38,72641667;-72,59855;01-07-2016;22:12:02;107;24;14;118;0,908;64900
-38,72646667;-72,59856667;01-07-2016;22:12:03;107;5;19;185;0,965;69300
-38,72713333;-72,59878333;01-07-2016;22:12:10;109;75;39;194;0,948;69800
-38,72795;-72,59903333;01-07-2016;22:12:18;110;94;42;193;1,03;71700
-38,72898333;-72,5993;01-07-2016;22:12:27;111;118;47;192;1,13;72200
-38,72948333;-72,59943333;01-07-2016;22:12:32;113;56;41;192;1,2;72900
-38,73023333;-72,59963333;01-07-2016;22:12:41;115;85;34;191;1,3;74800
-38,73085;-72,59978333;01-07-2016;22:12:49;115;70;31;191;1,25;78700
-38,7315;-72,59995;01-07-2016;22:12:58;115;75;30;192;1,31;78500
-38,73163333;-72,59991667;01-07-2016;22:13:02;115;15;13;165;1,2;78100
-38,73163333;-72,59986667;01-07-2016;22:13:03;114;4;13;94;1,2;78100
-38,73166667;-72,5995;01-07-2016;22:13:08;114;32;23;95;1,25;86100
-38,73175;-72,5988;01-07-2016;22:13:15;115;62;32;99;1,22;153000
-38,73183333;-72,59818333;01-07-2016;22:13:21;115;55;33;100;1,13;82500
-38,73191667;-72,59758333;01-07-2016;22:13:28;115;53;27;100;1,11;75000
-38,73193333;-72,59738333;01-07-2016;22:13:33;115;17;12;94;1,1;73600
-38,73193333;-72,59716667;01-07-2016;22:13:39;115;19;11;92;1,04;74000
-38,73205;-72,59666667;01-07-2016;22:13:46;115;45;23;105;0,975;74700
-38,7321;-72,5964;01-07-2016;22:13:49;115;24;29;105;1,1;90700
-38,73216667;-72,59608333;01-07-2016;22:13:53;115;28;26;106;1,07;82600
-38,73225;-72,59573333;01-07-2016;22:13:59;115;31;18;105;0,92;77600
-38,73241667;-72,59573333;01-07-2016;22:14:04;115;19;14;176;0,947;84800
-38,73263333;-72,59576667;01-07-2016;22:14:09;115;25;18;188;0,97;71300
-38,73293333;-72,59585;01-07-2016;22:14:16;115;35;18;192;0,918;71400
-38,73315;-72,5959;01-07-2016;22:14:22;115;25;15;190;0,897;93100
-38,7332;-72,59591667;01-07-2016;22:14:27;115;6;4;190;0,887;77100
-38,7333;-72,59593333;01-07-2016;22:14:31;115;11;10;189;0,792;65600
-38,73346667;-72,59596667;01-07-2016;22:14:35;115;18;16;189;0,777;63900
-38,7336;-72,59598333;01-07-2016;22:14:38;116;14;17;185;0,811;63400
-38,73378333;-72,59601667;01-07-2016;22:14:44;116;22;13;190;0,841;68400
-38,73398333;-72,59606667;01-07-2016;22:14:50;116;22;13;190;0,888;67000
-38,73418333;-72,59611667;01-07-2016;22:14:57;116;23;12;192;0,905;65300
-38,7342;-72,59611667;01-07-2016;22:15:05;116;1;0,5;194;0,951;66300
-38,7342;-72,59611667;01-07-2016;22:15:24;116;1;0,2;186;0,931;70500
-38,73425;-72,59605;01-07-2016;22:15:28;115;9;8;139;1,11;78700
-38,73433333;-72,59568333;01-07-2016;22:15:34;116;34;20;106;1,3;81500
-38,73441667;-72,59523333;01-07-2016;22:15:40;116;39;23;104;1,16;84800
-38,73448333;-72,59478333;01-07-2016;22:15:48;115;40;18;100;1,22;83600
-38,73456667;-72,5943;01-07-2016;22:15:53;115;43;31;103;1,17;83500
-38,7347;-72,5935;01-07-2016;22:16:00;116;70;36;102;1,14;81500
-38,73486667;-72,59248333;01-07-2016;22:16:09;116;90;36;102;1,11;82300
-38,73488333;-72,59231667;01-07-2016;22:16:12;116;15;18;96;1,1;81300
-38,73475;-72,59221667;01-07-2016;22:16:16;116;17;15;30;1,04;77800
-38,73441667;-72,59216667;01-07-2016;22:16:22;117;38;23;7;1,12;84600
-38,73401667;-72,59208333;01-07-2016;22:16:29;117;44;23;10;0,951;79700
-38,73391667;-72,59205;01-07-2016;22:16:33;118;11;10;14;1,2;77600
-38,7338;-72,59201667;01-07-2016;22:16:37;118;14;13;9;1,28;84900
-38,73348333;-72,59195;01-07-2016;22:16:42;118;37;26;10;1,19;105000
-38,733;-72,59185;01-07-2016;22:16:49;118;53;27;9;1,19;102000
-38,73288333;-72,5918;01-07-2016;22:16:53;118;15;13;17;1,16;83300
-38,73285;-72,59176667;01-07-2016;22:16:56;118;5;6;39;1,09;81700
-38,73286667;-72,59146667;01-07-2016;22:17:02;118;27;16;97;1,08;74400
-38,73295;-72,59078333;01-07-2016;22:17:10;118;59;27;98;1,11;77400
-38,73298333;-72,59051667;01-07-2016;22:17:15;119;24;17;98;1,22;82300
-38,733;-72,59045;01-07-2016;22:17:16;119;5;20;101;1,27;77200
-38,73308333;-72,58996667;01-07-2016;22:17:22;119;44;27;104;1,16;79200
-38,73315;-72,58936667;01-07-2016;22:17:29;120;51;26;98;1,45;88900
-38,73316667;-72,58913333;01-07-2016;22:17:33;121;20;18;96;1,54;92800
-38,73308333;-72,58903333;01-07-2016;22:17:37;122;13;12;44;1,66;91000
-38,73301667;-72,58901667;01-07-2016;22:17:39;122;9;16;7;1,61;91200
-38,73265;-72,58898333;01-07-2016;22:17:45;122;40;24;5;1,57;90300
-38,73206667;-72,58885;01-07-2016;22:17:53;123;66;30;10;1,7;87400
-38,73195;-72,5888;01-07-2016;22:17:56;124;14;17;19;1,81;99400
-38,73191667;-72,58866667;01-07-2016;22:18:00;124;13;11;75;1,68;100000
-38,73196667;-72,58845;01-07-2016;22:18:04;125;19;17;105;1,66;90500
-38,73201667;-72,5882;01-07-2016;22:18:08;126;23;21;102;1,59;88900
-38,73211667;-72,58758333;01-07-2016;22:18:16;126;54;24;102;1,52;89000
-38,73211667;-72,58753333;01-07-2016;22:18:19;126;6;7;104;1,49;89300
-38,73201667;-72,58743333;01-07-2016;22:18:23;126;13;12;35;1,55;85700
-38,73166667;-72,58735;01-07-2016;22:18:29;125;41;25;12;1,58;86200
-38,73098333;-72,58718333;01-07-2016;22:18:36;125;76;39;10;1,61;86400
-38,7301;-72,58696667;01-07-2016;22:18:45;123;101;41;11;1,67;96900
-38,72926667;-72,58676667;01-07-2016;22:18:53;123;94;42;10;1,6;98900
-38,72893333;-72,58668333;01-07-2016;22:18:57;123;37;33;13;1,65;100000
-38,72878333;-72,58651667;01-07-2016;22:19:01;122;22;20;39;1,86;103000
-38,72875;-72,58636667;01-07-2016;22:19:03;121;14;24;78;1,87;113000
-38,72873333;-72,58563333;01-07-2016;22:19:10;119;64;33;88;1,55;106000
-38,72873333;-72,58551667;01-07-2016;22:19:11;119;10;35;85;1,57;98700
-38,72856667;-72,58461667;01-07-2016;22:19:20;118;82;33;77;1,77;104000
-38,72825;-72,58396667;01-07-2016;22:19:27;117;66;34;58;1,51;99000
-38,72786667;-72,58326667;01-07-2016;22:19:34;117;74;38;55;1,44;95100
-38,72771667;-72,58298333;01-07-2016;22:19:38;117;29;26;56;1,46;92300
-38,72768333;-72,58293333;01-07-2016;22:19:40;117;6;10;61;1,43;92800
-38,7277;-72,58288333;01-07-2016;22:19:43;117;5;6;113;1,45;95300
-38,72776667;-72,58286667;01-07-2016;22:19:47;117;7;7;177;1,5;99100
-38,72808333;-72,58295;01-07-2016;22:19:54;117;36;18;191;1,45;103000
-38,72851667;-72,58308333;01-07-2016;22:20:01;116;50;26;194;1,23;97800
-38,72883333;-72,58318333;01-07-2016;22:20:07;117;36;22;194;1,13;91000
-38,7291;-72,58325;01-07-2016;22:20:13;118;30;18;191;1,13;79200
-38,72916667;-72,58323333;01-07-2016;22:20:18;118;8;6;173;1,16;80200
-38,72916667;-72,58311667;01-07-2016;22:20:22;118;10;9;87;1,14;82700
-38,72901667;-72,58276667;01-07-2016;22:20:28;118;35;21;60;1,17;81700
-38,72883333;-72,5824;01-07-2016;22:20:33;117;38;28;59;1,1;79900
-38,72875;-72,5822;01-07-2016;22:20:38;117;19;14;60;1,11;80200
-38,72863333;-72,58198333;01-07-2016;22:20:42;117;22;20;56;1,1;82900
-38,7284;-72,58143333;01-07-2016;22:20:49;117;55;28;62;1,08;79700
-38,72811667;-72,58086667;01-07-2016;22:20:55;118;59;35;57;1,13;79600
-38,72781667;-72,58016667;01-07-2016;22:21:02;117;68;35;62;1,34;81700
-38,7277;-72,57993333;01-07-2016;22:21:05;117;25;30;59;1,12;77700
-38,72771667;-72,57975;01-07-2016;22:21:10;117;15;11;94;1,15;78800
-38,7278;-72,57973333;01-07-2016;22:21:12;117;9;16;170;1,13;77100
-38,72788333;-72,57971667;01-07-2016;22:21:14;117;11;19;173;1,2;78700
-38,7281;-72,57973333;01-07-2016;22:21:20;116;23;14;182;1,1;78900
-38,72808333;-72,57975;01-07-2016;22:21:28;115;2;1,1;323;1,54;89900
-38,72791667;-72,57986667;01-07-2016;22:21:40;113;21;6;331;1,7;99900
-38,72786667;-72,57988333;01-07-2016;22:21:48;111;6;3;351;1,69;96800
-38,72786667;-72,57986667;01-07-2016;22:21:50;111;1;3;108;1,78;114000
-38,72786667;-72,57973333;01-07-2016;22:21:55;111;11;8;88;1,68;105000
-38,72773333;-72,5795;01-07-2016;22:22:01;110;25;15;53;1,71;105000
-38,72745;-72,57898333;01-07-2016;22:22:09;109;54;24;54;1,76;102000
-38,72698333;-72,57823333;01-07-2016;22:22:20;108;83;27;52;1,59;103000
-38,72656667;-72,57756667;01-07-2016;22:22:30;108;75;27;51;1,84;95300
-38,72621667;-72,57696667;01-07-2016;22:22:39;106;65;26;53;1,78;81800
-38,72606667;-72,5768;01-07-2016;22:22:44;105;22;16;42;1,66;100000
-38,72603333;-72,57676667;01-07-2016;22:22:48;104;5;5;40;1,59;122000
-38,72588333;-72,57683333;01-07-2016;22:22:53;103;18;13;340;1,64;123000
-38,72573333;-72,57691667;01-07-2016;22:22:58;103;18;13;335;1,54;112000
-38,72541667;-72,57703333;01-07-2016;22:23:03;103;36;26;344;1,26;95800
-38,72495;-72,57721667;01-07-2016;22:23:09;104;55;33;343;1,29;92300
-38,72471667;-72,5773;01-07-2016;22:23:15;104;26;16;347;1,26;73600
-38,72445;-72,5774;01-07-2016;22:23:20;105;32;23;342;0,963;70600
-38,72398333;-72,5776;01-07-2016;22:23:26;105;53;32;342;0,982;69400
-38,72386667;-72,57766667;01-07-2016;22:23:29;106;15;18;337;0,996;68600
-38,7238;-72,57751667;01-07-2016;22:23:34;105;15;11;59;0,969;70500
-38,7237;-72,5771;01-07-2016;22:23:39;106;38;27;73;0,925;68500
-38,72356667;-72,5766;01-07-2016;22:23:45;107;46;28;71;0,827;59200
-38,72351667;-72,57645;01-07-2016;22:23:50;108;14;10;72;0,843;57900
-38,72345;-72,57618333;01-07-2016;22:23:55;109;24;17;71;0,684;56700
-38,72331667;-72,57565;01-07-2016;22:24:01;111;49;29;72;0,671;47200
-38,72321667;-72,57528333;01-07-2016;22:24:06;112;33;24;72;0,675;48700
-38,72318333;-72,57518333;01-07-2016;22:24:10;112;10;9;71;0,835;56900
-38,72305;-72,57516667;01-07-2016;22:24:14;112;16;14;3;1,15;69600
-38,7225;-72,57538333;01-07-2016;22:24:22;112;63;28;342;1,21;71300
-38,72185;-72,5757;01-07-2016;22:24:31;112;79;31;340;1,37;66200
-38,72163333;-72,57576667;01-07-2016;22:24:35;112;24;22;346;0,963;60200
-38,7216;-72,57576667;01-07-2016;22:24:36;112;4;14;353;0,937;60000
-38,72136667;-72,5756;01-07-2016;22:24:41;112;29;21;31;1,03;61400
-38,7212;-72,57538333;01-07-2016;22:24:44;112;27;32;44;0,834;57500
-38,72105;-72,57505;01-07-2016;22:24:48;111;34;30;60;0,819;58300
-38,72083333;-72,57423333;01-07-2016;22:24:57;111;76;30;72;0,799;55200
-38,7207;-72,57373333;01-07-2016;22:25:04;111;45;23;71;0,794;54800
-38,7207;-72,5737;01-07-2016;22:25:05;111;3;11;79;0,84;55100
-38,72061667;-72,57353333;01-07-2016;22:25:12;111;17;9;60;0,935;65700
-38,72053333;-72,57336667;01-07-2016;22:25:18;111;17;10;56;0,871;63800
-38,7205;-72,57318333;01-07-2016;22:25:24;112;17;10;74;0,893;65200
-38,72046667;-72,57301667;01-07-2016;22:25:30;113;13;8;78;0,817;63900
-38,7204;-72,57266667;01-07-2016;22:25:35;113;32;23;75;0,639;50400
-38,72018333;-72,57173333;01-07-2016;22:25:45;113;85;31;74;0,617;50600
-38,72;-72,57095;01-07-2016;22:25:53;113;71;32;73;0,598;45300
-38,71995;-72,57075;01-07-2016;22:25:57;114;18;16;74;0,739;103000
-38,71988333;-72,57045;01-07-2016;22:26:02;114;26;19;74;0,75;79900
-38,7197;-72,56963333;01-07-2016;22:26:10;114;74;33;74;0,749;70100
-38,71966667;-72,56943333;01-07-2016;22:26:13;115;17;21;76;0,923;85100
-38,71965;-72,56935;01-07-2016;22:26:18;115;8;6;73;0,877;70100
-38,71963333;-72,56933333;01-07-2016;22:26:19;115;2;7;61;0,853;59500
-38,71946667;-72,56935;01-07-2016;22:26:24;115;19;14;352;0,833;68700
-38,71903333;-72,56953333;01-07-2016;22:26:31;116;51;26;343;0,892;84200
-38,71888333;-72,56958333;01-07-2016;22:26:34;116;17;20;346;0,879;64900
-38,71878333;-72,56935;01-07-2016;22:26:39;115;22;16;61;0,875;61900
-38,7187;-72,56888333;01-07-2016;22:26:44;115;42;30;75;0,893;59400
-38,71856667;-72,5683;01-07-2016;22:26:50;115;53;32;74;0,95;59900
-38,71853333;-72,56818333;01-07-2016;22:26:54;115;11;10;72;0,934;59500
-38,71853333;-72,56818333;01-07-2016;22:27:06;115;1;0,2;54;0,902;59800
-38,7184;-72,56818333;01-07-2016;22:27:11;115;15;11;2;0,859;59100
-38,71835;-72,5682;01-07-2016;22:27:12;115;6;22;344;0,841;57500
-38,71781667;-72,56838333;01-07-2016;22:27:20;114;61;27;344;0,713;55300
-38,71768333;-72,56845;01-07-2016;22:27:22;114;16;30;342;0,675;56700
-38,7173;-72,56858333;01-07-2016;22:27:29;113;43;22;345;0,634;52000
-38,71685;-72,56876667;01-07-2016;22:27:35;114;53;32;342;0,606;49800
-38,71653333;-72,56885;01-07-2016;22:27:40;114;37;26;347;0,588;33000
-38,71645;-72,56886667;01-07-2016;22:27:42;114;9;16;349;0,58;40600
-38,71638333;-72,5688;01-07-2016;22:27:48;115;10;6;38;0,575;34500
-38,71636667;-72,56875;01-07-2016;22:27:55;116;5;2;76;0,574;37700
-38,71635;-72,56866667;01-07-2016;22:28:17;116;8;1,3;69;0,531;32100
-38,71631667;-72,56861667;01-07-2016;22:28:24;115;5;2;56;0,545;30600
-38,7163;-72,56848333;01-07-2016;22:28:49;116;12;2;74;0,545;27000
-38,71618333;-72,56821667;01-07-2016;22:28:57;116;27;12;63;0,541;28300
-38,71613333;-72,56808333;01-07-2016;22:29:03;117;13;8;63;0,532;30500
-38,71615;-72,56803333;01-07-2016;22:29:11;117;5;2;115;0,519;32800
-38,71613333;-72,56793333;01-07-2016;22:29:16;117;9;6;72;0,485;35700
-38,71606667;-72,56781667;01-07-2016;22:29:23;117;12;6;54;0,484;30100
-38,71596667;-72,56771667;01-07-2016;22:29:34;119;13;4;42;0,461;31500
-38,7159;-72,56758333;01-07-2016;22:29:39;120;14;10;55;0,453;29600
-38,71586667;-72,56758333;01-07-2016;22:29:47;120;4;2;349;0,523;28500
-38,71586667;-72,56758333;01-07-2016;22:29:58;119;0;0;57;0,539;29400
-38,71591667;-72,56756667;01-07-2016;22:58:43;111;35;1,2;145;0,568;35000
-38,71583333;-72,56735;01-07-2016;22:58:50;110;19;10;65;0,583;34200
-38,71581667;-72,56731667;01-07-2016;22:58:52;110;5;8;52;0,525;38900
-38,71568333;-72,56736667;01-07-2016;22:58:57;110;16;11;345;0,493;78900
-38,71545;-72,5675;01-07-2016;22:59:05;110;28;13;335;0,538;86000
-38,7154;-72,56753333;01-07-2016;22:59:12;110;7;4;338;0,593;62700
-38,71536667;-72,56755;01-07-2016;22:59:19;110;4;2;337;0,568;48800
-38,71531667;-72,56756667;01-07-2016;22:59:24;111;4;3;343;0,557;41100
-38,71528333;-72,56758333;01-07-2016;22:59:28;111;5;5;346;0,585;48300
-38,71521667;-72,56751667;01-07-2016;22:59:32;111;9;8;37;0,682;39600
-38,71503333;-72,56708333;01-07-2016;22:59:40;112;43;19;63;0,768;37700
-38,71488333;-72,56663333;01-07-2016;22:59:48;113;43;19;65;0,697;36100
-38,71476667;-72,56633333;01-07-2016;22:59:53;113;29;21;65;0,682;35200
-38,71453333;-72,5661;01-07-2016;22:59:58;113;32;23;37;0,668;49200
-38,71446667;-72,56608333;01-07-2016;22:59:59;113;8;27;10;0,747;65100
-38,71363333;-72,56595;01-07-2016;23:00:10;114;94;31;8;0,585;49500
-38,71355;-72,56593333;01-07-2016;23:00:11;114;8;30;11;0,577;44000
-38,7132;-72,56573333;01-07-2016;23:00:17;114;43;26;24;0,517;58400
-38,71313333;-72,56561667;01-07-2016;23:00:21;115;13;12;49;0,534;47500
-38,71313333;-72,56556667;01-07-2016;23:00:22;115;4;14;88;0,564;53000
-38,71328333;-72,56515;01-07-2016;23:00:28;115;40;24;116;0,602;48300
-38,71356667;-72,56451667;01-07-2016;23:00:36;116;63;28;119;0,603;47000
-38,71385;-72,56383333;01-07-2016;23:00:44;116;67;30;119;0,537;52100
-38,71415;-72,56318333;01-07-2016;23:00:52;117;67;30;120;0,528;50400
-38,7143;-72,56283333;01-07-2016;23:00:57;116;34;24;121;0,53;45400
-38,71446667;-72,5627;01-07-2016;23:01:02;116;22;16;147;0,577;44600
-38,71461667;-72,5628;01-07-2016;23:01:05;116;18;22;209;0,526;48200
-38,715;-72,56323333;01-07-2016;23:01:11;115;57;34;221;0,524;62100
-38,71578333;-72,5641;01-07-2016;23:01:21;116;115;41;221;0,562;48100
-38,71646667;-72,5648;01-07-2016;23:01:29;116;97;44;219;0,591;52700
-38,71726667;-72,56568333;01-07-2016;23:01:38;116;117;47;221;0,59;59400
-38,71821667;-72,56673333;01-07-2016;23:01:48;117;140;50;221;0,56;65300
-38,71903333;-72,56763333;01-07-2016;23:01:57;117;121;48;220;0,575;58500
-38,71918333;-72,56776667;01-07-2016;23:02:00;118;19;23;217;0,648;69500
-38,7192;-72,5678;01-07-2016;23:02:05;118;4;3;222;0,576;73800
-38,71928333;-72,56788333;01-07-2016;23:02:49;118;12;0,9;221;0,53;64000
-38,71946667;-72,5681;01-07-2016;23:02:53;118;27;24;222;0,526;50500
-38,71983333;-72,5685;01-07-2016;23:02:58;119;55;39;221;0,521;79600
-38,72046667;-72,56918333;01-07-2016;23:03:05;120;92;47;220;0,503;48400
-38,7213;-72,57003333;01-07-2016;23:03:14;121;118;47;218;0,491;77400
-38,72186667;-72,57068333;01-07-2016;23:03:22;122;86;38;221;0,546;60500
-38,7224;-72,57133333;01-07-2016;23:03:28;122;81;49;224;0,53;53800
-38,72326667;-72,57226667;01-07-2016;23:03:36;123;127;57;220;0,488;153000
-38,72428333;-72,57336667;01-07-2016;23:03:46;123;148;53;220;0,482;52100
-38,72478333;-72,57388333;01-07-2016;23:03:52;123;71;43;219;0,475;125000
-38,72506667;-72,57418333;01-07-2016;23:03:57;123;41;29;219;0,457;134000
-38,72541667;-72,57455;01-07-2016;23:04:03;123;50;30;220;0,49;71700
-38,72593333;-72,57521667;01-07-2016;23:04:10;121;82;42;225;0,411;140000
-38,72655;-72,57623333;01-07-2016;23:04:18;120;112;50;232;0,424;81600
-38,72706667;-72,57723333;01-07-2016;23:04:25;119;103;53;237;0,402;113000
-38,72761667;-72,57831667;01-07-2016;23:04:33;118;113;51;236;0,426;81300
-38,72851667;-72,57995;01-07-2016;23:04:45;115;173;52;235;0,369;70300
-38,72915;-72,58115;01-07-2016;23:04:54;114;126;50;236;0,344;56500
-38,72993333;-72,58255;01-07-2016;23:05:05;113;150;49;234;0,355;59100
-38,73053333;-72,58365;01-07-2016;23:05:13;113;116;52;235;0,348;45500
-38,73118333;-72,58486667;01-07-2016;23:05:22;112;129;51;236;0,365;51800
-38,7317;-72,58583333;01-07-2016;23:05:30;111;101;46;236;0,344;46700
-38,73241667;-72,58716667;01-07-2016;23:05:42;110;141;42;235;0,334;52000
-38,73281667;-72,58791667;01-07-2016;23:05:50;109;78;35;236;0,333;50500
-38,73318333;-72,58853333;01-07-2016;23:05:58;109;67;30;233;0,327;58300
-38,73366667;-72,58936667;01-07-2016;23:06:07;108;90;36;234;0,324;50100
-38,73408333;-72,59015;01-07-2016;23:06:14;107;83;43;235;0,321;29200
-38,73453333;-72,591;01-07-2016;23:06:22;107;90;40;236;0,304;28900
-38,73488333;-72,5916;01-07-2016;23:06:28;108;63;38;234;0,313;28700
-38,73521667;-72,5923;01-07-2016;23:06:35;107;72;37;238;0,326;29100
-38,7356;-72,593;01-07-2016;23:06:41;105;74;44;236;0,312;29300
-38,73606667;-72,59391667;01-07-2016;23:06:48;103;95;49;237;0,275;28300
-38,73641667;-72,59461667;01-07-2016;23:06:54;102;72;43;238;0,261;32600
-38,73655;-72,59483333;01-07-2016;23:06:58;102;24;22;232;0,263;31200
-38,73656667;-72,5949;01-07-2016;23:07:02;101;6;5;236;0,277;53700
-38,73665;-72,59498333;01-07-2016;23:07:16;101;11;3;224;0,278;50600
-38,73676667;-72,5952;01-07-2016;23:07:20;100;24;21;235;0,286;52100
-38,73701667;-72,59568333;01-07-2016;23:07:25;100;50;36;236;0,274;33200
-38,73741667;-72,59645;01-07-2016;23:07:33;99;82;37;236;0,295;30000
-38,73748333;-72,5966;01-07-2016;23:07:35;99;14;25;239;0,292;30600
-38,73755;-72,59685;01-07-2016;23:07:39;98;23;20;256;0,293;28900
-38,73741667;-72,59756667;01-07-2016;23:07:47;97;64;29;282;0,293;31700
-38,7373;-72,598;01-07-2016;23:07:53;97;41;24;290;0,304;31100
-38,73725;-72,59811667;01-07-2016;23:07:57;96;10;9;299;0,304;33200
-38,7372;-72,59825;01-07-2016;23:08:13;96;14;3;298;0,289;35000
-38,73716667;-72,59836667;01-07-2016;23:08:15;96;11;20;291;0,303;33000
-38,73705;-72,59908333;01-07-2016;23:08:22;95;63;32;281;0,323;35400
-38,7369;-72,6001;01-07-2016;23:08:31;94;90;36;281;0,34;33800
-38,7368;-72,60063333;01-07-2016;23:08:37;94;46;28;283;0,336;31300
-38,73676667;-72,60083333;01-07-2016;23:08:42;94;18;13;281;0,34;30400
-38,73678333;-72,60088333;01-07-2016;23:08:48;95;5;3;246;0,343;31500
-38,73678333;-72,60108333;01-07-2016;23:08:53;96;18;13;274;0,33;32200
-38,73671667;-72,60148333;01-07-2016;23:08:58;97;35;25;281;0,398;34100
-38,7366;-72,6022;01-07-2016;23:09:05;98;64;33;282;0,376;39500
-38,73643333;-72,60331667;01-07-2016;23:09:15;99;99;36;281;0,373;43800
-38,73628333;-72,6041;01-07-2016;23:09:23;100;70;31;283;0,362;46900
-38,73625;-72,60418333;01-07-2016;23:09:25;100;9;16;292;0,388;61800
-38,73611667;-72,60421667;01-07-2016;23:09:30;100;16;12;355;0,419;72300
-38,7358;-72,6041;01-07-2016;23:09:36;101;36;21;16;0,422;71000
-38,73535;-72,60395;01-07-2016;23:09:44;101;52;24;15;0,516;66900
-38,73488333;-72,60381667;01-07-2016;23:09:53;102;52;21;13;0,507;70100
-38,7345;-72,60368333;01-07-2016;23:10:00;102;45;23;13;0,586;64400
-38,73426667;-72,60361667;01-07-2016;23:10:06;102;26;16;13;0,917;65900
-38,73425;-72,60361667;01-07-2016;23:10:07;102;2;8;4;0,973;69000
-38,73418333;-72,60375;01-07-2016;23:10:11;103;13;12;303;0,957;57200
-38,73413333;-72,60416667;01-07-2016;23:10:16;103;37;27;280;0,997;62400
-38,73401667;-72,6048;01-07-2016;23:10:23;104;56;29;282;0,969;64900
-38,73393333;-72,60533333;01-07-2016;23:10:29;105;48;29;283;0,897;71200
-38,73381667;-72,60593333;01-07-2016;23:10:36;107;53;27;282;0,841;67100
-38,73373333;-72,60653333;01-07-2016;23:10:43;109;52;27;281;0,923;73100
-38,73361667;-72,6067;01-07-2016;23:10:48;109;19;14;310;0,857;78600
-38,73355;-72,60668333;01-07-2016;23:10:50;110;8;15;8;0,872;72800
-38,73318333;-72,60653333;01-07-2016;23:10:56;111;42;25;18;0,916;72700
-38,73271667;-72,6063;01-07-2016;23:11:02;111;56;34;23;0,991;47300
-38,73255;-72,60623333;01-07-2016;23:11:04;111;19;35;15;0,915;38400
-38,73193333;-72,60606667;01-07-2016;23:11:12;111;72;32;12;1,02;35200
-38,73171667;-72,60606667;01-07-2016;23:11:17;111;24;17;0;1,08;35200
-38,73168333;-72,6061;01-07-2016;23:11:22;111;4;3;318;1,02;40500
-38,73168333;-72,6061;01-07-2016;23:11:23;111;0;0;0;0,966;38200
-38,73156667;-72,60606667;01-07-2016;23:11:28;110;13;9;12;0,81;43100
-38,73131667;-72,606;01-07-2016;23:11:32;110;29;26;12;0,513;44700
-38,73071667;-72,60583333;01-07-2016;23:11:40;109;68;30;12;0,454;49700
-38,73053333;-72,60578333;01-07-2016;23:11:43;109;21;25;13;0,464;52300
-38,73043333;-72,60571667;01-07-2016;23:11:47;109;12;11;24;0,458;58900
-38,73036667;-72,60568333;01-07-2016;23:12:16;109;8;1;24;0,445;50700
-38,73018333;-72,6058;01-07-2016;23:12:21;109;24;17;334;0,568;52400
-38,72995;-72,6063;01-07-2016;23:12:29;109;51;23;300;0,582;52600
-38,72988333;-72,60655;01-07-2016;23:12:34;109;22;16;291;0,619;49900
-38,72986667;-72,60663333;01-07-2016;23:12:38;108;8;7;282;0,647;53400
-38,73003333;-72,60678333;01-07-2016;23:12:43;108;23;17;214;0,829;54400
-38,7305;-72,60705;01-07-2016;23:12:51;107;57;26;203;0,759;43900
-38,73105;-72,60738333;01-07-2016;23:13:00;105;68;27;206;0,733;42800
-38,73145;-72,60763333;01-07-2016;23:13:06;105;50;30;206;0,791;40500
-38,73211667;-72,60803333;01-07-2016;23:13:15;105;81;32;205;0,771;50100
-38,73265;-72,60841667;01-07-2016;23:13:23;104;69;31;208;0,832;43200
-38,73271667;-72,60866667;01-07-2016;23:13:28;105;24;17;255;0,695;42300
-38,73268333;-72,60875;01-07-2016;23:13:29;105;7;25;293;0,62;52000
-38,73245;-72,60941667;01-07-2016;23:13:36;105;64;33;295;0,591;47000
-38,73218333;-72,61006667;01-07-2016;23:13:43;105;65;33;297;0,554;36600
-38,73208333;-72,61048333;01-07-2016;23:13:49;106;38;23;288;0,576;50500
-38,73195;-72,61085;01-07-2016;23:13:56;107;35;18;293;0,499;43000
-38,73166667;-72,6116;01-07-2016;23:14:06;109;73;26;297;0,488;39500
-38,73136667;-72,61231667;01-07-2016;23:14:14;110;70;31;297;0,467;40700
-38,73103333;-72,61323333;01-07-2016;23:14:23;110;88;35;296;0,457;47500
-38,73066667;-72,61406667;01-07-2016;23:14:32;111;83;33;299;0,442;52900
-38,73046667;-72,6149;01-07-2016;23:14:40;111;75;34;287;0,493;48800
-38,73028333;-72,61548333;01-07-2016;23:14:47;111;56;29;293;0,45;32600
-38,73026667;-72,61563333;01-07-2016;23:14:50;110;13;15;281;0,381;33500
-38,73046667;-72,61578333;01-07-2016;23:14:55;110;26;18;210;0,368;30400
-38,73083333;-72,61595;01-07-2016;23:15:00;108;45;32;200;0,425;30600
-38,73163333;-72,61635;01-07-2016;23:15:10;106;96;34;201;0,453;36100
-38,73173333;-72,61641667;01-07-2016;23:15:12;106;13;24;210;0,459;40100
-38,73215;-72,61663333;01-07-2016;23:15:20;107;50;22;202;0,436;35400
-38,73253333;-72,61681667;01-07-2016;23:15:29;107;45;18;201;0,319;31900
-38,7326;-72,61685;01-07-2016;23:15:35;107;8;5;201;0,31;31000
-38,73268333;-72,6169;01-07-2016;23:15:46;107;10;3;205;0,298;31800
-38,7329;-72,61703333;01-07-2016;23:15:51;107;27;19;204;0,318;60100
-38,73328333;-72,61716667;01-07-2016;23:15:57;107;43;26;196;0,294;31400
-38,73375;-72,61736667;01-07-2016;23:16:04;107;56;29;198;0,303;30000
-38,73436667;-72,6176;01-07-2016;23:16:12;107;70;32;197;0,297;41300
-38,735;-72,61786667;01-07-2016;23:16:21;106;76;30;198;0,31;25700
-38,73548333;-72,61806667;01-07-2016;23:16:27;106;56;33;198;0,301;25600
-38,73615;-72,61833333;01-07-2016;23:16:36;107;78;31;198;1,12;26800
-38,73643333;-72,6185;01-07-2016;23:16:42;107;34;20;204;0,368;28300
-38,73651667;-72,61855;01-07-2016;23:16:47;107;10;7;206;0,301;25200
-38,73651667;-72,61853333;01-07-2016;23:16:56;108;2;0,8;107;0,331;27000
-38,73648333;-72,61843333;01-07-2016;23:23:03;107;8;0,1;69;0,262;26000
-38,73651667;-72,61841667;01-07-2016;23:23:09;107;3;2;146;0,284;26500
-38,73663333;-72,61846667;01-07-2016;23:23:14;108;14;10;198;0,29;28800
-38,7369;-72,61861667;01-07-2016;23:23:20;107;33;20;203;0,295;29700
-38,73713333;-72,61873333;01-07-2016;23:23:26;106;28;17;201;0,269;27400
-38,73716667;-72,61875;01-07-2016;23:23:28;106;4;6;207;0,267;28300
-38,73718333;-72,61898333;01-07-2016;23:23:33;105;19;14;266;0,269;30600
-38,7372;-72,61933333;01-07-2016;23:23:40;104;31;16;266;0,27;31400
-38,73725;-72,61935;01-07-2016;23:23:41;104;5;17;203;0,265;28500
-38,7376;-72,61948333;01-07-2016;23:23:47;103;42;25;196;0,269;30200
-38,738;-72,61961667;01-07-2016;23:23:53;102;46;27;194;0,342;33600
-38,73823333;-72,61968333;01-07-2016;23:23:59;101;27;16;195;0,294;28400
-38,73851667;-72,61981667;01-07-2016;23:24:04;101;33;24;199;0,358;28200
-38,7391;-72,62003333;01-07-2016;23:24:12;100;68;31;197;0,347;28800
-38,73981667;-72,6203;01-07-2016;23:24:20;100;83;37;196;0,359;29100
-38,74025;-72,62048333;01-07-2016;23:24:26;101;51;30;199;0,352;31200
-38,74036667;-72,62053333;01-07-2016;23:24:30;102;13;11;196;0,382;33500
-38,74038333;-72,62053333;01-07-2016;23:24:36;102;2;1,1;204;0,325;31700
-38,74046667;-72,62058333;01-07-2016;23:24:44;103;10;4;201;0,625;29600
-38,74053333;-72,6206;01-07-2016;23:24:47;103;8;9;195;0,417;27800
-38,74063333;-72,62048333;01-07-2016;23:24:51;103;15;14;142;0,41;28200
-38,74066667;-72,62041667;01-07-2016;23:24:52;102;7;24;116;0,445;28100
-38,74086667;-72,6197;01-07-2016;23:24:59;102;66;34;109;0,416;31400
-38,74118333;-72,61835;01-07-2016;23:25:10;103;123;40;107;0,362;34200
-38,74146667;-72,61703333;01-07-2016;23:25:20;103;118;42;106;0,309;37400
-38,74171667;-72,6159;01-07-2016;23:25:29;104;102;41;106;0,303;28700
-38,7418;-72,61561667;01-07-2016;23:25:33;105;26;24;112;0,32;29300
-38,74181667;-72,61558333;01-07-2016;23:25:36;104;4;4;122;0,323;28800
-38,74183333;-72,61556667;01-07-2016;23:25:44;105;3;1,2;118;0,341;29600
-38,74201667;-72,61558333;01-07-2016;23:25:49;105;20;15;188;0,337;30400
-38,74245;-72,61575;01-07-2016;23:25:55;105;51;31;195;0,319;30600
-38,74295;-72,61591667;01-07-2016;23:26:02;105;57;29;194;0,301;28900
-38,74326667;-72,61605;01-07-2016;23:26:10;104;37;17;199;0,305;33800
-38,74353333;-72,61616667;01-07-2016;23:26:15;104;32;23;198;0,301;31400
-38,74406667;-72,6164;01-07-2016;23:26:23;102;62;28;199;0,305;30200
-38,74438333;-72,61648333;01-07-2016;23:26:30;101;36;18;194;0,337;30300
-38,7448;-72,61665;01-07-2016;23:26:36;100;50;30;196;0,338;30100
-38,74551667;-72,6169;01-07-2016;23:26:44;100;82;37;196;0,323;36700
-38,746;-72,61703333;01-07-2016;23:26:50;100;56;34;192;0,364;38200
-38,7462;-72,61708333;01-07-2016;23:26:54;100;21;19;191;0,379;35000
-38,74621667;-72,61706667;01-07-2016;23:26:55;100;3;12;165;0,418;34100
-38,74626667;-72,61688333;01-07-2016;23:27:01;100;18;11;105;0,381;34700
-38,74613333;-72,6168;01-07-2016;23:27:05;101;16;14;23;0,447;33200
-38,74586667;-72,61675;01-07-2016;23:27:10;101;31;22;9;0,366;31500
-38,74566667;-72,61668333;01-07-2016;23:27:13;101;23;27;15;0,366;32100
-38,74548333;-72,61648333;01-07-2016;23:27:18;102;27;20;40;0,459;32800
-38,74546667;-72,61621667;01-07-2016;23:27:22;102;23;21;86;0,406;31900
-38,74556667;-72,61576667;01-07-2016;23:27:27;102;40;29;106;0,378;30900
-38,74561667;-72,61551667;01-07-2016;23:27:33;103;23;14;105;0,369;30900
-38,74565;-72,61536667;01-07-2016;23:27:37;104;14;13;106;0,376;33100
-38,74575;-72,61493333;01-07-2016;23:27:44;106;38;20;106;0,346;29800
