TrakPro Version 4.61 ASCII Data File

Model:,DustTrak II
Model Number:,8532
Serial Number:,8532101804
Test ID:,001
Test Abbreviation:,TEMUCO_001
Start Date:,05/28/2016
Start Time:,10:12:32
Duration (dd:hh:mm:ss):,0:00:03:00
Log Interval (mm:ss):,00:01
Number of points:,199
Notes:,

Statistics,Channel:,AEROSOL
,Units:,mg/m^3
,Average:,0.050
,Minimum:,0.047
,Time of Minimum:,10:14:04
,Date of Minimum:,05/28/2016
,Maximum:,0.053
,Time of Maximum:,10:15:01
,Date of Maximum:,05/28/2016

Calibration,Sensor:,AEROSOL
,Cal. date,05/28/2014

Date,Time,AEROSOL
MM/dd/yyyy,hh:mm:ss,mg/m^3
05/28/2016,10:12:33,0.049
05/28/2016,10:12:34,0.050
05/28/2016,10:12:35,0.051
05/28/2016,10:12:36,0.049
05/28/2016,10:12:37,0.049
05/28/2016,10:12:38,0.049
05/28/2016,10:12:39,0.050
05/28/2016,10:12:40,0.049
05/28/2016,10:12:41,0.049
05/28/2016,10:12:42,0.050
05/28/2016,10:12:43,0.049
05/28/2016,10:12:44,0.050
05/28/2016,10:12:45,0.049
05/28/2016,10:12:46,0.049
05/28/2016,10:12:47,0.052
05/28/2016,10:12:48,0.051
05/28/2016,10:12:49,0.049
05/28/2016,10:12:50,0.049
05/28/2016,10:12:51,0.050
05/28/2016,10:12:52,0.051
05/28/2016,10:12:53,0.052
05/28/2016,10:12:54,0.049
05/28/2016,10:12:55,0.049
05/28/2016,10:12:56,0.048
05/28/2016,10:12:57,0.049
05/28/2016,10:12:58,0.050
05/28/2016,10:12:59,0.049
05/28/2016,10:13:00,0.049
05/28/2016,10:13:01,0.050
05/28/2016,10:13:02,0.049
05/28/2016,10:13:03,0.050
05/28/2016,10:13:04,0.049
05/28/2016,10:13:05,0.048
05/28/2016,10:13:06,0.049
05/28/2016,10:13:07,0.051
05/28/2016,10:13:08,0.051
05/28/2016,10:13:09,0.050
05/28/2016,10:13:10,0.051
05/28/2016,10:13:11,0.051
05/28/2016,10:13:12,0.050
05/28/2016,10:13:13,0.050
05/28/2016,10:13:14,0.051
05/28/2016,10:13:15,0.051
05/28/2016,10:13:16,0.050
05/28/2016,10:13:17,0.052
05/28/2016,10:13:18,0.050
05/28/2016,10:13:19,0.050
05/28/2016,10:13:20,0.049
05/28/2016,10:13:21,0.049
05/28/2016,10:13:22,0.049
05/28/2016,10:13:23,0.048
05/28/2016,10:13:24,0.049
05/28/2016,10:13:25,0.049
05/28/2016,10:13:26,0.051
05/28/2016,10:13:27,0.051
05/28/2016,10:13:28,0.050
05/28/2016,10:13:29,0.050
05/28/2016,10:13:30,0.050
05/28/2016,10:13:31,0.051
05/28/2016,10:13:32,0.052
05/28/2016,10:13:33,0.052
05/28/2016,10:13:34,0.049
05/28/2016,10:13:35,0.051
05/28/2016,10:13:36,0.052
05/28/2016,10:13:37,0.051
05/28/2016,10:13:38,0.049
05/28/2016,10:13:39,0.051
05/28/2016,10:13:40,0.051
05/28/2016,10:13:41,0.051
05/28/2016,10:13:42,0.050
05/28/2016,10:13:43,0.049
05/28/2016,10:13:44,0.050
05/28/2016,10:13:45,0.050
05/28/2016,10:13:46,0.048
05/28/2016,10:13:47,0.048
05/28/2016,10:13:48,0.050
05/28/2016,10:13:49,0.049
05/28/2016,10:13:50,0.051
05/28/2016,10:13:51,0.050
05/28/2016,10:13:52,0.050
05/28/2016,10:13:53,0.049
05/28/2016,10:13:54,0.049
05/28/2016,10:13:55,0.049
05/28/2016,10:13:56,0.049
05/28/2016,10:13:57,0.049
05/28/2016,10:13:58,0.049
05/28/2016,10:13:59,0.049
05/28/2016,10:14:00,0.048
05/28/2016,10:14:01,0.050
05/28/2016,10:14:02,0.049
05/28/2016,10:14:03,0.048
05/28/2016,10:14:04,0.047
05/28/2016,10:14:05,0.049
05/28/2016,10:14:06,0.051
05/28/2016,10:14:07,0.050
05/28/2016,10:14:08,0.050
05/28/2016,10:14:09,0.050
05/28/2016,10:14:10,0.049
05/28/2016,10:14:11,0.050
05/28/2016,10:14:12,0.051
05/28/2016,10:14:13,0.049
05/28/2016,10:14:14,0.049
05/28/2016,10:14:15,0.049
05/28/2016,10:14:16,0.051
05/28/2016,10:14:17,0.050
05/28/2016,10:14:18,0.052
05/28/2016,10:14:19,0.049
05/28/2016,10:14:20,0.049
05/28/2016,10:14:21,0.051
05/28/2016,10:14:22,0.050
05/28/2016,10:14:23,0.049
05/28/2016,10:14:24,0.048
05/28/2016,10:14:25,0.049
05/28/2016,10:14:26,0.051
05/28/2016,10:14:27,0.051
05/28/2016,10:14:28,0.051
05/28/2016,10:14:29,0.051
05/28/2016,10:14:30,0.051
05/28/2016,10:14:31,0.050
05/28/2016,10:14:32,0.050
05/28/2016,10:14:33,0.050
05/28/2016,10:14:34,0.050
05/28/2016,10:14:35,0.048
05/28/2016,10:14:36,0.048
05/28/2016,10:14:37,0.050
05/28/2016,10:14:38,0.051
05/28/2016,10:14:39,0.049
05/28/2016,10:14:40,0.049
05/28/2016,10:14:41,0.050
05/28/2016,10:14:42,0.049
05/28/2016,10:14:43,0.050
05/28/2016,10:14:44,0.050
05/28/2016,10:14:45,0.049
05/28/2016,10:14:46,0.049
05/28/2016,10:14:47,0.050
05/28/2016,10:14:48,0.052
05/28/2016,10:14:49,0.052
05/28/2016,10:14:50,0.050
05/28/2016,10:14:51,0.050
05/28/2016,10:14:52,0.051
05/28/2016,10:14:53,0.050
05/28/2016,10:14:54,0.050
05/28/2016,10:14:55,0.051
05/28/2016,10:14:56,0.051
05/28/2016,10:14:57,0.051
05/28/2016,10:14:58,0.050
05/28/2016,10:14:59,0.051
05/28/2016,10:15:00,0.052
05/28/2016,10:15:01,0.053
05/28/2016,10:15:02,0.051
05/28/2016,10:15:03,0.050
05/28/2016,10:15:04,0.051
05/28/2016,10:15:05,0.051
05/28/2016,10:15:06,0.049
05/28/2016,10:15:07,0.049
05/28/2016,10:15:08,0.051
05/28/2016,10:15:09,0.050
05/28/2016,10:15:10,0.048
05/28/2016,10:15:11,0.048
05/28/2016,10:15:12,0.049
05/28/2016,10:15:13,0.048
05/28/2016,10:15:14,0.048
05/28/2016,10:15:15,0.049
05/28/2016,10:15:16,0.047
05/28/2016,10:15:17,0.050
05/28/2016,10:15:18,0.050
05/28/2016,10:15:19,0.051
05/28/2016,10:15:20,0.052
05/28/2016,10:15:21,0.051
05/28/2016,10:15:22,0.050
05/28/2016,10:15:23,0.049
05/28/2016,10:15:24,0.051
05/28/2016,10:15:25,0.050
05/28/2016,10:15:26,0.050
05/28/2016,10:15:27,0.050
05/28/2016,10:15:28,0.049
05/28/2016,10:15:29,0.049
05/28/2016,10:15:30,0.049
05/28/2016,10:15:31,0.048
05/28/2016,10:15:32,0.049
05/28/2016,10:15:33,0.050
05/28/2016,10:15:34,0.049
05/28/2016,10:15:35,0.050
05/28/2016,10:15:36,0.051
05/28/2016,10:15:37,0.051
05/28/2016,10:15:38,0.050
05/28/2016,10:15:39,0.050
05/28/2016,10:15:40,0.049
05/28/2016,10:15:41,0.050
05/28/2016,10:15:42,0.051
05/28/2016,10:15:43,0.049
05/28/2016,10:15:44,0.050
05/28/2016,10:15:45,0.050
05/28/2016,10:15:46,0.049
05/28/2016,10:15:47,0.049
05/28/2016,10:15:48,0.050
05/28/2016,10:15:49,0.050
05/28/2016,10:15:50,0.051
05/28/2016,10:15:51,0.051

Model:,DustTrak II
Model Number:,8532
Serial Number:,8532101804
Test ID:,002
Test Abbreviation:,TEMUCO_002
Start Date:,05/28/2016
Start Time:,10:16:14
Duration (dd:hh:mm:ss):,0:00:01:00
Log Interval (mm:ss):,00:01
Number of points:,70
Notes:,

Statistics,Channel:,AEROSOL
,Units:,mg/m^3
,Average:,0.000
,Minimum:,0.000
,Time of Minimum:,10:16:15
,Date of Minimum:,05/28/2016
,Maximum:,0.000
,Time of Maximum:,10:16:15
,Date of Maximum:,05/28/2016

Calibration,Sensor:,AEROSOL
,Cal. date,05/28/2014

Date,Time,AEROSOL
MM/dd/yyyy,hh:mm:ss,mg/m^3
05/28/2016,10:16:15,0.000
05/28/2016,10:16:16,0.000
05/28/2016,10:16:17,0.000
05/28/2016,10:16:18,0.000
05/28/2016,10:16:19,0.000
05/28/2016,10:16:20,0.000
05/28/2016,10:16:21,0.000
05/28/2016,10:16:22,0.000
05/28/2016,10:16:23,0.000
05/28/2016,10:16:24,0.000
05/28/2016,10:16:25,0.000
05/28/2016,10:16:26,0.000
05/28/2016,10:16:27,0.000
05/28/2016,10:16:28,0.000
05/28/2016,10:16:29,0.000
05/28/2016,10:16:30,0.000
05/28/2016,10:16:31,0.000
05/28/2016,10:16:32,0.000
05/28/2016,10:16:33,0.000
05/28/2016,10:16:34,0.000
05/28/2016,10:16:35,0.000
05/28/2016,10:16:36,0.000
05/28/2016,10:16:37,0.000
05/28/2016,10:16:38,0.000
05/28/2016,10:16:39,0.000
05/28/2016,10:16:40,0.000
05/28/2016,10:16:41,0.000
05/28/2016,10:16:42,0.000
05/28/2016,10:16:43,0.000
05/28/2016,10:16:44,0.000
05/28/2016,10:16:45,0.000
05/28/2016,10:16:46,0.000
05/28/2016,10:16:47,0.000
05/28/2016,10:16:48,0.000
05/28/2016,10:16:49,0.000
05/28/2016,10:16:50,0.000
05/28/2016,10:16:51,0.000
05/28/2016,10:16:52,0.000
05/28/2016,10:16:53,0.000
05/28/2016,10:16:54,0.000
05/28/2016,10:16:55,0.000
05/28/2016,10:16:56,0.000
05/28/2016,10:16:57,0.000
05/28/2016,10:16:58,0.000
05/28/2016,10:16:59,0.000
05/28/2016,10:17:00,0.000
05/28/2016,10:17:01,0.000
05/28/2016,10:17:02,0.000
05/28/2016,10:17:03,0.000
05/28/2016,10:17:04,0.000
05/28/2016,10:17:05,0.000
05/28/2016,10:17:06,0.000
05/28/2016,10:17:07,0.000
05/28/2016,10:17:08,0.000
05/28/2016,10:17:09,0.000
05/28/2016,10:17:10,0.000
05/28/2016,10:17:11,0.000
05/28/2016,10:17:12,0.000
05/28/2016,10:17:13,0.000
05/28/2016,10:17:14,0.000
05/28/2016,10:17:15,0.000
05/28/2016,10:17:16,0.000
05/28/2016,10:17:17,0.000
05/28/2016,10:17:18,0.000
05/28/2016,10:17:19,0.000
05/28/2016,10:17:20,0.000
05/28/2016,10:17:21,0.000
05/28/2016,10:17:22,0.000
05/28/2016,10:17:23,0.000
05/28/2016,10:17:24,0.000
