20 414
44 384
64 327
88 287
112 255
132 224
156 192
176 159
200 127
220 120
244 96
264 79
288 63
312 63
332 62
356 63
376 63
400 71
420 96
444 112
468 127
488 152
512 192
532 224
556 248
576 280
600 318
620 384
644 387
668 448
688 480
712 511
732 543
756 583
776 632
800 655
824 704
844 736
868 768
888 768
916 796
940 816
960 828
984 831
1008 831
1028 831
1052 831
1072 830
1096 824
1116 799
1140 783
1164 768
1184 768
1208 705
1228 675
1252 639
1272 624
1296 575
1316 540
1340 504
1364 460
1384 419
1408 384
1428 352
1452 316
1472 271
1496 248
1520 224
1540 192
1564 159
1584 127
1608 120
1628 112
1652 96
1672 79
1696 71
1720 71
1740 71
1764 96
1784 96
1808 112
1828 126
1852 143
1876 192
1896 192
1920 224
1944 255
1968 291
1992 327
2012 384
2036 399
2056 448
2080 480
2100 511
2124 543
2144 575
2168 624
2192 639
2212 671
2236 704
2256 768
2280 768
2300 768
2324 782
2348 796
2368 799
2392 803
2412 803
2436 799
2456 798
2480 783
2500 771
2524 768
2548 768
2568 711
2592 704
2612 659
2636 636
2656 608
2680 572
2704 531
2724 504
2748 480
2768 448
2792 391
2812 384
2836 319
2856 291
2880 255
2904 240
2924 224
2948 192
2976 159
2996 143
3020 127
3044 124
3064 120
3088 120
3108 120
3132 120
3152 124
3176 127
3196 143
3220 159
3244 192
3264 224
3288 240
3308 255
3332 287
3352 318
3376 352
3400 384
3420 415
3444 448
3464 480
3488 512
3508 543
3532 575
3552 608
3576 638
3600 664
3620 704
3644 705
3664 768
3688 768
3708 768
3732 768
3756 769
3776 775
3800 771
3820 769
3844 768
3864 768
3888 768
3908 768
3932 705
3956 704
3984 655
4004 636
4028 608
4048 574
4072 543
4092 511
4116 480
4140 448
4160 415
4184 384
4204 384
4228 319
4248 304
4272 271
4296 252
4316 240
4340 224
4360 192
4384 192
4404 163
4428 158
4448 152
4472 152
4496 152
4516 158
4540 159
4560 192
4584 192
4604 199
4628 224
4652 248
4672 255
4696 287
4716 318
4740 352
4760 384
4784 399
4804 448
4828 480
4852 496
4872 519
4896 547
4916 575
4940 608
4960 636
4984 652
5012 704
5036 704
5056 711
5080 768
5100 768
5124 768
5144 768
5168 768
5192 768
5212 768
5236 768
5256 768
5280 707
5300 704
5324 671
5348 655
5368 638
5392 608
5412 583
5436 560
5456 527
5480 504
5500 480
5524 448
5548 415
5568 384
5592 384
5612 327
5636 312
5656 286
5680 255
5704 248
5724 224
5748 224
5768 192
5792 192
5812 192
5836 192
5856 192
5880 192
5904 192
5924 192
5948 195
5976 224
5996 240
6020 252
6040 263
6064 287
6088 316
6108 352
6132 384
6152 391
6176 415
6196 448
6220 480
6244 508
6264 527
6288 560
6308 575
6332 608
6352 632
6376 639
6396 670
6420 704
6444 704
6464 707
6488 736
6508 768
6532 768
6552 768
6576 768
6600 736
6620 711
6644 704
6664 704
6688 671
6708 655
6732 639
6752 624
6776 608
6800 574
6820 543
6844 519
6864 504
6888 480
6908 448
6932 415
6956 387
6976 384
7004 334
7028 316
7048 287
7072 271
7092 255
7116 248
7140 240
7160 224
7184 224
7204 224
7228 199
7248 199
7272 224
7296 224
7316 224
7340 240
7360 248
7384 255
7404 271
7428 287
7448 316
7472 327
7496 384
7516 384
7540 399
7560 448
7584 451
7604 480
7628 508
7652 527
7672 547
7696 574
7716 608
7740 624
7760 636
7784 639
7804 664
7828 671
7852 704
7872 704
7896 704
7916 704
7940 704
7960 704
7984 704
8008 704
8036 671
8056 655
8080 639
8100 636
8124 624
8148 608
8168 574
8192 547
8212 527
8236 508
8256 480
8280 455
8300 448
8324 412
8348 384
8368 384
8392 352
8412 319
8436 312
8456 287
8480 271
8504 255
8524 254
8548 248
8568 248
8592 240
8612 240
8636 240
8656 240
8680 248
8704 254
8724 255
8748 271
8768 287
8792 312
8812 319
8836 352
8860 384
8880 384
8904 399
8924 448
8948 448
8968 480
8992 496
9012 513
9044 543
9064 568
9088 575
9108 608
9132 624
9152 636
9176 639
9200 655
9220 668
9244 671
9264 671
9288 675
9308 675
9332 671
9356 671
9376 664
9400 655
9420 639
9444 636
9464 624
9488 608
9508 575
9532 568
9556 543
9576 519
9600 504
9620 480
9644 451
9664 448
9688 412
9712 387
9732 384
9756 352
9776 327
9800 316
9820 295
9844 284
9864 268
9888 255
9912 252
9932 248
9956 248
9976 240
10000 240
10020 248
10044 248
10072 255
10096 255
10116 271
10140 287
10160 304
10184 318
10208 332
10228 384
10252 384
10272 391
10296 414
10316 448
10340 451
10360 480
10384 504
10408 515
10428 540
10452 560
10472 574
10496 588
10516 608
10540 624
10564 632
10584 639
10608 639
10628 647
10652 655
10672 655
10696 655
10716 652
10740 639
10764 639
10784 636
10808 632
10828 608
10852 608
10872 579
10896 572
10920 543
10940 527
10964 511
10984 496
11008 480
11028 449
11052 448
11072 414
11100 385
11124 384
11148 384
11168 335
11192 319
11212 312
11236 291
11256 286
11280 275
11300 268
11324 255
11348 255
11368 255
11392 255
11412 263
11436 271
11456 280
11488 304
11508 316
11532 319
11556 327
11576 352
11600 384
11620 384
11644 387
11664 408
11688 448
11712 448
11732 460
11756 480
11776 504
11800 512
11820 527
11844 543
11864 568
11888 575
11912 591
11932 608
11956 624
11976 632
12000 636
12020 638
12044 639
12068 639
12088 639
12112 639
12132 638
12156 636
12176 632
12200 624
12220 608
12244 608
12268 583
12288 572
12316 547
12340 536
12360 515
12384 508
12408 496
12428 480
12452 448
12472 448
12496 415
12516 399
12540 384
12564 384
12584 384
12608 352
12628 332
12652 319
12672 318
12696 312
12716 312
12740 304
12764 304
12784 304
12808 304
12828 312
12852 316
12872 318
12896 319
12920 334
12940 352
12964 384
12984 384
13008 384
13028 399
13052 415
13072 448
13096 448
13120 480
13140 480
13164 504
13184 512
13208 527
13228 543
13252 560
13276 572
13296 575
13320 608
13348 608
13368 608
13392 624
13416 624
13436 624
13460 624
13480 624
13504 624
13524 624
13548 608
13568 608
13592 590
13616 575
13636 572
13660 560
13680 543
13704 527
13724 512
13748 504
13772 480
13792 480
13816 449
13836 448
13860 415
13880 403
13904 390
13924 384
13948 384
13972 384
13992 352
14016 332
14036 319
14060 319
14080 318
14104 316
14128 316
14148 312
14172 312
14192 316
14216 318
14236 319
14260 327
14280 352
14304 352
14328 384
14356 384
14376 384
14400 398
14420 414
14444 448
14468 448
14488 455
14512 480
14532 496
14556 504
14576 512
14600 526
14624 540
14644 547
14668 568
14688 572
14712 575
14732 583
14756 591
14776 608
14800 608
14824 608
14844 608
14868 608
14888 608
14912 591
14932 583
14956 575
14980 572
15000 568
15024 547
15044 540
15068 527
15088 512
15112 504
15132 496
15156 480
15180 455
15200 448
15224 448
15244 415
15268 408
15288 391
15312 384
15336 384
15356 384
15384 352
15408 352
15428 335
15452 327
15476 327
15496 319
15520 319
15540 319
15564 327
15584 327
15608 335
15628 352
15652 352
15676 384
15696 384
15720 384
15740 385
15764 399
15784 414
15808 448
15832 448
15852 448
15876 480
15896 480
15920 496
15940 508
15964 513
15984 526
16008 540
16032 543
16052 560
16076 568
16096 574
16120 575
16140 575
16164 583
16188 583
16208 583
16232 583
16252 583
16276 575
16296 575
16320 574
16340 568
16364 560
16388 543
16412 536
16436 521
16460 512
16480 504
16504 496
16524 480
16548 480
16568 448
16592 448
16616 448
16636 415
16660 399
16680 387
16704 384
16724 384
16748 384
16768 384
16792 352
16816 352
16836 352
16860 334
16880 332
16904 332
16924 332
16948 335
16972 352
16992 352
17016 352
17036 384
17060 384
17080 384
17104 384
17124 387
17148 399
17172 412
17192 419
17216 448
17236 448
17260 454
17284 480
17304 496
17328 504
17348 512
17372 526
17392 540
17416 547
17440 568
17460 572
17484 575
17504 579
17528 583
17548 591
17572 608
17592 608
17616 608
17640 591
17660 585
17684 579
17704 575
17728 572
17748 568
17780 543
17800 536
17824 519
17844 511
17868 504
17888 496
17912 480
17936 455
17956 448
17980 448
18000 415
18024 399
18044 385
18068 384
18088 384
18112 384
18136 352
18156 335
18180 327
18200 319
18224 319
18244 318
18268 318
18292 318
18312 318
18336 319
18356 319
18380 319
18400 332
18424 352
18444 352
18468 384
18492 384
18512 384
18536 391
18556 408
18580 415
18600 448
18624 448
18648 455
18668 480
18692 496
18712 504
18736 511
18756 519
18780 527
18808 543
18832 551
18852 568
18876 572
18896 574
18920 575
18940 575
18964 575
18988 575
19008 575
19032 575
19052 574
19076 572
19096 568
19120 560
19144 543
19164 540
19188 526
19208 513
19232 508
19252 496
19276 480
19296 480
19320 455
19344 448
19364 448
19388 415
19408 412
19432 398
19452 385
19476 384
19500 384
19520 384
19544 384
19564 352
19588 352
19608 352
19632 352
19652 352
19676 352
19700 352
19720 352
19744 352
19764 352
19788 384
19808 384
19836 384
19860 384
19884 387
19904 399
19928 412
19948 419
19972 448
19992 448
20016 455
20040 480
20060 480
20084 496
20104 504
20128 511
20148 519
20172 527
20192 540
20216 543
20240 551
20260 560
20284 568
20304 572
20328 572
20348 574
20372 574
20396 572
20416 572
20440 568
20460 568
20484 560
20504 547
20528 542
20548 536
20572 524
20596 512
20616 508
20640 504
20660 496
20684 480
20704 480
20728 449
20752 448
20772 448
20796 415
20816 412
20840 398
20868 387
20888 384
20912 384
20936 384
20956 384
20980 384
21000 384
21024 384
21044 384
21068 384
21088 384
21112 384
21136 384
21156 384
21180 384
21200 384
21224 384
21244 387
21268 398
21292 408
21312 415
21336 448
21356 448
21380 448
21400 455
21424 480
21444 480
21468 496
21492 504
21512 508
21536 512
21556 519
21580 527
21600 536
21624 542
21648 543
21668 543
21692 547
21712 560
21736 560
21756 560
21780 551
21800 550
21824 547
21848 543
21876 540
21896 531
21920 527
21940 519
21964 512
21988 508
22008 496
22032 496
22052 480
22076 480
22096 455
22120 448
22140 448
22164 448
22188 415
22208 414
22232 399
22252 399
22276 387
22296 384
22320 384
22344 384
22364 384
22388 384
22408 384
22432 384
22452 384
22476 384
22496 384
22520 384
22544 384
22564 384
22588 387
22608 391
22632 399
22652 412
22676 415
22700 448
22720 448
22744 448
22764 451
22788 480
22808 480
22832 496
22852 496
22876 504
22904 511
22928 515
22956 527
22976 536
23000 542
23024 543
23044 543
23068 547
23088 551
23112 551
23132 560
23156 551
23180 547
23200 543
23224 543
23244 542
23268 536
23288 527
23312 519
23332 512
23356 510
23384 504
23408 496
23428 480
23452 480
23472 461
23496 449
23520 448
23540 448
23564 448
23584 415
23608 412
23628 398
23652 391
23676 387
23696 384
23720 384
23740 384
23764 384
23784 384
23808 384
23828 384
23852 384
23876 384
23896 384
23920 384
23940 385
23964 391
23984 399
24008 408
24032 414
24052 415
24076 448
24096 448
24120 448
24140 451
24164 480
24184 480
24208 480
24232 496
24252 504
24276 508
24296 511
24320 513
24340 519
24364 526
24388 536
24416 540
24436 542
24460 542
24480 543
24504 543
24528 543
24548 542
24572 540
24592 536
24616 527
24636 526
24660 519
24680 512
24704 510
24728 508
24748 496
24772 496
24792 480
24816 480
24836 480
24860 451
24884 448
24904 448
24928 448
24948 419
24972 415
24992 408
25016 399
25036 391
25060 387
25084 384
25104 384
25128 384
25148 384
25172 384
25192 384
25216 384
25240 384
25260 384
25284 384
25304 385
25328 391
25348 396
25372 399
25392 412
25424 415
25444 448
25468 448
25488 448
25512 448
25532 455
25556 480
25580 480
25600 480
25624 496
25644 504
25668 508
25688 511
25712 513
25736 519
25756 526
25780 527
25800 536
25824 540
25844 540
25868 540
25888 540
25912 540
25936 540
25956 536
25980 527
26000 527
26024 519
26044 515
26068 511
26092 508
26112 504
26136 496
26156 496
26180 480
26200 480
26224 480
26244 451
26268 448
26292 448
26312 448
26336 448
26356 415
26380 412
26400 401
26424 399
26452 391
26476 387
26496 384
26520 384
26540 384
26564 384
26588 384
26608 384
26632 384
26652 384
26676 387
26696 391
26720 396
26740 399
26764 408
26788 414
26808 415
26832 448
26852 448
26876 448
26896 448
26920 451
26944 460
26964 480
26988 480
27008 480
27032 496
27052 496
27076 504
27096 508
27120 510
27144 512
27164 513
27188 515
27208 519
27232 519
27252 519
27276 519
27300 519
27320 515
27344 513
27364 512
27388 511
27408 508
27432 504
27452 504
27480 496
27504 496
27528 480
27548 480
27572 480
27592 455
27616 449
27636 448
27660 448
27680 448
27704 448
27728 419
27748 415
27772 415
27792 412
27816 408
27836 401
27860 399
27884 399
27904 399
27928 399
27948 399
27972 399
27992 403
28016 412
28036 412
28060 415
28084 415
28104 448
28128 448
28148 448
28172 448
28192 448
28216 449
28240 455
28260 480
28284 480
28304 480
28328 496
28348 496
28372 504
28392 504
28416 510
28440 511
28460 512
28484 515
28512 519
28532 519
28556 524
28580 526
28600 526
28624 526
28644 524
28668 519
28700 524
28720 519
28744 515
28764 512
28788 510
28812 508
28832 504
28856 496
28876 496
28900 480
28920 480
28944 480
28968 455
28988 449
29012 448
29032 448
29056 448
29076 448
29100 419
29120 415
29144 415
29168 412
29188 408
29212 399
29232 399
29256 399
29276 399
29300 399
29324 399
29344 399
29368 401
29388 408
29412 412
29432 415
29456 415
29476 419
29500 448
29524 448
29544 448
29568 448
29588 449
29612 455
29632 480
29656 480
29680 480
29708 480
29728 496
29752 496
29772 504
29796 508
29820 508
29840 511
29864 512
29884 512
29908 515
29928 515
29952 515
29972 515
29996 515
30020 513
30040 512
30064 511
30084 510
30108 508
30128 504
30152 504
30176 496
30196 496
30220 480
30240 480
30264 480
30284 480
30308 451
30328 448
30352 448
30376 448
30396 448
30420 448
30440 415
30464 414
30484 408
30508 399
30532 399
30552 391
30576 391
30596 387
30620 385
30640 385
30664 384
30684 384
30708 384
30736 385
30760 387
30780 391
30804 391
30824 398
30848 399
30872 408
30892 414
30916 415
30936 419
30960 448
30980 448
31004 448
31028 448
31048 449
31072 455
31092 480
31116 480
31136 480
31160 480
31180 496
31204 496
31228 496
31248 504
31272 504
31292 504
31316 508
31336 508
31360 508
31384 508
31404 508
31428 508
31448 508
31472 504
31492 504
31516 504
31536 496
31560 496
31584 496
31604 480
31628 480
31648 480
31672 480
31692 455
31716 451
31740 448
31764 448
31788 448
31812 448
31832 448
31856 419
31876 415
31900 415
31920 412
31944 408
31964 399
31988 399
32012 399
32032 398
32056 396
32076 396
32100 398
32120 398
32144 399
32168 399
32188 399
32212 408
32232 412
32256 414
32276 415
32300 419
32320 448
32344 448
32368 448
32388 448
32412 448
32432 449
32456 455
32476 480
32500 480
32524 480
32544 480
32568 480
32588 496
32612 496
32632 496
32656 504
32676 504
32700 504
32724 508
32744 508
32768 508
32796 508
32816 508
32840 504
32864 504
32884 504
32908 504
32928 496
32952 496
32972 496
32996 480
33020 480
33040 480
33064 480
33084 460
33108 455
33128 448
33152 448
33172 448
33196 448
33220 448
33240 448
33264 419
33284 415
33308 415
33328 415
33352 412
33376 412
33396 408
33420 408
33440 408
33464 408
33484 408
33508 408
33528 412
33552 414
33576 415
33596 415
33620 415
33640 448
33664 448
33684 448
33708 448
33732 448
33752 448
33776 449
33804 455
33824 480
33848 480
33872 480
33892 480
33916 480
33936 496
33960 496
33980 496
34004 504
34024 504
34048 504
34072 508
34092 508
34116 508
34136 508
34160 508
34180 508
34204 508
34228 504
34248 504
34272 504
34292 496
34316 496
34336 496
34360 496
34380 480
34404 480
34432 480
34452 480
34476 480
34496 480
34520 455
34540 455
34564 449
34588 448
34608 448
34632 448
34652 448
34676 448
34696 448
34720 448
34740 448
34764 448
34788 448
34808 422
34832 419
34852 419
34876 415
34896 419
34920 419
34944 419
34964 423
34988 448
35008 448
35032 448
35052 448
35076 448
35096 448
35120 448
35144 448
35164 448
35188 449
35212 451
35236 455
35260 480
35280 480
35304 480
35324 480
35348 480
35368 480
35392 480
35416 496
35436 496
35460 496
35480 496
35504 496
35524 496
35548 496
35568 496
35592 496
35616 496
35636 496
35660 496
35680 496
35704 496
35724 496
35748 480
35772 480
35792 480
35816 480
35836 480
35860 480
35880 480
35904 480
35924 455
35948 454
35972 449
35992 448
36016 448
36036 448
36060 448
36080 448
36104 448
36128 448
36148 448
36172 448
36192 448
36216 448
36244 448
36264 448
36288 448
36312 448
36332 448
36356 448
36376 448
36400 448
36420 448
36444 448
36464 448
36488 449
36512 451
36532 455
36556 460
36576 480
36600 480
36620 480
36644 480
36668 480
36688 480
36712 480
36732 496
36756 496
36776 496
36800 496
36820 496
36844 496
36868 496
36888 496
36912 496
36932 496
36956 496
36976 496
37000 496
37024 481
37044 480
37068 480
37088 480
37112 480
37132 480
37156 480
37176 460
37200 455
37224 451
37252 448
37272 448
37296 448
37316 448
37340 448
37364 448
37384 448
37408 448
37428 419
37452 415
37472 415
37496 415
37516 415
37540 415
37564 415
37584 415
37608 415
37628 415
37652 415
37672 415
37696 419
37720 448
37740 448
37764 448
37784 448
37808 448
37828 448
37852 448
37872 448
37896 448
37920 451
37940 455
37964 457
37984 480
38008 480
38028 480
38052 480
38076 480
38096 480
38120 480
38140 480
38164 496
38184 496
38208 496
38228 496
38252 496
38280 496
38304 496
38324 496
38348 496
38368 480
38392 480
38416 480
38436 480
38460 480
38480 480
38504 480
38524 480
38548 480
38572 455
38592 455
38616 449
38636 448
38660 448
38680 448
38704 448
38724 448
38748 448
38772 448
38792 448
38816 448
38836 448
38860 448
38880 423
38904 419
38928 419
38948 419
38972 419
38992 384
39016 448
39036 448
39060 448
39080 448
39104 448
39128 448
39148 448
39172 448
39192 448
39216 448
39236 448
39260 451
39284 455
39308 480
39332 480
39356 480
39376 480
39400 480
39420 480
39444 480
39464 496
39488 496
39508 496
39532 496
39556 504
39576 504
39600 504
39620 504
39644 504
39664 504
39688 504
39712 504
39732 504
39756 504
39776 504
39800 496
39820 496
39844 496
39864 496
39888 496
39912 496
39932 480
39956 480
39976 480
40000 480
40020 480
40044 480
40068 480
40088 455
40112 455
40132 454
40156 449
40176 448
40200 448
40224 448
40244 448
40268 448
40288 448
40312 448
40332 448
40356 448
40376 448
40400 448
40424 448
40444 448
40468 448
40488 448
40512 448
40532 448
40556 448
40580 448
40600 448
40624 448
40644 449
40668 451
40688 455
40712 480
40732 480
40756 480
40780 480
40800 480
40824 480
40844 480
40868 496
40888 496
40912 496
40936 496
40956 496
40980 496
41000 504
41024 504
41044 504
41068 504
41088 504
41112 504
41136 504
41160 496
41184 496
41208 496
41228 496
41252 496
41272 481
41296 480
41316 480
41340 480
41364 480
41384 480
41408 480
41428 455
41452 455
41472 449
41496 448
41516 448
41540 448
41564 448
41584 448
41608 448
41628 448
41652 448
41672 448
41696 448
41720 448
41740 448
41764 448
41784 448
41808 448
41828 448
41852 448
41872 448
41896 448
41920 448
41940 448
41964 448
41984 448
42008 448
42028 448
42052 449
42076 451
42096 455
42120 480
42140 480
42164 480
42192 480
42212 480
42236 480
42260 480
42280 481
42304 496
42324 496
42348 496
42368 496
42392 496
42412 496
42436 496
42460 496
42480 496
42504 496
42524 496
42548 496
42568 496
42592 496
42616 496
42636 480
42660 480
42680 480
42704 480
42724 480
42748 480
42768 480
42792 460
42816 455
42836 451
42860 448
42880 448
42904 448
42924 448
42948 448
42972 448
42992 448
43016 448
43036 448
43060 448
43080 448
43104 448
43124 448
43148 448
43172 448
43200 448
43220 448
43244 448
43264 448
43288 448
43312 448
43332 448
43356 448
43376 448
43400 448
43420 448
43444 449
43464 451
43488 455
43512 480
43532 480
43556 480
43576 480
43600 480
43620 480
43644 480
43668 480
43688 496
43712 496
43732 496
43756 496
43776 496
43800 496
43820 496
43844 496
43868 496
43888 496
43912 496
43932 496
43956 496
43976 496
44000 496
44024 480
44044 480
44068 480
44088 480
44112 480
44132 480
44156 480
44176 480
44200 455
44228 451
44252 448
44272 448
44296 448
44316 448
44340 448
44364 448
44384 448
44408 448
44428 448
44452 448
44472 448
44496 419
44520 419
44540 419
44564 419
44584 419
44608 422
44628 423
44652 448
44672 448
44696 448
44720 448
44740 448
44764 448
44784 448
44808 448
44828 448
44852 448
44876 448
44896 451
44920 455
44940 455
44964 480
44984 480
45008 480
45028 480
45052 480
45076 480
45096 480
45120 480
45140 480
45164 480
45184 480
45208 480
45232 480
45256 480
45280 480
45304 480
45324 480
45348 480
45368 480
45392 480
45412 480
45436 480
45456 480
45480 480
45504 480
45524 480
45548 480
45568 455
45592 455
45612 455
45636 451
45660 451
45680 448
45704 448
45724 448
45748 448
45768 448
45792 448
45812 448
45836 448
45860 448
