#('Delta t average = ', 22.387884709330727, ' us')
#('Delta t stdev = ', 2.1301129804823913, ' us')
#C = 0.22 uF 10%
#Passo di campionamento = 10 us
20 448
44 415
68 391
88 384
112 384
140 327
160 318
184 295
204 284
228 255
252 254
272 240
296 224
316 224
340 224
360 193
384 192
404 192
428 192
452 192
472 192
496 192
516 192
540 192
560 192
584 192
608 192
628 192
652 195
672 224
696 224
716 240
740 248
760 255
784 271
808 287
828 312
852 319
872 352
896 384
916 384
940 391
964 414
984 448
1008 448
1028 480
1052 496
1072 510
1096 526
1116 543
1140 568
1164 575
1188 608
1212 624
1232 636
1256 639
1276 655
1300 671
1320 704
1344 704
1364 704
1388 705
1412 711
1432 736
1456 768
1476 768
1500 768
1520 768
1544 768
1568 768
1588 768
1612 736
1632 707
1656 704
1676 704
1700 704
1720 671
1744 664
1768 647
1788 639
1812 632
1832 608
1856 608
1876 575
1900 568
1924 543
1944 521
1968 510
1988 496
2012 480
2032 449
2056 448
2076 415
2100 396
2124 384
2144 384
2168 352
2196 319
2216 312
2240 291
2260 284
2284 263
2308 255
2328 248
2352 240
2372 240
2396 224
2416 224
2440 224
2464 199
2484 195
2508 195
2528 195
2552 195
2572 199
2596 199
2616 224
2640 224
2664 224
2684 240
2708 240
2728 252
2752 255
2772 270
2796 284
2820 295
2840 316
2864 319
2884 352
2908 384
2928 384
2952 391
2972 412
2996 448
3020 448
3040 480
3064 480
3084 504
3108 512
3128 527
3152 543
3176 572
3204 583
3224 608
3248 624
3268 632
3292 639
3312 652
3336 664
3360 671
3380 704
3404 704
3424 704
3448 704
3468 707
3492 711
3516 711
3536 736
3560 711
3580 711
3604 711
3624 707
3648 704
3668 704
3692 704
3716 704
3736 671
3760 668
3780 655
3804 639
3824 636
3848 624
3872 608
3892 591
3916 575
3936 568
3960 543
3980 527
4004 511
4024 496
4048 480
4072 460
4092 448
4116 448
4136 414
4160 391
4180 384
4204 384
4232 352
4256 327
4276 319
4300 312
4320 287
4344 284
4368 271
4388 255
4412 255
4432 252
4456 248
4476 240
4500 240
4520 240
4544 224
4568 224
4588 224
4612 224
4632 224
4656 240
4676 240
4700 248
4724 252
4744 255
4768 255
4788 270
4812 284
4832 287
4856 304
4876 316
4900 319
4924 352
4944 384
4968 384
4988 384
5012 398
5032 415
5056 448
5080 448
5100 480
5124 480
5144 496
5168 508
5188 515
5212 536
5232 543
5260 568
5284 575
5308 583
5328 608
5352 608
5372 624
5396 632
5416 638
5440 639
5460 639
5484 652
5508 655
5528 655
5552 664
5572 664
5596 664
5616 664
5640 657
5664 655
5684 652
5708 639
5728 639
5756 632
5776 632
5800 624
5820 608
5844 608
5868 608
5888 583
5912 575
5932 572
5956 560
5976 543
6000 536
6024 519
6044 511
6068 504
6088 496
6112 480
6132 480
6156 448
6176 448
6200 448
6224 414
6244 399
6268 387
6288 384
6312 384
6332 384
6356 352
6380 352
6400 327
6424 319
6444 316
6468 312
6488 304
6516 287
6540 287
6564 286
6584 284
6608 280
6628 275
6652 271
6672 271
6696 275
6716 280
6740 284
6764 286
6784 287
6808 287
6828 304
6852 312
6872 316
6896 319
6920 319
6940 334
6964 352
6984 384
7008 384
7028 384
7052 384
7072 391
7096 399
7120 415
7140 448
7164 448
7184 448
7208 455
7228 480
7252 480
7276 496
7296 508
7320 512
7340 519
7364 531
7384 543
7408 547
7428 568
7452 572
7476 575
7496 575
7520 583
7548 591
7568 608
7592 608
7616 608
7636 608
7660 608
7680 608
7704 608
7724 608
7748 608
7768 608
7792 608
7816 608
7836 591
7860 583
7880 575
7904 575
7924 572
7948 568
7972 551
7992 543
8016 540
8036 526
8060 515
8080 510
8104 504
8124 496
8148 480
8172 480
8192 455
8216 448
8236 448
8260 448
8280 415
8304 408
8328 396
8348 385
8372 384
8392 384
8416 384
8436 384
8460 352
8480 352
8504 327
8528 323
8548 319
8576 318
8600 316
8620 312
8644 312
8668 312
8688 312
8712 304
8732 304
8756 312
8776 312
8800 312
8824 316
8844 318
8868 319
8888 319
8912 327
8932 335
8956 352
8976 352
9000 384
9024 384
9044 384
9068 384
9088 387
9112 398
9132 408
9156 415
9180 448
9200 448
9224 448
9244 455
9268 480
9288 480
9312 496
9332 504
9356 508
9380 512
9400 519
9424 527
9444 540
9468 543
9488 551
9512 568
9536 572
9556 574
9584 575
9608 575
9628 583
9652 588
9676 591
9696 608
9720 608
9740 608
9764 608
9784 608
9808 608
9828 591
9852 588
9876 583
9896 575
9920 575
9940 574
9964 572
9984 568
10008 551
10032 543
10052 542
10076 529
10096 519
10120 513
10140 510
10164 504
10184 496
10208 480
10232 480
10252 480
10276 449
10296 448
10320 448
10340 448
10364 415
10388 408
10408 399
10432 387
10452 384
10476 384
10496 384
10520 384
10540 384
10564 352
10588 352
10616 352
10636 335
10660 327
10680 327
10704 327
10728 319
10748 319
10772 319
10792 319
10816 323
10836 327
10860 327
10884 332
10904 352
10928 352
10948 352
10972 352
10992 384
11016 384
11036 384
11060 384
11084 384
11104 390
11128 399
11148 408
11172 415
11192 448
11216 448
11240 448
11260 449
11284 480
11304 480
11328 480
11348 496
11372 504
11392 508
11416 511
11440 515
11460 526
11480 568
11504 572
11524 575
11548 583
11572 590
11592 608
11616 608
11636 608
11660 608
11680 624
11704 624
11724 624
11748 624
11772 624
11792 624
11816 624
11836 624
11860 608
11880 608
11904 608
11928 591
11948 583
11972 575
11992 574
12016 568
12036 560
12060 543
12080 536
12104 526
12132 512
12156 508
12176 496
12200 480
12220 480
12244 455
12264 448
12288 448
12312 423
12332 414
12356 399
12376 387
12400 384
12420 384
12444 384
12468 352
12488 352
12512 332
12532 319
12556 319
12576 316
12600 312
12620 304
12644 291
12668 287
12688 287
12712 287
12732 286
12756 286
12776 286
12800 286
12824 287
12844 287
12868 287
12888 291
12912 304
12932 312
12956 316
12976 318
13000 319
13024 327
13044 352
13068 352
13088 384
13112 384
13132 384
13164 387
13184 399
13208 414
13228 419
13252 448
13272 448
13296 455
13316 480
13340 480
13364 496
13384 504
13408 510
13428 515
13452 527
13472 540
13496 543
13520 560
13540 568
13564 572
13584 575
13608 575
13628 583
13652 591
13672 608
13696 608
13720 608
13740 608
13764 608
13784 608
13808 608
13828 608
13852 608
13876 608
13896 608
13920 608
13940 588
13964 583
13984 575
14008 574
14028 568
14052 560
14076 547
14096 543
14120 531
14140 519
14164 512
14188 508
14212 496
14236 480
14256 480
14280 480
14300 449
14324 448
14344 448
14368 419
14388 414
14412 399
14436 391
14456 384
14480 384
14500 384
14524 384
14544 352
14568 352
14592 352
14612 327
14636 319
14656 319
14680 319
14700 316
14724 316
14744 316
14768 312
14792 312
14812 312
14836 312
14856 316
14880 316
14900 318
14924 318
14948 319
14968 323
14992 327
15012 352
15036 352
15056 384
15080 384
15100 384
15124 384
15148 384
15168 391
15192 399
15220 414
15240 419
15264 448
15288 448
15308 449
15332 480
15352 480
15376 480
15396 496
15420 504
15444 510
15464 515
15488 526
15508 536
15532 543
15552 547
15576 560
15596 568
15620 572
15644 575
15664 575
15688 583
15708 583
15732 590
15752 608
15776 608
15800 608
15820 608
15844 608
15864 608
15888 608
15908 591
15932 590
15952 583
15976 575
16000 575
16020 575
16044 572
16064 568
16088 560
16108 543
16132 543
16156 536
16176 524
16200 515
16228 510
16248 504
16272 496
16296 480
16316 480
16340 480
16360 451
16384 448
16404 448
16428 448
16448 415
16472 412
16496 399
16516 391
16540 384
16560 384
16584 384
16604 384
16628 384
16652 352
16672 352
16696 352
16716 352
16740 334
16760 327
16784 327
16804 319
16828 319
16852 319
16872 319
16896 319
16916 319
16940 327
16960 327
16984 334
17008 352
17028 352
17052 352
17072 384
17096 384
17116 384
17140 384
17160 384
17184 384
17208 391
17228 399
17252 412
17276 415
17296 422
17320 448
17340 448
17364 448
17384 451
17408 480
17428 480
17452 480
17476 480
17496 496
17520 504
17540 508
17564 510
17584 513
17608 519
17632 526
17652 527
17676 536
17696 542
17720 543
17740 543
17764 547
17784 560
17808 560
17832 560
17852 568
17876 568
17896 568
17920 568
17940 568
17964 560
17988 560
18008 560
18032 560
18052 550
18076 543
18100 543
18124 542
18148 540
18168 527
18192 527
18212 519
18236 513
18256 511
18280 508
18300 504
18324 496
18348 496
18368 480
18392 480
18412 480
18436 460
18456 451
18480 448
18504 448
18524 448
18548 448
18568 423
18592 415
18612 414
18636 408
18656 399
18680 398
18704 391
18724 387
18748 384
18768 384
18792 384
18812 384
18836 384
18860 384
18880 384
18904 384
18924 384
18948 384
18968 384
18992 384
19012 384
19036 384
19060 384
19080 384
19104 384
19132 387
19152 391
19176 396
19200 399
19220 408
19244 412
19264 415
19288 419
19308 448
19332 448
19352 448
19376 448
19400 449
19420 455
19444 480
19464 480
19488 480
19508 480
19532 496
19556 496
19576 504
19600 508
19620 511
19644 513
19664 518
19688 519
19708 527
19732 529
19756 536
19776 540
19800 542
19820 543
19844 543
19864 543
19888 543
19912 547
19932 547
19956 547
19976 543
20000 543
20020 543
20044 543
20064 543
20088 542
20112 540
20140 531
20160 527
20184 524
20204 519
20228 513
20252 511
20272 508
20296 504
20316 504
20340 496
20360 480
20384 480
20408 480
20428 480
20452 455
20472 449
20496 448
20516 448
20540 448
20560 448
20584 419
20608 415
20628 412
20652 401
20672 399
20696 391
20716 387
20740 384
20764 384
20784 384
20808 384
20828 384
20852 384
20872 384
20896 384
20916 384
20940 384
20964 384
20984 384
21008 384
21028 384
21052 384
21072 384
21096 384
21120 384
21140 384
21168 384
21192 384
21212 384
21236 384
21260 384
21280 385
21304 391
21324 398
21348 399
21368 408
21392 414
21412 415
21436 423
21460 448
21480 448
21504 448
21524 448
21548 449
21568 455
21592 480
21616 480
21636 480
21660 480
21680 496
21704 496
21724 496
21748 504
21768 504
21792 508
21816 511
21836 512
21860 513
21880 515
21904 519
21924 519
21948 521
21972 521
21992 526
22016 526
22036 527
22060 527
22080 526
22104 526
22124 519
22148 519
22172 519
22196 515
22220 512
22244 512
22264 510
22288 508
22308 508
22332 504
22352 496
22376 496
22400 496
22420 480
22444 480
22464 480
22488 480
22508 459
22532 451
22552 448
22576 448
22600 448
22620 448
22644 448
22664 423
22688 415
22708 415
22732 412
22756 408
22776 399
22800 396
22820 391
22844 387
22864 390
22888 384
22908 384
22936 387
22960 387
22980 385
23004 384
23032 384
23052 384
23076 384
23100 385
23120 385
23144 387
23164 387
23188 391
23208 391
23232 396
23256 399
23276 399
23300 408
23320 414
23344 415
23364 415
23388 419
23408 448
23432 448
23456 448
23476 448
23500 448
23520 448
23544 451
23564 455
23588 480
23612 480
23632 480
23656 480
23676 496
23700 496
23720 496
23744 504
23764 504
23788 508
23812 510
23832 511
23856 512
23876 515
23900 515
23920 519
23944 519
23968 524
23988 526
24012 527
24032 527
24060 527
24084 527
24108 527
24128 526
24152 526
24172 519
24196 519
24216 519
24240 515
24260 513
24284 512
24308 511
24328 510
24352 508
24372 504
24396 504
24416 496
24440 496
24464 480
24484 480
24508 480
24528 480
24552 480
24572 455
24596 451
24616 448
24640 448
24664 448
24684 448
24708 448
24728 448
24752 419
24772 415
24796 415
24820 414
24840 408
24864 403
24884 399
24908 399
24928 396
24952 391
24972 391
24996 391
25020 387
25040 387
25064 387
25092 387
25112 387
25136 387
25160 387
25180 391
25204 391
25224 391
25248 398
25268 399
25292 399
25316 408
25336 412
25360 414
25380 415
25404 415
25424 448
25448 448
25468 448
25492 448
25516 448
25536 448
25560 449
25580 455
25604 460
25624 480
25648 480
25672 480
25692 480
25716 496
25736 496
25760 496
25780 504
25804 504
25824 508
25848 510
25872 511
25892 512
25916 512
25936 515
25960 518
25980 519
26004 519
26028 519
26048 524
26072 524
26100 521
26120 524
26144 521
26168 519
26188 519
26212 519
26232 515
26256 513
26276 512
26300 511
26320 510
26344 508
26368 504
26388 504
26412 496
26432 496
26456 496
26476 480
26500 480
26524 480
26544 480
26568 480
26588 455
26612 449
26632 448
26656 448
26676 448
26700 448
26724 448
26744 448
26768 415
26788 415
26812 414
26832 408
26856 401
26880 399
26900 398
26924 391
26944 391
26968 387
26988 387
27012 387
27032 385
27056 384
27080 384
27100 384
27128 385
27152 385
27172 387
27196 391
27220 391
27240 391
27264 398
27284 399
27308 399
27328 408
27352 414
27376 415
27396 415
27420 423
27440 448
27464 448
27484 448
27508 448
27528 448
27552 449
27576 451
27596 480
27620 480
27640 480
27664 480
27684 496
27708 496
27732 496
27752 504
27776 508
27796 510
27820 511
27840 512
27864 515
27884 519
27908 521
27932 527
27952 527
27976 527
27996 536
28020 536
28040 536
28064 540
28088 540
28108 540
28132 540
28156 540
28180 536
28204 536
28224 531
28248 527
28268 527
28292 527
28312 521
28336 519
28356 515
28380 512
28404 511
28424 508
28448 508
28468 504
28492 496
28512 496
28536 496
28560 480
28580 480
28604 480
28624 480
28648 460
28676 455
28700 451
28720 448
28744 448
28764 448
28788 448
28812 448
28832 448
28856 448
28876 419
28900 415
28920 415
28944 415
28968 412
28988 408
29012 408
29032 399
29056 399
29076 399
29100 399
29128 398
29152 398
29172 398
29196 398
29216 399
29240 399
29260 399
29284 399
29308 399
29328 408
29352 408
29372 412
29396 415
29416 415
29440 415
29464 419
29484 448
29508 448
29528 448
29552 448
29572 448
29596 448
29616 449
29640 455
29664 460
29684 480
29708 480
29728 480
29752 480
29772 496
29796 496
29820 496
29840 504
29864 508
29884 508
29908 511
29928 512
29952 515
29972 519
29996 519
30020 524
30040 527
30064 527
30084 529
30108 536
30128 536
30160 540
30180 540
30204 540
30224 540
30248 540
30268 540
30292 536
30316 536
30336 536
30360 527
30380 527
30404 527
30424 524
30448 519
30468 515
30492 513
30516 511
30536 510
30560 508
30580 504
30604 504
30624 496
30648 496
30672 480
30692 480
30716 480
30736 480
30760 480
30780 455
30804 451
30824 448
30848 448
30872 448
30892 448
30916 448
30936 448
30960 448
30980 419
31004 415
31028 415
31048 414
31072 412
31092 412
31116 408
31136 403
31164 399
31188 399
31212 399
31232 399
31256 399
31276 399
31300 399
31320 399
31344 399
31368 403
31388 408
31412 412
31432 412
31456 414
31476 415
31500 415
31524 419
31544 448
31568 448
31588 448
31612 448
31632 448
31656 448
31676 448
31700 451
31724 455
31744 480
31768 480
31788 480
31812 480
31832 480
31856 481
31880 496
31900 496
31924 504
31944 504
31968 508
31988 508
32012 511
32032 511
32056 512
32080 515
32100 519
32124 519
32144 521
32168 524
32196 526
32220 527
32240 527
32264 527
32284 527
32308 527
32328 527
32352 526
32376 524
32396 519
32420 519
32440 519
32464 515
32484 512
32508 511
32528 510
32552 508
32576 504
32596 504
32620 504
32640 496
32664 496
32684 480
32708 480
32732 480
32752 480
32776 480
32796 455
32820 448
32840 448
32864 448
32884 448
32908 448
32932 448
32952 448
32976 419
32996 415
33020 415
33040 414
33064 412
33088 408
33108 401
33132 399
33152 399
33176 398
33196 395
33224 391
33248 391
33272 391
33292 391
33316 391
33336 391
33360 391
33380 391
33404 396
33424 398
33448 399
33472 399
33492 408
33516 412
33536 414
33560 415
33580 415
33604 419
33628 448
33648 448
33672 448
33692 448
33716 448
33736 448
33760 448
33780 451
33804 455
33828 480
33848 480
33872 480
33892 480
33916 480
33936 480
33960 496
33984 496
34004 496
34028 504
34048 504
34072 508
34092 508
34116 510
34136 510
34160 511
34184 512
34204 512
34228 513
34256 513
34276 515
34300 515
34320 513
34344 513
34368 513
34388 513
34412 481
34432 480
34456 480
34476 480
34500 480
34520 480
34544 480
34568 480
34588 480
34612 480
34632 480
34656 480
34676 480
34700 480
34720 480
34744 480
34768 455
34788 455
34812 455
34832 451
34856 449
34876 448
34900 448
34924 448
34944 448
34968 448
34988 448
35012 448
35032 448
35056 448
35076 448
35100 448
35124 448
35144 448
35168 448
35188 448
35212 448
35232 448
35256 448
35280 448
35300 448
35324 448
35352 448
35372 448
35396 448
35420 448
35440 448
35464 448
35484 448
35508 448
35528 448
35552 448
35572 448
35596 448
35620 448
35640 448
35664 448
35684 449
35708 451
35728 455
35752 455
35776 460
35796 480
35820 480
35840 480
35864 480
35884 480
35908 480
35928 480
35952 480
35976 480
35996 480
36020 480
36040 496
36064 496
36084 496
36108 496
36132 496
36152 496
36176 496
36196 496
36220 496
36240 496
36264 496
36284 496
36308 496
36332 496
36352 496
36380 496
36404 496
36424 496
36448 496
36472 496
36492 496
36516 496
36536 496
36560 480
36580 480
36604 480
36628 480
36648 480
36672 480
36692 480
36716 480
36736 480
36760 460
36780 455
36804 451
36828 449
36848 448
36872 448
36892 448
