8 504
120 510
236 511
348 513
460 519
572 515
684 512
796 510
908 508
1020 504
1132 497
1252 496
1364 492
1476 487
1588 483
1700 481
1812 483
1924 487
2036 492
2148 496
2268 497
2380 504
2492 504
2604 510
2716 512
2828 515
2940 513
3056 512
3168 508
3284 504
3396 504
3508 497
3620 496
3736 492
3848 487
3960 483
4072 480
4184 483
4300 487
4416 494
4528 496
4640 504
4752 504
4864 508
4976 511
5088 513
5200 519
5320 515
5432 513
5544 511
5656 508
5768 504
5880 504
5992 496
6104 496
6216 487
6336 487
6448 481
6560 487
6672 487
6784 496
6896 496
7008 504
7120 504
7232 508
7352 511
7464 513
7576 519
7688 519
7800 513
7912 512
8024 508
8136 504
8252 504
8368 496
8480 496
8592 487
8704 487
8816 481
8932 483
9044 487
9156 494
9268 496
9384 504
9496 504
9612 508
9724 511
9836 513
9948 515
10060 519
10172 513
10284 511
10404 508
10516 504
10628 504
10740 496
10852 494
10964 487
11076 487
11188 481
11300 483
11420 487
11532 492
11644 496
11756 497
11868 504
11980 508
12092 510
12204 512
12316 515
12436 519
12548 513
12660 511
12772 508
12884 504
12996 497
13108 496
13220 492
13332 487
13452 483
13564 480
13676 480
13788 483
13900 487
14012 494
14128 496
14240 504
14352 504
14468 508
14580 512
14692 513
14808 515
14920 513
15032 511
15144 508
15256 504
15368 504
15480 496
15596 496
15708 487
15820 487
15932 483
16044 483
16156 487
16268 492
16380 496
16492 497
16612 504
16724 508
16836 510
16948 512
17060 515
17172 519
17288 515
17400 512
17512 510
17628 504
17740 504
17852 497
17968 496
18080 492
18192 487
18304 483
18416 483
18528 487
18644 492
18760 496
18872 497
18984 504
19096 504
19208 508
19320 512
19432 515
19544 519
19664 515
19776 512
19888 510
20000 504
20112 504
20224 497
20336 496
20448 492
20560 487
20680 483
20792 481
20904 487
21016 487
21128 496
21240 496
21352 504
21464 504
21576 508
21696 512
21808 515
21920 519
22032 515
22144 512
22256 511
22368 508
22484 504
22596 499
22712 496
22824 492
22936 487
23048 483
23160 481
23276 487
23388 487
23500 494
23612 496
23728 499
23840 504
23956 508
24068 510
24180 513
24292 515
24404 515
24516 512
24628 510
24748 504
24860 504
24972 497
25084 496
25196 492
25308 487
25420 483
25532 481
25644 487
25764 487
25876 496
25988 496
26100 504
26212 504
26324 508
26436 511
26548 513
26660 519
26780 515
26892 513
27004 511
27116 508
27228 504
27340 504
27452 496
27564 494
27676 487
27796 483
27908 481
28020 487
28132 487
28244 494
28356 496
28472 504
28584 504
28696 508
28812 511
