24 31
136 31
252 31
364 31
476 31
588 31
700 31
812 31
924 31
1036 31
1152 31
1264 31
1376 31
1488 33
1600 736
1712 736
1824 736
1936 736
2048 736
2168 736
2280 736
2392 736
2504 736
2616 736
2728 736
2840 736
2952 736
3064 31
3184 31
3296 31
3408 31
3520 31
3632 31
3744 31
3856 31
3972 31
4084 31
4200 31
4312 31
4424 31
4536 31
4652 736
4764 736
4876 736
4988 736
5100 736
5216 736
5332 736
5444 736
5556 736
5668 736
5780 736
5892 736
6004 736
6116 31
6236 31
6348 31
6460 31
6572 31
6684 31
6796 31
6908 31
7020 31
7132 31
7252 31
7364 31
7476 31
7588 31
7700 736
7812 736
7924 736
8036 736
8148 736
8268 736
8380 736
8492 736
8604 736
8716 736
8828 736
8940 736
9052 736
9168 31
9284 31
9396 31
9508 31
9620 31
9732 31
9848 31
9960 31
10072 31
10184 31
10300 31
10412 31
10528 31
10640 31
10752 736
10864 736
10976 736
11088 736
11200 736
11320 736
11432 736
11544 736
11656 736
11768 736
11880 736
11992 736
12104 736
12216 31
12336 31
12448 31
12560 31
12672 31
12784 31
12896 31
13008 31
13120 31
13232 31
13352 31
13464 31
13576 31
13688 31
13800 736
13912 736
14024 736
14136 736
14248 736
14368 736
14480 736
14592 736
14704 736
14816 736
14928 736
15044 736
15156 736
15268 31
15384 31
15496 31
15608 31
15724 31
15836 31
15948 31
16060 31
16172 31
16284 31
16396 31
16512 31
16624 31
16736 736
16848 736
16960 736
17072 736
17184 736
17296 736
17408 736
17528 736
17640 736
17752 736
17864 736
17976 736
18088 736
18204 736
18316 31
18428 31
18544 31
18656 31
18768 31
18884 31
18996 31
19108 31
19220 31
19332 31
19444 31
19560 31
19676 31
19788 736
19900 736
20012 736
20124 736
20236 736
20348 736
20460 736
20580 736
20692 736
20804 736
20916 736
21028 736
21140 736
21252 736
21364 31
21476 31
21596 31
21708 31
21820 31
21932 31
22044 31
22156 31
22268 31
22380 31
22492 31
22612 31
22724 31
22836 736
22948 736
23060 736
23172 736
23284 736
23400 736
23512 736
23628 736
23740 736
23852 736
23964 736
24080 736
24192 736
24304 736
24416 31
24528 31
24644 31
24760 31
24872 31
24984 31
25096 31
25208 31
25320 31
25432 31
25544 31
25664 31
25776 31
25888 736
26000 736
26112 736
26224 736
26336 736
26448 736
26560 736
26680 736
26792 736
26904 736
27016 736
27128 736
27240 736
27352 736
27464 31
27576 31
27696 31
27808 31
27920 31
28032 31
28144 31
28256 31
28368 31
28480 31
28596 31
28712 31
28824 31
28932 736
29044 736
29156 736
29268 736
29380 736
29496 736
29608 736
29724 736
29836 736
29948 736
30060 736
30172 736
30288 736
30400 736
30512 31
30624 31
30740 31
30852 31
30968 31
31080 31
31192 31
31304 31
31416 31
31528 31
31640 31
31760 31
31872 31
31984 736
32096 736
32208 736
32320 736
32432 736
32544 736
32656 736
32776 736
32888 736
33000 736
33112 736
33224 736
33336 736
33448 736
33560 31
33672 31
33792 31
33904 31
34016 31
34128 31
34240 31
34352 31
34464 31
34576 31
34688 31
34804 31
34920 31
35032 736
35144 736
35256 736
35368 736
35484 736
35596 736
35708 736
35820 736
35936 736
36048 736
36160 736
36272 736
36384 736
36496 736
36608 31
36720 31
36832 31
36952 31
37064 31
37176 31
37288 31
37400 31
37512 31
37624 31
37736 31
37852 31
37968 31
38080 736
38192 736
38304 736
38416 736
38528 736
38644 736
38756 736
38868 736
38984 736
39096 736
39208 736
39324 736
39436 736
39548 736
39660 31
39772 31
39884 31
40000 31
40116 31
40228 31
40340 31
40452 31
40564 31
40676 31
40788 31
40900 31
41020 31
41132 736
41244 736
41356 736
41468 736
41580 736
41692 736
41804 736
41916 736
42036 736
42148 736
42260 736
42372 736
42484 736
42596 736
42708 31
42820 31
42932 31
43052 31
43164 31
43276 31
43388 31
43500 31
43612 31
43724 31
43840 31
43952 31
44068 31
44180 736
44292 736
44404 736
44520 736
44632 736
44744 736
44856 736
44968 736
45084 736
45200 736
45312 736
45424 736
45536 736
45648 352
45760 31
45872 31
45984 31
46104 31
46216 31
46328 31
46440 31
46552 31
46664 31
46776 31
46888 31
47000 31
47120 31
47232 736
47344 736
47456 736
47568 736
47680 736
47792 736
47904 736
48016 736
48136 736
48248 736
48360 736
48472 736
48584 736
48696 31
48808 31
48920 31
49032 31
49152 31
49264 31
49376 31
49488 31
49600 31
49712 31
49828 31
49940 31
50052 31
50168 31
50280 736
50392 736
50508 736
50620 736
50732 736
50844 736
50956 736
51068 736
51180 736
51296 736
51408 736
51520 736
51632 736
51744 31
51856 31
51968 31
52080 31
52192 31
52312 31
52424 31
52536 31
52648 31
52760 31
52872 31
52988 31
53100 31
53212 31
53328 736
53440 736
53552 736
53668 736
53780 736
53892 736
54004 736
54116 736
54228 736
54344 736
54460 736
54572 736
54684 736
54796 31
54908 31
55020 31
55132 31
55244 31
55364 31
55476 31
55588 31
55700 31
55812 31
55924 31
56036 31
56148 31
56260 31
56380 736
56492 736
56604 736
56716 736
56828 736
56940 736
57052 736
57164 736
57276 736
57396 736
57508 736
57620 736
57732 736
57852 31
57964 31
58084 31
58196 31
58308 31
58420 31
58532 31
58644 31
58756 31
58868 31
58980 31
59100 31
59212 31
59324 31
59436 736
59548 736
59660 736
59772 736
59884 736
59996 736
60116 736
60228 736
60340 736
60452 736
60564 736
60676 736
60788 736
60900 31
61012 31
61132 31
61244 31
61356 31
61468 31
61580 31
61692 31
61804 31
61920 31
62032 31
62144 31
62260 31
62372 31
62484 736
62600 736
62712 736
62824 736
62936 736
63048 736
63160 736
63276 736
63392 736
63504 736
63616 736
63728 736
63840 736
63952 31
64064 31
64176 31
64296 31
64408 31
64520 31
64632 31
64744 31
64856 31
64968 31
65080 31
65192 31
65312 31
65424 31
65536 736
65648 736
65760 736
65872 736
65984 736
66096 736
66208 736
66328 736
66440 736
66552 736
66664 736
66776 736
66888 736
67000 31
67116 31
67228 31
67344 31
67456 31
67568 31
67680 31
67796 31
67908 31
68020 31
68132 31
68244 31
68360 31
68476 31
68588 736
68700 736
68812 736
68924 736
69036 736
69148 736
69260 736
69380 736
69492 736
69604 736
69716 736
69828 736
69940 736
70052 31
70164 31
70276 31
70396 35
70508 31
70620 31
70732 31
70844 31
70956 31
71068 31
71180 31
71292 31
71412 31
71524 31
71636 736
71748 736
71860 736
71972 736
72084 736
72196 736
72312 736
72428 736
72540 736
72652 736
72764 736
72876 736
72992 736
73104 31
73216 31
73328 31
73444 31
73556 31
73672 31
73784 31
73896 31
74008 31
74120 31
74232 31
74344 31
74464 31
74576 736
74688 736
74800 736
74912 736
75024 736
75136 736
75248 736
75360 736
75480 736
75592 736
75704 736
75816 736
75928 736
76040 736
76152 31
76264 31
76376 31
76496 31
76608 31
76720 31
76832 31
76944 31
77056 31
77168 31
77280 31
77392 31
77508 31
77624 736
77736 736
77848 736
77960 736
78072 736
78188 736
78300 736
78412 736
78524 736
78640 736
78752 736
78864 736
78976 736
79088 736
79200 31
79312 31
79424 31
79536 31
79656 31
79768 31
79880 31
79992 31
80104 31
80216 31
80328 31
80440 31
80556 31
80672 736
80784 736
80896 736
81008 736
81120 736
81232 736
81348 736
81460 736
81572 736
81688 736
81800 736
81912 736
82028 736
82140 736
82252 31
82364 33
82476 31
82588 31
82704 31
82820 31
82932 31
83044 31
83156 31
83268 31
83380 31
83492 31
83604 31
83724 736
83836 736
83948 736
84060 736
84172 736
84284 736
84396 736
84508 736
84620 736
84740 736
84852 736
84964 736
85076 736
85188 736
85300 31
85412 31
85524 31
85636 31
85756 31
85868 31
85980 31
86092 31
86204 31
86316 31
86428 31
86544 31
86656 31
86772 736
86884 736
87000 736
87112 736
87224 736
87336 736
87448 736
87560 736
87680 736
87792 736
87904 736
88016 736
88128 736
88240 736
88352 31
88464 31
88576 31
88696 31
88808 31
88920 31
89032 31
89144 31
89256 31
89368 31
89480 31
89592 31
89712 31
89824 736
89936 736
90048 736
90160 736
90272 736
90384 736
90496 736
90608 736
90728 736
90840 736
90952 736
91064 736
91176 736
91288 736
91400 31
91516 31
91628 31
91744 31
91856 31
91968 31
92080 31
92196 31
92308 31
92420 31
92532 31
92644 31
92760 31
92876 736
92988 736
93100 736
93212 736
93324 736
93436 736
93548 736
93660 736
93780 736
93892 736
94004 736
94116 736
94228 736
94340 736
94452 35
94564 31
94676 31
94796 31
94908 31
95020 31
95132 31
95244 31
95356 31
95468 31
95580 31
95692 31
95812 31
95924 736
96036 736
96148 736
96260 736
96372 736
96484 736
96596 736
96712 736
96828 736
96940 736
97052 736
97164 736
97276 736
97392 736
97504 31
97616 31
97728 31
97844 31
97956 31
98072 31
98184 33
98296 31
98408 31
98520 31
98632 31
98744 31
98864 31
98976 736
99088 736
99200 736
99312 736
99424 736
99536 736
99648 736
99760 736
99880 736
99992 736
100104 736
100216 736
100328 736
100440 736
100552 31
100664 31
100776 31
100896 31
101008 31
101120 31
101232 31
101344 31
101456 31
101568 31
101680 31
101792 31
101912 31
102024 736
102136 736
102248 736
102360 736
102472 736
102588 736
102700 736
102812 736
102928 736
103040 736
103152 736
103268 736
103380 736
103492 39
103604 31
103716 31
103828 31
103940 31
104056 31
104168 31
104280 31
104392 31
104504 31
104616 31
104728 31
104840 31
104952 31
105072 736
105184 736
105296 736
105408 736
105520 736
105632 736
105748 736
105860 736
105972 736
106088 736
106200 736
106312 736
106428 736
106540 31
106652 31
106764 31
106876 31
106988 31
107104 31
107220 31
107332 31
107444 31
107556 31
107668 31
107780 31
107892 31
108004 31
108124 736
108236 736
108348 736
108460 736
108572 736
108684 736
108796 736
108908 736
109020 736
109140 736
109252 736
109364 736
109476 736
109588 31
109700 31
109812 31
109924 31
110036 31
110156 31
110268 31
110380 31
110492 31
110604 31
110716 31
110828 31
110944 31
111056 31
111172 736
111284 736
111396 736
111508 736
111624 736
111736 736
111848 736
111960 736
112072 736
112188 736
112304 736
112416 736
112528 736
112640 31
112752 35
112864 31
112976 31
113088 31
113208 31
113320 31
113432 31
113544 31
113656 31
113768 31
113880 31
113992 31
114104 31
114224 736
114336 736
114448 736
114560 736
114672 736
114784 736
114896 736
115008 736
115120 736
115240 736
115352 736
115464 736
115576 736
115692 31
115804 31
115920 31
116036 31
116148 31
116260 31
116372 31
116484 31
116596 31
116712 31
116824 31
116936 31
117052 31
117164 31
117276 736
117392 736
117504 736
117616 736
117728 736
117840 736
117952 736
118068 736
118184 736
118296 736
118408 736
118520 736
118632 736
118744 31
118856 31
118968 31
119088 31
119200 31
119312 31
119424 31
119536 31
119648 31
119760 31
119872 31
119984 31
120104 31
120216 31
120328 736
120440 736
120552 736
120664 736
120776 736
120888 736
121000 736
121120 736
121232 736
121344 736
121456 736
121568 736
121680 736
121792 31
121908 31
122020 31
122136 31
122248 31
122360 31
122472 31
122588 31
122700 31
122812 31
122924 31
123036 31
123148 31
123264 31
123376 736
123488 736
123600 736
123712 736
123824 736
123936 736
124048 736
124160 736
124280 736
124392 736
124504 736
124616 736
124728 736
124840 31
124952 31
125064 31
125180 31
125296 31
125408 31
125520 31
125632 31
125744 31
125860 31
125972 31
126084 31
126196 31
126312 31
126424 736
126540 736
126652 736
126764 736
126876 736
126988 736
127100 736
127212 736
127332 736
127444 736
127556 736
127668 736
127780 736
127892 31
128004 31
128116 31
128228 31
128348 31
128460 31
128572 31
128684 31
128796 31
128908 31
129020 31
129132 31
129244 31
129364 31
129476 736
129588 736
129700 736
129812 736
129924 736
130036 736
130148 736
130260 736
130380 736
130492 736
130604 736
130716 736
130828 736
130940 31
131056 31
131168 31
131280 31
131396 31
131508 31
131620 31
131736 31
131848 31
131960 31
132072 31
132184 31
132296 31
132412 31
132528 736
132640 736
132752 736
132864 736
132976 736
133088 736
133200 736
133312 736
133432 736
133544 736
133656 736
133768 736
133880 736
133992 31
134104 31
134216 31
134328 31
134448 31
134560 31
134672 31
134784 31
134896 31
135008 31
135120 31
135232 31
135344 31
135464 736
135576 736
135688 736
135800 736
135912 736
136024 736
136136 736
136252 736
136364 736
136480 736
136592 736
136704 736
136816 736
136932 736
137044 31
137156 31
137268 31
137380 31
137496 31
137612 31
137724 31
137836 31
137948 31
138060 31
138172 31
138284 31
138396 31
138508 736
138624 736
138736 736
138848 736
138960 736
139072 736
139184 736
139296 736
139408 736
139520 736
139640 736
139752 736
139864 736
139976 736
140088 31
140200 31
140312 31
140424 31
140540 31
140656 31
140768 31
140880 31
140992 31
141104 31
141216 31
141332 31
141444 31
141556 736
141672 736
141784 736
141896 736
142012 736
142124 736
142236 736
142348 736
142460 736
142572 736
142688 736
142804 736
142916 736
143028 736
143140 31
143252 31
143364 31
143476 31
143588 31
143708 31
143820 31
143932 31
144044 31
144156 31
144268 31
144380 35
144492 31
144604 736
144716 736
144828 736
144940 736
145056 736
145172 736
145284 736
145396 736
145508 736
145620 736
145732 736
145848 736
145960 736
146072 736
146188 31
146300 31
146412 31
146528 31
146640 31
146752 31
146864 31
146976 31
147088 31
147204 31
147320 31
147432 31
147544 31
147656 736
147768 736
147880 736
147992 736
148104 736
148224 736
148336 736
148448 736
148560 736
148672 736
148784 736
148896 736
149008 736
149120 736
149240 31
149352 31
149464 31
149576 31
149688 31
149800 31
149912 31
150024 31
150136 31
150256 31
150368 31
150480 31
150592 31
150704 736
150816 736
150928 736
151044 736
151156 736
151272 736
151384 736
151496 736
151608 736
151724 736
151836 736
151948 736
152060 736
152172 736
152288 31
152404 31
152516 31
152628 31
152740 31
152852 31
152964 31
153076 31
153188 31
153308 31
153420 31
153532 31
153644 31
153756 736
153868 736
153980 736
154092 736
154204 736
154316 736
154436 736
154548 736
154660 736
154772 736
154884 736
154996 736
155108 736
155220 736
155332 31
155452 31
155564 31
155676 31
155788 31
155900 31
156012 31
156124 31
156240 31
156352 31
156468 31
156580 31
156692 31
156804 736
156920 736
157032 736
157144 736
157256 736
157368 736
157484 736
157600 736
157712 736
157824 736
157936 736
158048 736
158160 736
158272 736
158384 31
158504 31
158616 31
158728 31
158840 31
158952 31
159064 31
159176 33
159288 31
159400 31
159520 31
159632 31
159744 31
159856 736
159968 736
160080 736
160192 736
160304 736
160416 736
160536 736
160648 736
160760 736
160872 736
160984 736
161096 736
161208 736
161320 736
161436 31
161552 31
161664 31
161776 31
161888 31
162000 31
162116 31
162228 31
162340 31
162452 31
162568 31
162680 31
162796 31
162908 736
163020 736
163132 736
163244 736
163356 736
163468 736
163588 736
163700 736
163812 736
163924 736
164036 736
164148 736
164260 736
164372 736
164484 31
164604 31
164716 31
164828 31
164940 31
165052 33
165164 31
165276 31
165388 31
165500 31
165620 31
165732 31
165844 31
165956 736
166068 736
166180 736
166292 736
166404 736
166516 736
166636 736
166748 736
166860 736
166972 736
167084 736
167196 736
167312 736
167424 736
167536 31
167652 31
167764 31
167876 31
167992 31
168104 31
168216 31
168328 31
168440 31
168552 31
168668 31
168784 31
168896 31
169008 736
169120 736
169232 736
169344 736
169456 736
169568 736
169680 736
169800 736
169912 736
170024 736
170136 736
170248 736
170360 736
170472 736
170584 31
170696 31
170816 31
170928 31
171040 31
171152 31
171264 31
171376 31
171488 31
171600 31
171712 31
171832 31
171944 31
172056 736
172168 736
172280 736
172392 736
172504 736
172620 736
172732 736
172848 736
172960 736
173072 736
173184 736
173300 736
173412 736
173528 31
173640 31
173752 31
173864 31
173976 31
174088 31
174204 31
174316 31
174428 31
174544 31
174656 31
174768 31
174880 31
174996 31
175108 736
175220 736
175332 736
175444 736
175560 736
175676 736
175788 736
175900 736
176012 736
176124 736
176236 736
176348 736
176460 736
176580 31
176692 31
176804 31
176916 31
177028 31
177140 31
177252 31
177364 31
177476 31
177588 31
177708 31
177820 31
177932 31
178044 31
178156 736
178268 736
178380 736
178492 736
178604 736
178724 736
178836 736
178948 736
179060 736
179172 736
179284 736
179396 736
179508 736
179620 31
179740 31
179852 31
179964 31
180076 31
180188 31
180300 31
180412 31
180524 31
180640 31
180756 31
180868 31
180980 31
181092 31
181204 736
181316 736
181432 736
181544 736
181656 736
181772 736
181884 736
181996 736
182108 736
182224 736
182336 736
182448 736
182560 736
182672 31
182788 35
182904 31
183016 35
183128 31
183240 31
183352 31
183464 31
183576 31
183688 31
183808 31
183920 31
184032 31
184144 31
184256 736
184368 736
184480 736
184592 736
184704 736
184824 736
184936 736
185048 736
185160 736
185272 736
185384 736
185496 736
185608 736
185720 31
185840 31
185952 31
186064 31
186176 31
186288 31
186400 31
186512 31
186624 31
186740 31
186856 31
186968 31
187080 31
187192 31
187304 736
187420 736
187532 736
187644 736
187756 736
187872 736
187984 736
188100 736
188212 736
188324 736
188436 736
188548 736
188660 736
188772 31
188892 31
189004 31
189116 31
189228 31
189340 31
189452 31
189564 31
189676 31
189788 31
189908 31
190020 31
190132 31
190244 31
190356 736
190468 736
190580 736
190692 736
190804 736
190924 736
191036 736
191148 736
191260 736
191372 736
191484 736
191596 736
191708 736
191820 31
191940 31
192052 31
192164 31
192276 31
192388 31
192500 31
192616 31
192728 31
192840 31
192956 31
193068 31
193180 31
193296 31
193408 736
193520 736
193632 736
193744 736
193856 736
193968 736
194084 736
194196 736
194308 736
194420 736
194532 736
194644 736
194756 736
194868 31
194980 31
195100 31
195212 31
195324 31
195436 31
195548 31
195660 31
195776 31
195888 31
196000 31
196116 31
196228 31
196340 31
196456 736
196568 736
196680 736
196792 736
196904 736
197016 736
197132 736
197248 736
197360 736
197472 736
197584 736
197696 736
197808 736
197920 31
198032 31
198152 31
198264 31
198376 31
198488 31
198600 31
198712 31
198824 31
198936 31
199048 31
199168 31
199280 31
199392 31
199504 736
199616 736
199728 736
199840 736
199952 736
200064 736
200184 736
200296 736
200408 736
200520 736
200632 736
200744 736
200856 736
200972 31
201084 31
201200 31
201312 31
201424 31
201536 31
201652 31
201764 31
201876 31
201988 31
202100 31
202216 31
202332 31
202452 736
202564 736
202676 736
202788 736
202900 736
203012 736
203132 736
203244 736
203356 736
203468 736
203580 736
203692 736
203804 736
203916 736
204028 31
204148 31
204260 31
204372 31
204484 31
204596 31
204708 31
204820 31
204932 31
205044 31
205164 31
205276 31
205388 31
205500 736
205612 736
205724 736
205836 736
205948 736
206060 736
206180 736
206292 736
206404 736
206516 736
206628 736
206740 736
206856 736
206968 736
207080 31
207196 31
207308 31
207420 31
207536 31
207648 31
207760 31
207872 31
207984 31
208096 31
208212 31
208328 31
208440 31
208552 736
208664 736
208776 736
208888 736
209000 736
209112 736
209232 736
209344 736
209456 736
209568 736
209680 736
209792 736
209904 736
210016 736
210128 31
210248 31
210360 31
210472 31
210584 31
210696 31
210808 31
210920 31
211032 31
211144 31
211264 31
211376 31
211488 31
211600 736
211712 736
211824 736
211936 736
212052 736
212164 736
212280 736
212392 736
212504 736
212616 736
212732 736
212844 736
212956 736
213068 736
213180 31
213296 31
213412 31
213524 31
213636 31
213748 31
213860 31
213972 31
214084 31
214196 31
214316 31
214428 31
214540 31
214652 736
214764 736
214876 736
214988 736
215100 736
215212 736
215332 736
215444 736
215556 736
215668 736
215780 736
215892 736
216004 736
216116 736
216228 31
216348 31
216460 31
216572 31
216684 31
216796 31
216908 31
217020 31
217132 31
217248 31
217364 31
217476 31
217588 31
217700 736
217812 736
217924 736
218040 736
218152 736
218264 736
218380 736
218492 736
218604 736
218720 736
218832 736
218944 736
219056 736
219168 736
219280 31
219392 31
219508 31
219620 31
219732 31
219844 31
219956 31
220068 31
220180 31
220292 31
220404 31
220524 31
220636 31
220748 736
220860 736
220972 736
221084 736
221200 736
221312 736
221424 736
221540 736
221652 736
221764 736
221880 736
221992 736
222104 736
222216 736
222328 31
222440 31
222556 31
222672 31
222784 31
222896 31
223008 31
223120 31
223232 31
223344 31
223456 31
223576 31
223688 31
223800 736
223912 736
224024 736
224136 736
224248 736
224360 736
224472 736
224592 736
224704 736
224816 736
224928 736
225040 736
225152 736
225264 736
225376 31
225488 31
225608 31
225720 31
225832 31
225944 31
226056 31
226168 31
226280 31
226396 31
226508 31
226624 31
226736 31
226848 736
226960 736
227076 736
227188 736
227300 736
227412 736
227524 736
227640 736
227756 736
227868 736
227980 736
228092 736
228204 736
228316 736
228428 31
228540 31
228660 31
228772 31
228884 31
228996 31
229108 31
229220 31
229332 31
229444 31
229556 31
229676 31
229788 31
229900 736
230012 736
230124 736
230236 736
230348 736
230460 736
230572 736
230692 736
230804 736
230916 736
231028 736
231140 736
231252 736
