24 448
44 448
68 401
88 384
112 384
132 352
156 319
180 312
200 287
224 271
244 255
268 248
288 224
312 224
336 192
356 192
380 159
400 152
424 135
444 127
472 120
496 112
520 96
540 96
564 96
584 71
608 70
628 63
652 63
676 63
696 62
720 62
740 62
764 62
784 63
808 63
832 67
852 71
876 96
896 96
920 96
940 112
964 112
984 124
1008 127
1032 140
1052 156
1076 163
1096 192
1120 192
1140 224
1164 224
1188 240
1208 254
1232 263
1252 286
1276 304
1296 318
1320 327
1340 352
1364 384
1388 384
1408 399
1432 415
1452 448
1476 451
1504 480
1528 504
1548 511
1572 527
1592 543
1616 568
1636 575
1660 608
1684 608
1704 632
1728 639
1748 649
1772 668
1792 675
1816 704
1836 704
1860 711
1884 768
1904 768
1928 768
1948 768
1972 768
1992 768
2016 768
2040 775
2060 780
2084 783
2104 783
2128 792
2148 792
2172 792
2192 792
2216 783
2240 787
2260 783
2284 782
2304 775
2328 771
2348 768
2372 768
2396 768
2416 768
2440 768
2460 768
2484 768
2504 711
2532 704
2556 704
2580 671
2600 664
2624 647
2644 638
2668 632
2688 608
2712 608
2732 575
2756 572
2780 551
2800 540
2824 519
2844 511
2868 496
2888 480
2912 480
2936 448
2956 448
2980 415
3000 399
3024 385
3044 384
3068 384
3088 352
3112 327
3136 319
3156 312
3180 291
3200 284
3224 270
3244 255
3268 252
3292 248
3312 240
3336 224
3356 224
3380 199
3400 193
3424 192
3444 192
3468 192
3492 192
3512 192
3536 163
3564 159
3584 159
3608 159
3628 159
3652 159
3676 159
3696 159
3720 163
3740 192
3764 192
3784 192
3808 192
3832 192
3852 192
3876 195
3896 224
3920 224
3940 224
3964 240
3984 248
4008 252
4032 255
4052 270
4076 280
4096 287
4120 304
4140 318
4164 323
4188 352
4208 256
4232 384
4252 384
4276 387
4296 399
4320 415
4340 448
4364 448
4388 455
4408 480
4432 480
4452 496
4476 510
4496 515
4520 527
4544 543
4572 560
4592 572
4616 575
4636 591
4660 608
4680 624
4704 624
4728 636
4748 639
4772 639
4792 654
4816 664
4836 670
4860 671
4884 704
4904 704
4928 704
4948 704
4972 704
4992 704
5016 705
5036 704
5060 704
5084 704
5104 704
5128 704
5148 704
5172 704
5192 704
5216 704
5240 704
5260 704
5284 704
5304 675
5328 671
5348 670
5372 659
5392 654
5416 639
5440 639
5460 636
5484 632
5504 624
5528 608
5548 608
5572 583
5600 574
5624 568
5644 547
5668 542
5688 527
5712 519
5736 510
5764 496
5788 480
5808 480
5832 455
5856 448
5880 448
5904 448
5924 415
5948 399
5968 391
5992 384
6012 384
6036 384
6056 384
6080 352
6104 335
6124 319
6148 319
6168 316
6192 312
6212 295
6236 287
6260 286
6280 275
6304 271
6324 263
6348 255
6368 255
6392 255
6412 254
6436 252
6460 252
6480 252
6504 248
6524 248
6548 248
6568 248
6592 248
6616 252
6636 252
6660 254
6680 255
6704 255
6724 255
6748 255
6768 270
6792 271
6816 280
6836 286
6860 287
6888 304
6908 312
6932 318
6952 319
6976 327
7000 335
7020 352
7044 384
7064 384
7088 384
7108 384
7132 385
7156 391
7176 408
7200 415
7220 448
7244 448
7264 448
7288 451
7308 480
7332 480
7356 480
7376 496
7400 504
7420 510
7444 513
7464 524
7488 531
7512 542
7532 543
7556 560
7576 568
7600 574
7620 575
7644 583
7664 588
7688 608
7712 608
7732 608
7756 608
7776 624
7800 624
7820 624
7844 632
7868 632
7896 636
7916 636
7940 636
7960 638
7984 638
8004 638
8028 638
8052 638
8072 636
8096 636
8116 636
8140 632
8160 632
8184 624
8208 624
8228 624
8252 608
8272 608
8296 608
8316 608
8340 591
8360 583
8384 575
8408 574
8428 572
8452 568
8472 551
8496 543
8516 540
8540 529
8564 524
8584 515
8608 510
8628 508
8652 496
8672 496
8696 480
8716 480
8740 480
8764 451
8784 448
8808 448
8828 448
8852 448
8872 415
8896 412
8924 399
8948 391
8968 385
8992 384
9012 384
9036 384
9060 384
9080 384
9104 384
9124 352
9148 352
9168 352
9192 334
9212 327
9236 319
9260 319
9280 319
9304 319
9324 318
9348 316
9368 316
9392 316
9416 316
9436 316
9460 316
9480 316
9504 316
9524 316
9548 316
9568 318
9592 318
9616 319
9636 319
9660 319
9680 327
9704 327
9724 334
9748 352
9772 352
9792 352
9816 384
9836 384
9860 384
9880 384
9904 384
9924 384
9952 384
9976 391
10000 398
10020 401
10044 414
10064 415
10088 448
10108 448
10132 448
10152 448
10176 448
10200 455
10220 480
10244 480
10264 480
10288 480
10308 496
10332 504
10356 508
10376 510
10400 512
10420 515
10444 524
10464 527
10488 536
10508 542
10532 543
10556 543
10576 551
10600 560
10620 568
10644 568
10664 572
10688 574
10712 575
10732 575
10756 575
10776 575
10800 575
10820 575
10844 583
10864 583
10888 583
10912 583
10932 583
10956 583
10984 575
11004 575
11028 575
11052 575
11072 575
11096 575
11116 574
11140 572
11160 572
11184 568
11204 560
11228 560
11252 551
11272 543
11296 543
11316 542
11340 536
11360 527
11384 527
11408 519
11428 513
11452 511
11472 508
11504 504
11524 496
11548 496
11568 480
11592 480
11612 480
11636 460
11664 451
11688 448
11708 448
11732 448
11752 448
11776 448
11800 415
11820 414
11844 408
11864 399
11888 396
11908 387
11932 384
11952 384
11976 384
12000 384
12020 384
12044 384
12064 384
12088 384
12108 384
12132 352
12156 352
12176 352
12200 352
12220 352
12244 352
12264 352
12288 352
12308 352
12332 352
12356 352
12376 352
12400 352
12420 352
12444 352
12464 352
12488 352
12512 352
12532 352
12556 352
12576 352
12600 384
12620 384
12644 384
12672 384
12696 384
12716 384
12740 384
12760 384
12784 384
12804 384
12828 391
12852 395
12872 399
12896 408
12916 414
12940 415
12960 419
12984 448
13008 448
13028 448
13052 448
13072 448
13096 451
13116 460
13140 480
13160 480
13184 480
13208 480
13228 496
13252 496
13272 504
13296 508
13316 508
13340 511
13364 512
13384 515
13408 519
13428 527
13452 527
13472 536
13496 542
13516 542
13540 543
13564 543
13584 547
13608 551
13628 560
13652 560
13672 560
13704 568
13724 568
13748 568
13768 568
13792 568
13812 568
13836 568
13860 568
13880 568
13904 568
13924 568
13948 568
13968 560
13992 560
14012 560
14036 551
14060 543
14080 543
14104 543
14124 543
14148 540
14168 536
14192 527
14216 527
14236 521
14260 519
14280 513
14304 511
14324 510
14348 508
14368 504
14392 504
14416 496
14436 496
14460 480
14480 480
14504 480
14524 480
14548 480
14572 455
14592 449
14616 448
14636 448
14660 448
14680 448
14704 448
14728 448
14752 415
14776 415
14796 414
14820 412
14840 408
14864 399
14884 399
14908 391
14932 391
14952 387
14976 384
14996 384
15020 384
15040 384
15064 384
15084 384
15108 384
15132 384
15152 384
15176 384
15196 384
15220 384
15240 384
15264 384
15288 384
15308 384
15332 384
15352 384
15376 384
15396 384
15420 384
15440 384
15464 384
15488 384
15508 384
15532 384
15552 387
15576 391
15596 391
15620 398
15644 399
15664 401
15688 408
15708 414
15732 415
15760 415
15784 419
15804 448
15828 448
15848 448
15872 448
15892 448
15916 448
15936 449
15960 455
15984 455
16004 480
16028 480
16048 480
16072 480
16092 480
16116 496
16140 496
16160 496
16184 504
16204 504
16228 508
16248 510
16272 511
16292 512
16316 513
16340 515
16360 519
16384 524
16404 527
16428 527
16448 527
16472 536
16496 536
16516 540
16540 542
16560 542
16584 543
16604 543
16628 543
16648 543
16672 543
16696 543
16716 543
16740 543
16768 543
16788 543
16812 543
16836 543
16856 542
16880 542
16900 540
16924 536
16944 536
16968 529
16992 527
17012 527
17036 524
17056 519
17080 519
17100 515
17124 512
17144 511
17168 510
17192 508
17212 508
17236 496
17256 496
17280 480
17300 480
17324 480
17344 480
17368 480
17392 480
17412 480
17436 455
17456 455
17480 449
17500 448
17524 448
17548 448
17568 448
17592 448
17612 448
17636 448
17656 448
17680 423
17700 415
17724 415
17748 415
17768 414
17792 412
17820 408
17840 408
17864 399
17888 399
17908 399
17932 398
17952 391
17976 391
17996 391
18020 391
18040 391
18064 387
18088 387
18108 387
18132 387
18152 387
18176 387
18196 387
18220 387
18244 387
18264 387
18288 391
18308 391
18332 391
18352 391
18376 391
18396 398
18420 399
18444 399
18464 399
18488 401
18508 408
18532 412
18552 412
18576 415
18600 415
18620 415
18644 415
18664 419
18688 448
18708 448
18732 448
18752 448
18776 448
18800 448
18828 448
18848 448
18872 448
18892 451
18916 455
18940 455
18960 480
18984 480
19004 480
19028 480
19048 480
19072 480
19096 480
19116 480
19140 496
19160 496
19184 496
19204 496
19228 496
19248 504
19272 504
19296 504
19316 508
19340 508
19360 510
19384 510
19404 511
19428 511
19452 512
19472 512
19496 512
19516 513
19540 513
19560 515
19584 515
19604 515
19628 515
19652 515
19672 515
19696 515
19716 515
19740 515
19760 513
19784 513
19808 518
19828 512
19856 511
19880 511
19900 511
19924 510
19948 510
19968 508
19992 508
20012 508
20036 504
20056 504
20080 504
20100 496
20124 496
20148 496
20168 496
20192 496
20212 480
20236 480
20256 480
20280 480
20304 480
20324 480
20348 480
20368 480
20392 460
20412 455
20436 454
20456 451
20480 448
20504 448
20524 448
20548 448
20568 448
20592 448
20612 448
20636 448
20660 448
20680 448
20704 448
20724 448
20748 422
20768 419
20792 415
20812 415
20836 415
20860 415
20884 415
20908 415
20932 414
20952 414
20976 412
20996 412
21020 412
21040 412
21064 408
21088 408
21108 408
21132 408
21152 408
21176 408
21196 412
21220 412
21240 412
21264 412
21288 414
21308 415
21332 414
21352 415
21376 415
21396 415
21420 415
21444 415
21464 419
21488 419
21508 448
21532 448
21552 448
21576 448
21596 448
21620 448
21644 448
21664 448
21688 448
21708 448
21732 448
21752 448
21776 448
21800 449
21820 451
21844 455
21864 455
21888 480
21916 480
21940 480
21960 480
21984 480
22004 480
22028 480
22048 480
22072 480
22092 480
22116 480
22140 496
22160 496
22184 496
22204 496
22228 496
22248 496
22272 496
22296 504
22316 504
22340 504
22360 504
22384 504
22404 504
22428 504
22448 504
22472 504
22496 504
22516 504
22540 504
22560 504
22584 504
22604 504
22628 504
22652 504
22672 504
22696 504
22716 504
22740 504
22760 504
22784 504
22804 504
22828 496
22852 496
22872 496
22896 496
22924 496
22944 496
22976 496
22996 496
23020 496
23044 480
23064 480
23088 480
23108 480
23132 480
23152 480
23176 480
23200 480
23220 480
23244 480
23264 480
23288 480
23308 480
23332 460
23352 455
23376 455
23400 455
23420 451
23444 449
23464 448
23488 448
23508 448
23532 448
23556 448
23576 448
23600 448
23620 448
23644 448
23664 448
23688 448
23708 448
23732 448
23756 448
23776 448
23800 448
23820 448
23844 448
23864 448
23896 448
23916 448
23940 448
23960 448
23984 448
24004 448
24028 448
24052 448
24072 448
24096 448
24116 448
24140 448
24160 448
24184 448
24204 448
24228 448
24252 448
24272 448
24296 448
24316 448
24340 448
24360 448
24384 448
24408 448
24428 448
24452 448
24472 448
24496 448
24516 448
24540 448
24560 448
24584 448
24608 448
24628 449
24652 451
24672 451
24696 455
24716 455
24740 455
24764 460
24784 480
24808 480
24828 480
24852 480
24872 480
24900 480
24924 480
24948 480
24968 480
24992 480
25012 480
25036 480
25056 480
25080 480
25104 480
25124 480
25148 496
25168 496
25192 496
25212 496
25236 496
25260 496
25280 496
25304 496
25324 496
25348 496
25368 496
25392 496
25412 496
25436 496
25460 496
25480 496
25504 496
25524 496
25548 496
25568 496
25592 496
25616 496
25636 496
25660 496
25680 496
25704 496
25724 496
25748 496
25768 496
25792 496
25816 496
25836 496
25860 496
25880 480
25904 480
25932 480
25956 480
25976 480
26000 480
26020 480
26044 480
26064 480
26088 480
26112 480
26132 480
26156 480
26176 480
26200 480
26220 480
26244 480
26264 480
26288 455
26312 455
26332 455
26356 454
26376 451
26400 449
26420 449
26444 448
26468 448
26488 448
26512 448
26532 448
26556 448
26576 448
26600 448
26620 448
26644 448
26668 448
26688 448
26712 448
26732 448
26756 448
26776 448
26800 448
26824 448
26844 448
26868 448
26888 448
26912 448
26932 448
26960 448
26984 448
27008 448
27028 448
27052 448
27072 448
27096 448
27116 448
27140 448
27160 448
27184 448
27208 448
27228 448
27252 448
27272 448
27296 448
27316 448
27340 448
27364 448
27384 448
27408 448
27428 448
27452 448
27472 448
27496 448
27516 448
27540 448
27564 448
27584 448
27608 448
27628 448
27652 448
27672 449
27696 449
27720 451
27740 455
27764 454
27784 455
27808 455
27828 455
27852 460
27872 480
27896 480
27920 480
27940 480
27964 480
27992 480

