24 1023
88 15
148 0
220 0
280 0
344 0
404 0
468 0
528 0
592 96
656 335
716 591
780 830
840 1023
904 1023
964 1023
1028 1023
1088 1023
1152 1023
1216 1023
1280 828
1344 591
1408 352
1468 124
1532 0
1592 0
1656 0
1716 0
1780 0
1844 0
1904 0
1968 112
2028 327
2092 560
2152 771
2216 963
2284 1023
2348 1023
2408 1023
2472 1023
2532 1023
2596 992
2656 798
2720 583
2784 384
2844 159
2908 0
2968 0
3032 0
3092 0
3156 0
3220 0
3288 0
3348 143
3412 352
3472 547
3536 768
3600 924
3660 1023
3724 1023
3784 1023
3848 1023
3908 1023
3972 960
4032 775
4096 583
4160 387
4220 195
4284 31
4352 0
4412 0
4476 0
4540 0
4600 0
4664 0
4724 159
4788 352
4848 527
4912 711
4976 896
5036 1008
5100 1023
5160 1023
5224 1023
5284 1023
5352 896
5416 768
5480 574
5540 391
5604 224
5664 63
5728 0
5788 0
5852 0
5916 0
5976 0
6040 24
6100 163
6164 327
6224 504
6288 670
6356 831
6420 960
6480 1020
6544 1023
6604 1023
6668 963
6732 864
6792 768
6856 575
6916 414
6980 255
7040 124
7104 7
7164 0
7228 0
7292 0
7352 0
7420 96
7484 224
7544 384
7608 513
7672 664
7732 796
7796 899
7856 967
7920 1008
7980 992
8044 927
8108 831
8168 736
8232 575
8292 448
8356 287
8424 145
8488 56
8548 0
8612 0
8672 0
8736 24
8796 112
8860 224
8920 384
8984 496
9048 632
9108 768
9172 847
9232 911
9296 960
9356 927
9428 896
9488 783
9552 671
9612 547
9676 415
9736 284
9800 163
9864 71
9924 7
9988 0
10048 0
10112 33
10172 120
10236 224
10296 352
10360 480
10424 590
10492 711
10552 803
10616 896
10676 896
10740 896
10804 839
10864 768
10928 671
10988 560
11052 448
11112 318
11176 224
11240 124
11300 62
11364 31
11424 31
11492 76
11556 143
11620 248
11680 352
11744 480
11804 579
11868 704
11928 768
11992 830
12052 864
12116 864
12180 816
12240 768
12304 655
12364 560
12428 448
12496 319
12560 240
12620 152
12684 96
12744 71
12808 96
12868 120
12932 192
12996 255
13056 384
13120 480
13180 574
13244 668
13304 768
13368 796
13428 824
13492 824
13560 780
13624 736
13684 639
13748 543
13808 448
13872 352
13936 255
13996 192
14060 135
14120 120
14184 124
14244 152
14308 224
14372 280
14432 384
14496 480
14564 568
14624 639
14688 704
14752 768
14812 783
14876 775
14936 768
15000 704
15060 632
15124 542
15184 449
15248 384
15312 284
15372 224
15436 192
15496 145
15564 152
15628 192
15692 240
15752 304
15816 384
15876 480
15940 550
16000 636
