8 864
16 652
28 496
40 384
52 295
64 220
76 167
84 127
96 103
108 81
116 63
128 51
140 39
152 31
160 28
172 24
184 15
196 15
204 14
216 7
228 12
240 7
248 7
260 7
272 7
280 7
292 7
304 3
316 3
324 7
