8 864
20 652
32 496
40 384
52 302
64 231
72 184
84 142
96 112
108 88
116 67
128 56
140 39
152 31
168 24
180 19
188 19
200 15
212 12
224 7
232 7
244 7
256 7
268 7
276 7
288 7
300 7
308 3
320 3
332 7
