2116 1904
2257 1081
2722 1693
2169 1911
2163 1909
2150 1910
2138 1909
2127 1906
2113 1906
2102 1903
2090 1900
2078 1895
2066 1893
2058 1888
2052 1885
2036 1879
2026 1876
2015 1870
2008 1865
1999 1858
1987 1850
1976 1839
1963 1831
1957 1827
1945 1817
1941 1810
1927 1800
1922 1790
1913 1783
1906 1777
1898 1768
1889 1756
1881 1747
1875 1739
1868 1732
1863 1723
1859 1708
1853 1696
1850 1686
1844 1677
1840 1666
1835 1657
1833 1648
1830 1640
1830 1632
1829 1625
1829 1615
1837 1319
1843 1311
1848 1308
1854 1302
1861 1293
1869 1281
1874 1270
1882 1262
1888 1254
1899 1245
1906 1237
1912 1232
1918 1224
1924 1213
1933 1207
1940 1203
1946 1197
1955 1194
1963 1187
1971 1182
1979 1175
1987 1169
1997 1161
2005 1159
2009 1153
2015 1152
2020 1148
2029 1144
2038 1139
2046 1137
2052 1130
2060 1130
2070 1124
2076 1123
2087 1116
2100 1112
2112 1108
2125 1107
2137 1103
2148 1098
2159 1094
2180 1087
2190 1088
2200 1086
2214 1085
2232 1085
2246 1082
2260 1082
2271 1082
2289 1083
2414 1074
2428 1082
2444 1088
2458 1093
2473 1103
2490 1113
2504 1123
2512 1128
2524 1137
2536 1148
2546 1156
2551 1163
2563 1173
2572 1184
2581 1194
2594 1206
2603 1215
2608 1224
2609 1227
2618 1238
2629 1248
2633 1256
2640 1266
2646 1277
2651 1284
2658 1295
2664 1305
2669 1317
2740 1619
2737 1633
2736 1650
2735 1670
2730 1689
2726 1703
2723 1717
2716 1736
2709 1753
2707 1767
2703 1778
2696 1789
2689 1796
2685 1796
2678 1813
2672 1827
2662 1842
2653 1855
2638 1867
2623 1887
2614 1897
2602 1904
2591 1914
2582 1923
2570 1935
2555 1946
2540 1951
2540 1951
2525 1954
2515 1961
2501 1966
2486 1977
2476 1983
2460 1987
