# canale    tempo up(s)   fond   tempo down  fond(micro secondi)
0           304e-6        50.     304e-6      50.
1           348e-6        50.     260e-6      50.
2           348e-6        50.     260e-6      50.
3           346e-6        50.     260e-6      50.
