#V	#dV	#I	#dI

0.458    0.003	 353    2
0.485    0.003	 316    2
0.511    0.003	 282.6    1.5
0.542    0.003	 245.9    1.4
0.568    0.003	 217.2    1.3
0.590    0.003	 195.4    1.3
0.622    0.003	 166    1
0.655    0.003	 139    1
0.681    0.004	 121    1
0.711    0.004	 101    1
0.738    0.004	 85    1
0.754    0.004	 72    1
0.769    0.004	 63    1
0.811    0.004	 48    1
0.846    0.004	 34    1
0.876    0.005	 23    1
0.900    0.005	 14    1
0.916    0.005	 10    1
0.931    0.005	 6    1
0.954    0.005	 1    1
0.958    0.005	 0    1
0.971    0.005	 -2.    1
0.998    0.005	 -4.    1
1.014    0.005	 -5.    1
1.029    0.005	 -6.    1
1.058    0.005	 -7.    1
1.093    0.006	 -8.    1
1.121    0.006	 -8.    1
1.156    0.006	 -9.    1
1.180    0.006	 -9.    1
1.204    0.006	 -9.    1
1.293    0.007	 -10.    1