1987 1868
2364 1172
2615 1858
2150 1934
2139 1935
2128 1935
2113 1930
2106 1929
2091 1922
2080 1917
2066 1916
2055 1909
2045 1902
2032 1894
2023 1889
2014 1882
2003 1880
1995 1872
1986 1865
1976 1859
1967 1854
1958 1844
1949 1832
1942 1824
1932 1812
1924 1801
1906 1788
1897 1775
1884 1763
1875 1748
1868 1733
1859 1724
1854 1707
1850 1696
1844 1684
1840 1672
1839 1655
1834 1642
1833 1631
1833 1625
1832 1612
1915 1320
1923 1314
1932 1305
1941 1291
1951 1279
1959 1264
1971 1259
1979 1253
1989 1245
2000 1237
2010 1228
2020 1223
2026 1216
2036 1210
2054 1202
2062 1196
2074 1191
2090 1182
2106 1176
2118 1169
2131 1163
2145 1160
2159 1158
2177 1155
2191 1151
2200 1149
2213 1148
2224 1146
2235 1145
2246 1146
2256 1147
2267 1147
2279 1146
2290 1151
2303 1151
2313 1156
2324 1159
2331 1159
2336 1159
2350 1163
2357 1166
2369 1171
2378 1173
2387 1179
2398 1182
2408 1190
2423 1199
2434 1201
2443 1206
2457 1216
2469 1221
2479 1225
2485 1232
2499 1243
2509 1246
2513 1254
2521 1259
2530 1264
2536 1274
2543 1282
2549 1290
2558 1299
2563 1307
2578 1318
2689 1616
2690 1638
2690 1655
2689 1670
2688 1685
2685 1698
2685 1709
2683 1725
2683 1736
2678 1756
2673 1764
2669 1772
2663 1779
2662 1784
2655 1797
2651 1809
2645 1816
2640 1826
2634 1838
2629 1841
2623 1850
2612 1862
2606 1870
2597 1875
2590 1893
2579 1899
2571 1906
2565 1910
2559 1919
2554 1926
2544 1936
2527 1940
2511 1952
2500 1958
2488 1966
2479 1970
2466 1972
