2019 1871
2299 1192
2541 1870
2182 1919
2168 1921
2160 1921
2148 1921
2137 1920
2127 1920
2113 1918
2103 1916
2091 1913
2082 1908
2068 1904
2056 1897
2043 1894
2031 1888
2020 1878
2009 1871
1999 1861
1988 1857
1976 1842
1962 1832
1954 1819
1943 1813
1932 1800
1922 1787
1913 1772
1908 1760
1903 1748
1897 1736
1889 1727
1883 1713
1878 1701
1872 1687
1869 1676
1865 1666
1858 1655
1855 1641
1856 1631
1857 1622
1856 1611
1940 1319
1947 1307
1955 1302
1963 1294
1971 1289
1978 1283
1985 1274
2004 1261
2008 1254
2018 1248
2024 1246
2033 1242
2038 1238
2052 1229
2056 1226
2068 1218
2075 1214
2086 1208
2094 1205
2104 1198
2114 1193
2125 1189
2132 1186
2140 1181
2146 1179
2154 1174
2163 1170
2168 1168
2177 1167
2185 1169
2193 1170
2206 1169
2314 1171
2326 1171
2341 1175
2350 1175
2360 1179
2372 1181
2385 1186
2394 1190
2401 1197
2412 1202
2419 1207
2432 1214
2438 1221
2448 1227
2457 1234
2473 1244
2483 1252
2489 1258
2492 1264
2500 1267
2505 1269
2515 1275
2520 1277
2529 1286
2534 1293
2542 1300
2546 1306
2549 1310
2557 1315
2561 1320
2654 1625
2653 1645
2648 1660
2648 1676
2647 1692
2644 1714
2641 1729
2638 1740
2634 1751
2623 1764
2615 1776
2601 1792
2591 1811
2582 1826
2576 1834
2568 1842
2558 1857
2548 1869
2541 1880
2532 1889
2520 1899
2504 1916
2492 1922
2480 1933
2470 1942
2457 1956
2443 1961
