#V_in[V]      T_out[s]
6.20          390e-6
3.72          338e-6
4.60          362e-6
2.68          314e-6
1.57          260e-6
1.04          216e-6
0.400         129e-6
0.288         97e-6
0.272         96e-6
