1928 1819
2126 1063
2722 1362
1995 1873
1984 1862
1971 1854
1962 1849
1952 1844
1940 1829
1933 1828
1924 1819
1916 1814
1910 1804
1903 1799
1895 1789
1888 1779
1878 1768
1873 1759
1867 1749
1860 1739
1854 1731
1845 1720
1843 1709
1838 1697
1834 1683
1831 1679
1823 1669
1822 1654
1818 1646
1818 1646
1815 1637
1812 1628
1811 1622
1809 1614
1916 1200
1926 1187
1932 1184
1938 1182
1946 1172
1957 1161
1964 1156
1969 1152
1980 1142
1985 1138
1991 1134
1998 1130
2006 1122
2018 1112
2025 1109
2032 1104
2037 1101
2044 1098
2055 1092
2063 1088
2070 1085
2075 1081
2080 1079
2085 1077
2098 1072
2104 1072
2111 1071
2117 1069
2129 1062
2139 1061
2147 1058
2154 1058
2159 1058
2165 1058
2174 1056
2184 1053
2193 1050
2204 1049
2214 1047
2224 1046
2238 1047
2254 1048
2266 1048
2280 1047
2651 1229
2655 1240
2660 1250
2667 1263
2675 1275
2680 1282
2683 1288
2689 1300
2692 1306
2696 1314
2694 1319
