{
  "_fv": 28,
  "_type": "procedure",
  "definition": {
    "procedurexml": "<xml xmlns=\"https://developers.google.com/blockly/xml\"><block type=\"event_trigger\" deletable=\"false\" x=\"152\" y=\"103\"><field name=\"trigger\">no_ext_trigger</field><next><block type=\"gui_set_items\"><value name=\"entity\"><block type=\"entity_from_deps\"></block></value><value name=\"slotid\"><block type=\"math_number\"><field name=\"NUM\">0</field></block></value><value name=\"amount\"><block type=\"math_number\"><field name=\"NUM\">1</field></block></value><value name=\"item\"><block type=\"mcitem_all\"><field name=\"value\">CUSTOM:Jackhammer</field></block></value><next><block type=\"gui_set_items\"><value name=\"entity\"><block type=\"entity_from_deps\"></block></value><value name=\"slotid\"><block type=\"math_number\"><field name=\"NUM\">1</field></block></value><value name=\"amount\"><block type=\"math_number\"><field name=\"NUM\">1</field></block></value><value name=\"item\"><block type=\"mcitem_all\"><field name=\"value\">CUSTOM:AutoMoney</field></block></value><next><block type=\"gui_set_items\"><value name=\"entity\"><block type=\"entity_from_deps\"></block></value><value name=\"slotid\"><block type=\"math_number\"><field name=\"NUM\">2</field></block></value><value name=\"amount\"><block type=\"math_number\"><field name=\"NUM\">1</field></block></value><value name=\"item\"><block type=\"mcitem_all\"><field name=\"value\">CUSTOM:DreamLottery</field></block></value><next><block type=\"gui_set_items\"><value name=\"entity\"><block type=\"entity_from_deps\"></block></value><value name=\"slotid\"><block type=\"math_number\"><field name=\"NUM\">3</field></block></value><value name=\"amount\"><block type=\"math_number\"><field name=\"NUM\">1</field></block></value><value name=\"item\"><block type=\"mcitem_all\"><field name=\"value\">CUSTOM:BusterSword</field></block></value><next><block type=\"gui_set_items\"><value name=\"entity\"><block type=\"entity_from_deps\"></block></value><value name=\"slotid\"><block type=\"math_number\"><field name=\"NUM\">4</field></block></value><value name=\"amount\"><block type=\"math_number\"><field name=\"NUM\">1</field></block></value><value name=\"item\"><block type=\"mcitem_all\"><field name=\"value\">CUSTOM:FlyingPower</field></block></value></block></next></block></next></block></next></block></next></block></next></block></xml>"
  }
}