{
	"credit": "Made with Blockbench",
	"texture_size": [516, 516],
	"textures": {
		"0": "black_concrete_powder",
		"2": "cyan_concrete_powder",
		"3": "bedrock",
		"4": "gray_concrete_powder"
	},
	"elements": [
		{
			"from": [8.775, 11.6, 10.65],
			"to": [9.425, 11.875, 11.1],
			"faces": {
				"north": {"uv": [0, 0, 0.02016, 0.00853], "texture": "#4"},
				"east": {"uv": [0, 0, 0.01395, 0.00853], "texture": "#4"},
				"south": {"uv": [0, 0, 0.02016, 0.00853], "texture": "#4"},
				"west": {"uv": [0, 0, 0.01395, 0.00853], "texture": "#4"},
				"up": {"uv": [0, 0, 0.02016, 0.01395], "texture": "#4"},
				"down": {"uv": [0, 0, 0.02016, 0.01395], "texture": "#4"}
			}
		},
		{
			"from": [8.65, 11.525, 11.1],
			"to": [9.65, 12.075, 14.4],
			"faces": {
				"north": {"uv": [0, 0, 0.03101, 0.01705], "texture": "#4"},
				"east": {"uv": [0, 0, 0.10233, 0.01705], "texture": "#4"},
				"south": {"uv": [0, 0, 0.03101, 0.01705], "texture": "#4"},
				"west": {"uv": [0, 0, 0.10233, 0.01705], "texture": "#4"},
				"up": {"uv": [0, 0, 0.03101, 0.10233], "texture": "#4"},
				"down": {"uv": [0, 0, 0.03101, 0.10233], "texture": "#4"}
			}
		},
		{
			"from": [8.65, 11.6, 14.4],
			"to": [9.65, 12, 15.025],
			"faces": {
				"north": {"uv": [0, 0, 0.03101, 0.0124], "texture": "#4"},
				"east": {"uv": [0, 0, 0.01938, 0.0124], "texture": "#4"},
				"south": {"uv": [0, 0, 0.03101, 0.0124], "texture": "#4"},
				"west": {"uv": [0, 0, 0.01938, 0.0124], "texture": "#4"},
				"up": {"uv": [0, 0, 0.03101, 0.01938], "texture": "#4"},
				"down": {"uv": [0, 0, 0.03101, 0.01938], "texture": "#4"}
			}
		},
		{
			"from": [8.65, 11.65, 15.025],
			"to": [9.65, 11.95, 15.375],
			"faces": {
				"north": {"uv": [0, 0, 0.03101, 0.0093], "texture": "#4"},
				"east": {"uv": [0, 0, 0.01085, 0.0093], "texture": "#4"},
				"south": {"uv": [0, 0, 0.03101, 0.0093], "texture": "#4"},
				"west": {"uv": [0, 0, 0.01085, 0.0093], "texture": "#4"},
				"up": {"uv": [0, 0, 0.03101, 0.01085], "texture": "#4"},
				"down": {"uv": [0, 0, 0.03101, 0.01085], "texture": "#4"}
			}
		},
		{
			"from": [8.65, 11.725, 15.375],
			"to": [9.65, 11.875, 15.825],
			"faces": {
				"north": {"uv": [0, 0, 0.03101, 0.00465], "texture": "#4"},
				"east": {"uv": [0, 0, 0.01395, 0.00465], "texture": "#4"},
				"south": {"uv": [0, 0, 0.03101, 0.00465], "texture": "#4"},
				"west": {"uv": [0, 0, 0.01395, 0.00465], "texture": "#4"},
				"up": {"uv": [0, 0, 0.03101, 0.01395], "texture": "#4"},
				"down": {"uv": [0, 0, 0.03101, 0.01395], "texture": "#4"}
			}
		},
		{
			"from": [7.875, 11, 6.375],
			"to": [15.3, 11.675, 7.1],
			"faces": {
				"north": {"uv": [0, 0, 0.23023, 0.02093], "texture": "#0"},
				"east": {"uv": [0, 0, 0.02248, 0.02093], "texture": "#0"},
				"south": {"uv": [0, 0, 0.23023, 0.02093], "texture": "#0"},
				"west": {"uv": [0, 0, 0.02248, 0.02093], "texture": "#0"},
				"up": {"uv": [0, 0, 0.23023, 0.02248], "texture": "#0"},
				"down": {"uv": [0, 0, 0.23023, 0.02248], "texture": "#0"}
			}
		},
		{
			"from": [7.7, 11.075, 7.5],
			"to": [10.55, 11.8, 8.575],
			"faces": {
				"north": {"uv": [0, 0, 0.08837, 0.02248], "texture": "#0"},
				"east": {"uv": [0, 0, 0.03333, 0.02248], "texture": "#0"},
				"south": {"uv": [0, 0, 0.08837, 0.02248], "texture": "#0"},
				"west": {"uv": [0, 0, 0.03333, 0.02248], "texture": "#0"},
				"up": {"uv": [0, 0, 0.08837, 0.03333], "texture": "#0"},
				"down": {"uv": [0, 0, 0.08837, 0.03333], "texture": "#0"}
			}
		},
		{
			"from": [7.7, 10.95, 7.5],
			"to": [10.55, 11.675, 8.325],
			"faces": {
				"north": {"uv": [0, 0, 0.08837, 0.02248], "texture": "#0"},
				"east": {"uv": [0, 0, 0.02558, 0.02248], "texture": "#0"},
				"south": {"uv": [0, 0, 0.08837, 0.02248], "texture": "#0"},
				"west": {"uv": [0, 0, 0.02558, 0.02248], "texture": "#0"},
				"up": {"uv": [0, 0, 0.08837, 0.02558], "texture": "#0"},
				"down": {"uv": [0, 0, 0.08837, 0.02558], "texture": "#0"}
			}
		},
		{
			"from": [7.7, 10.925, 7.225],
			"to": [10.55, 11.075, 7.525],
			"faces": {
				"north": {"uv": [0, 0, 0.08837, 0.00465], "texture": "#0"},
				"east": {"uv": [0, 0, 0.0093, 0.00465], "texture": "#0"},
				"south": {"uv": [0, 0, 0.08837, 0.00465], "texture": "#0"},
				"west": {"uv": [0, 0, 0.0093, 0.00465], "texture": "#0"},
				"up": {"uv": [0, 0, 0.08837, 0.0093], "texture": "#0"},
				"down": {"uv": [0, 0, 0.08837, 0.0093], "texture": "#0"}
			}
		},
		{
			"from": [7.7, 11.8, 8.225],
			"to": [10.55, 11.95, 8.575],
			"faces": {
				"north": {"uv": [0, 0, 0.08837, 0.00465], "texture": "#0"},
				"east": {"uv": [0, 0, 0.01085, 0.00465], "texture": "#0"},
				"south": {"uv": [0, 0, 0.08837, 0.00465], "texture": "#0"},
				"west": {"uv": [0, 0, 0.01085, 0.00465], "texture": "#0"},
				"up": {"uv": [0, 0, 0.08837, 0.01085], "texture": "#0"},
				"down": {"uv": [0, 0, 0.08837, 0.01085], "texture": "#0"}
			}
		},
		{
			"from": [7.7, 11.8, 7.625],
			"to": [10.55, 11.95, 7.7],
			"faces": {
				"north": {"uv": [0, 0, 0.08837, 0.00465], "texture": "#0"},
				"east": {"uv": [0, 0, 0.00233, 0.00465], "texture": "#0"},
				"south": {"uv": [0, 0, 0.08837, 0.00465], "texture": "#0"},
				"west": {"uv": [0, 0, 0.00233, 0.00465], "texture": "#0"},
				"up": {"uv": [0, 0, 0.08837, 0.00233], "texture": "#0"},
				"down": {"uv": [0, 0, 0.08837, 0.00233], "texture": "#0"}
			}
		},
		{
			"from": [7.7, 11.9, 7.625],
			"to": [10.55, 12.1, 8.575],
			"faces": {
				"north": {"uv": [0, 0, 0.08837, 0.0062], "texture": "#0"},
				"east": {"uv": [0, 0, 0.02946, 0.0062], "texture": "#0"},
				"south": {"uv": [0, 0, 0.08837, 0.0062], "texture": "#0"},
				"west": {"uv": [0, 0, 0.02946, 0.0062], "texture": "#0"},
				"up": {"uv": [0, 0, 0.08837, 0.02946], "texture": "#0"},
				"down": {"uv": [0, 0, 0.08837, 0.02946], "texture": "#0"}
			}
		},
		{
			"from": [7.7, 12.2, 7.625],
			"to": [10.55, 12.6, 8.575],
			"faces": {
				"north": {"uv": [0, 0, 0.08837, 0.0124], "texture": "#0"},
				"east": {"uv": [0, 0, 0.02946, 0.0124], "texture": "#0"},
				"south": {"uv": [0, 0, 0.08837, 0.0124], "texture": "#0"},
				"west": {"uv": [0, 0, 0.02946, 0.0124], "texture": "#0"},
				"up": {"uv": [0, 0, 0.08837, 0.02946], "texture": "#0"},
				"down": {"uv": [0, 0, 0.08837, 0.02946], "texture": "#0"}
			}
		},
		{
			"from": [7.7, 12.1, 8.25],
			"to": [10.55, 12.2, 8.575],
			"faces": {
				"north": {"uv": [0, 0, 0.08837, 0.0031], "texture": "#0"},
				"east": {"uv": [0, 0, 0.01008, 0.0031], "texture": "#0"},
				"south": {"uv": [0, 0, 0.08837, 0.0031], "texture": "#0"},
				"west": {"uv": [0, 0, 0.01008, 0.0031], "texture": "#0"},
				"up": {"uv": [0, 0, 0.08837, 0.01008], "texture": "#0"},
				"down": {"uv": [0, 0, 0.08837, 0.01008], "texture": "#0"}
			}
		},
		{
			"from": [7.7, 12.1, 7.625],
			"to": [10.55, 12.2, 7.95],
			"faces": {
				"north": {"uv": [0, 0, 0.08837, 0.0031], "texture": "#0"},
				"east": {"uv": [0, 0, 0.01008, 0.0031], "texture": "#0"},
				"south": {"uv": [0, 0, 0.08837, 0.0031], "texture": "#0"},
				"west": {"uv": [0, 0, 0.01008, 0.0031], "texture": "#0"},
				"up": {"uv": [0, 0, 0.08837, 0.01008], "texture": "#0"},
				"down": {"uv": [0, 0, 0.08837, 0.01008], "texture": "#0"}
			}
		},
		{
			"from": [7.7, 12.55, 7.575],
			"to": [10.55, 12.7, 7.95],
			"faces": {
				"north": {"uv": [0, 0, 0.08837, 0.00465], "texture": "#0"},
				"east": {"uv": [0, 0, 0.01163, 0.00465], "texture": "#0"},
				"south": {"uv": [0, 0, 0.08837, 0.00465], "texture": "#0"},
				"west": {"uv": [0, 0, 0.01163, 0.00465], "texture": "#0"},
				"up": {"uv": [0, 0, 0.08837, 0.01163], "texture": "#0"},
				"down": {"uv": [0, 0, 0.08837, 0.01163], "texture": "#0"}
			}
		},
		{
			"from": [7.7, 12.6, 7.95],
			"to": [10.55, 12.675, 8.375],
			"faces": {
				"north": {"uv": [0, 0, 0.08837, 0.00233], "texture": "#0"},
				"east": {"uv": [0, 0, 0.01318, 0.00233], "texture": "#0"},
				"south": {"uv": [0, 0, 0.08837, 0.00233], "texture": "#0"},
				"west": {"uv": [0, 0, 0.01318, 0.00233], "texture": "#0"},
				"up": {"uv": [0, 0, 0.08837, 0.01318], "texture": "#0"},
				"down": {"uv": [0, 0, 0.08837, 0.01318], "texture": "#0"}
			}
		},
		{
			"from": [7.875, 11.725, 0.8],
			"to": [10.4, 12.75, 4.375],
			"faces": {
				"north": {"uv": [0, 0, 0.07829, 0.03178], "texture": "#0"},
				"east": {"uv": [0, 0, 0.11085, 0.03178], "texture": "#0"},
				"south": {"uv": [0, 0, 0.07829, 0.03178], "texture": "#0"},
				"west": {"uv": [0, 0, 0.11085, 0.03178], "texture": "#0"},
				"up": {"uv": [0, 0, 0.07829, 0.11085], "texture": "#0"},
				"down": {"uv": [0, 0, 0.07829, 0.11085], "texture": "#0"}
			}
		},
		{
			"from": [7.875, 11.8, 4.375],
			"to": [10.4, 12.7, 5.125],
			"faces": {
				"north": {"uv": [0, 0, 0.07829, 0.02791], "texture": "#0"},
				"east": {"uv": [0, 0, 0.02326, 0.02791], "texture": "#0"},
				"south": {"uv": [0, 0, 0.07829, 0.02791], "texture": "#0"},
				"west": {"uv": [0, 0, 0.02326, 0.02791], "texture": "#0"},
				"up": {"uv": [0, 0, 0.07829, 0.02326], "texture": "#0"},
				"down": {"uv": [0, 0, 0.07829, 0.02326], "texture": "#0"}
			}
		},
		{
			"from": [7.875, 11.075, 5.375],
			"to": [10.4, 11.8, 7.5],
			"faces": {
				"north": {"uv": [0, 0, 0.07829, 0.02248], "texture": "#0"},
				"east": {"uv": [0, 0, 0.06589, 0.02248], "texture": "#0"},
				"south": {"uv": [0, 0, 0.07829, 0.02248], "texture": "#0"},
				"west": {"uv": [0, 0, 0.06589, 0.02248], "texture": "#0"},
				"up": {"uv": [0, 0, 0.07829, 0.06589], "texture": "#0"},
				"down": {"uv": [0, 0, 0.07829, 0.06589], "texture": "#0"}
			}
		},
		{
			"from": [7.875, 11.8, 5.125],
			"to": [10.4, 12.6, 6.225],
			"faces": {
				"north": {"uv": [0, 0, 0.07829, 0.02481], "texture": "#0"},
				"east": {"uv": [0, 0, 0.03411, 0.02481], "texture": "#0"},
				"south": {"uv": [0, 0, 0.07829, 0.02481], "texture": "#0"},
				"west": {"uv": [0, 0, 0.03411, 0.02481], "texture": "#0"},
				"up": {"uv": [0, 0, 0.07829, 0.03411], "texture": "#0"},
				"down": {"uv": [0, 0, 0.07829, 0.03411], "texture": "#0"}
			}
		},
		{
			"from": [7.875, 11.8, 6.225],
			"to": [10.4, 12.6, 6.975],
			"faces": {
				"north": {"uv": [0, 0, 0.07829, 0.02481], "texture": "#0"},
				"east": {"uv": [0, 0, 0.02326, 0.02481], "texture": "#0"},
				"south": {"uv": [0, 0, 0.07829, 0.02481], "texture": "#0"},
				"west": {"uv": [0, 0, 0.02326, 0.02481], "texture": "#0"},
				"up": {"uv": [0, 0, 0.07829, 0.02326], "texture": "#0"},
				"down": {"uv": [0, 0, 0.07829, 0.02326], "texture": "#0"}
			}
		},
		{
			"from": [7.875, 11.8, 6.975],
			"to": [10.4, 12.575, 7.625],
			"faces": {
				"north": {"uv": [0, 0, 0.07829, 0.02403], "texture": "#0"},
				"east": {"uv": [0, 0, 0.02016, 0.02403], "texture": "#0"},
				"south": {"uv": [0, 0, 0.07829, 0.02403], "texture": "#0"},
				"west": {"uv": [0, 0, 0.02016, 0.02403], "texture": "#0"},
				"up": {"uv": [0, 0, 0.07829, 0.02016], "texture": "#0"},
				"down": {"uv": [0, 0, 0.07829, 0.02016], "texture": "#0"}
			}
		},
		{
			"from": [7.875, 11.325, 8.575],
			"to": [10.4, 12.3, 10.225],
			"faces": {
				"north": {"uv": [0, 0, 0.07829, 0.03023], "texture": "#0"},
				"east": {"uv": [0, 0, 0.05116, 0.03023], "texture": "#0"},
				"south": {"uv": [0, 0, 0.07829, 0.03023], "texture": "#0"},
				"west": {"uv": [0, 0, 0.05116, 0.03023], "texture": "#0"},
				"up": {"uv": [0, 0, 0.07829, 0.05116], "texture": "#0"},
				"down": {"uv": [0, 0, 0.07829, 0.05116], "texture": "#0"}
			}
		},
		{
			"from": [7.875, 11.4, 10.225],
			"to": [10.4, 12.325, 10.65],
			"faces": {
				"north": {"uv": [0, 0, 0.07829, 0.02868], "texture": "#0"},
				"east": {"uv": [0, 0, 0.01318, 0.02868], "texture": "#0"},
				"south": {"uv": [0, 0, 0.07829, 0.02868], "texture": "#0"},
				"west": {"uv": [0, 0, 0.01318, 0.02868], "texture": "#0"},
				"up": {"uv": [0, 0, 0.07829, 0.01318], "texture": "#0"},
				"down": {"uv": [0, 0, 0.07829, 0.01318], "texture": "#0"}
			}
		},
		{
			"from": [7.875, 12.25, 10.3],
			"to": [10.4, 12.55, 10.65],
			"faces": {
				"north": {"uv": [0, 0, 0.07829, 0.0093], "texture": "#0"},
				"east": {"uv": [0, 0, 0.01085, 0.0093], "texture": "#0"},
				"south": {"uv": [0, 0, 0.07829, 0.0093], "texture": "#0"},
				"west": {"uv": [0, 0, 0.01085, 0.0093], "texture": "#0"},
				"up": {"uv": [0, 0, 0.07829, 0.01085], "texture": "#0"},
				"down": {"uv": [0, 0, 0.07829, 0.01085], "texture": "#0"}
			}
		},
		{
			"from": [7.875, 12.575, 7.075],
			"to": [10.4, 12.6, 7.6],
			"faces": {
				"north": {"uv": [0, 0, 0.07829, 0.00078], "texture": "#0"},
				"east": {"uv": [0, 0, 0.01628, 0.00078], "texture": "#0"},
				"south": {"uv": [0, 0, 0.07829, 0.00078], "texture": "#0"},
				"west": {"uv": [0, 0, 0.01628, 0.00078], "texture": "#0"},
				"up": {"uv": [0, 0, 0.07829, 0.01628], "texture": "#0"},
				"down": {"uv": [0, 0, 0.07829, 0.01628], "texture": "#0"}
			}
		},
		{
			"from": [7.875, 12.6, 7.075],
			"to": [10.4, 12.625, 7.575],
			"faces": {
				"north": {"uv": [0, 0, 0.07829, 0.00078], "texture": "#0"},
				"east": {"uv": [0, 0, 0.0155, 0.00078], "texture": "#0"},
				"south": {"uv": [0, 0, 0.07829, 0.00078], "texture": "#0"},
				"west": {"uv": [0, 0, 0.0155, 0.00078], "texture": "#0"},
				"up": {"uv": [0, 0, 0.07829, 0.0155], "texture": "#0"},
				"down": {"uv": [0, 0, 0.07829, 0.0155], "texture": "#0"}
			}
		},
		{
			"from": [7.875, 12.625, 7.1],
			"to": [10.4, 12.65, 7.575],
			"faces": {
				"north": {"uv": [0, 0, 0.07829, 0.00078], "texture": "#0"},
				"east": {"uv": [0, 0, 0.01473, 0.00078], "texture": "#0"},
				"south": {"uv": [0, 0, 0.07829, 0.00078], "texture": "#0"},
				"west": {"uv": [0, 0, 0.01473, 0.00078], "texture": "#0"},
				"up": {"uv": [0, 0, 0.07829, 0.01473], "texture": "#0"},
				"down": {"uv": [0, 0, 0.07829, 0.01473], "texture": "#0"}
			}
		},
		{
			"from": [7.875, 12.65, 7.175],
			"to": [10.4, 12.675, 7.575],
			"faces": {
				"north": {"uv": [0, 0, 0.07829, 0.00078], "texture": "#0"},
				"east": {"uv": [0, 0, 0.0124, 0.00078], "texture": "#0"},
				"south": {"uv": [0, 0, 0.07829, 0.00078], "texture": "#0"},
				"west": {"uv": [0, 0, 0.0124, 0.00078], "texture": "#0"},
				"up": {"uv": [0, 0, 0.07829, 0.0124], "texture": "#0"},
				"down": {"uv": [0, 0, 0.07829, 0.0124], "texture": "#0"}
			}
		},
		{
			"from": [7.875, 12.675, 7.25],
			"to": [10.4, 12.7, 7.575],
			"faces": {
				"north": {"uv": [0, 0, 0.07829, 0.00078], "texture": "#0"},
				"east": {"uv": [0, 0, 0.01008, 0.00078], "texture": "#0"},
				"south": {"uv": [0, 0, 0.07829, 0.00078], "texture": "#0"},
				"west": {"uv": [0, 0, 0.01008, 0.00078], "texture": "#0"},
				"up": {"uv": [0, 0, 0.07829, 0.01008], "texture": "#0"},
				"down": {"uv": [0, 0, 0.07829, 0.01008], "texture": "#0"}
			}
		},
		{
			"from": [7.875, 12.6, 6.225],
			"to": [10.4, 12.625, 6.975],
			"faces": {
				"north": {"uv": [0, 0, 0.07829, 0.00078], "texture": "#0"},
				"east": {"uv": [0, 0, 0.02326, 0.00078], "texture": "#0"},
				"south": {"uv": [0, 0, 0.07829, 0.00078], "texture": "#0"},
				"west": {"uv": [0, 0, 0.02326, 0.00078], "texture": "#0"},
				"up": {"uv": [0, 0, 0.07829, 0.02326], "texture": "#0"},
				"down": {"uv": [0, 0, 0.07829, 0.02326], "texture": "#0"}
			}
		},
		{
			"from": [7.875, 12.625, 6.275],
			"to": [10.4, 12.65, 6.925],
			"faces": {
				"north": {"uv": [0, 0, 0.07829, 0.00078], "texture": "#0"},
				"east": {"uv": [0, 0, 0.02016, 0.00078], "texture": "#0"},
				"south": {"uv": [0, 0, 0.07829, 0.00078], "texture": "#0"},
				"west": {"uv": [0, 0, 0.02016, 0.00078], "texture": "#0"},
				"up": {"uv": [0, 0, 0.07829, 0.02016], "texture": "#0"},
				"down": {"uv": [0, 0, 0.07829, 0.02016], "texture": "#0"}
			}
		},
		{
			"from": [7.875, 12.65, 6.3],
			"to": [10.4, 12.675, 6.9],
			"faces": {
				"north": {"uv": [0, 0, 0.07829, 0.00078], "texture": "#0"},
				"east": {"uv": [0, 0, 0.0186, 0.00078], "texture": "#0"},
				"south": {"uv": [0, 0, 0.07829, 0.00078], "texture": "#0"},
				"west": {"uv": [0, 0, 0.0186, 0.00078], "texture": "#0"},
				"up": {"uv": [0, 0, 0.07829, 0.0186], "texture": "#0"},
				"down": {"uv": [0, 0, 0.07829, 0.0186], "texture": "#0"}
			}
		},
		{
			"from": [7.875, 12.675, 6.35],
			"to": [10.4, 12.7, 6.85],
			"faces": {
				"north": {"uv": [0, 0, 0.07829, 0.00078], "texture": "#0"},
				"east": {"uv": [0, 0, 0.0155, 0.00078], "texture": "#0"},
				"south": {"uv": [0, 0, 0.07829, 0.00078], "texture": "#0"},
				"west": {"uv": [0, 0, 0.0155, 0.00078], "texture": "#0"},
				"up": {"uv": [0, 0, 0.07829, 0.0155], "texture": "#0"},
				"down": {"uv": [0, 0, 0.07829, 0.0155], "texture": "#0"}
			}
		},
		{
			"from": [7.875, 12.7, 6.4],
			"to": [10.4, 12.725, 6.825],
			"faces": {
				"north": {"uv": [0, 0, 0.07829, 0.00078], "texture": "#0"},
				"east": {"uv": [0, 0, 0.01318, 0.00078], "texture": "#0"},
				"south": {"uv": [0, 0, 0.07829, 0.00078], "texture": "#0"},
				"west": {"uv": [0, 0, 0.01318, 0.00078], "texture": "#0"},
				"up": {"uv": [0, 0, 0.07829, 0.01318], "texture": "#0"},
				"down": {"uv": [0, 0, 0.07829, 0.01318], "texture": "#0"}
			}
		},
		{
			"from": [7.875, 12.75, 2.5],
			"to": [10.4, 12.825, 4.375],
			"faces": {
				"north": {"uv": [0, 0, 0.07829, 0.00233], "texture": "#0"},
				"east": {"uv": [0, 0, 0.05814, 0.00233], "texture": "#0"},
				"south": {"uv": [0, 0, 0.07829, 0.00233], "texture": "#0"},
				"west": {"uv": [0, 0, 0.05814, 0.00233], "texture": "#0"},
				"up": {"uv": [0, 0, 0.07829, 0.05814], "texture": "#0"},
				"down": {"uv": [0, 0, 0.07829, 0.05814], "texture": "#0"}
			}
		},
		{
			"from": [8.975, 11, 1.175],
			"to": [9.625, 11.575, 1.575],
			"faces": {
				"north": {"uv": [0, 0, 0.02016, 0.01783], "texture": "#3"},
				"east": {"uv": [0, 0, 0.0124, 0.01783], "texture": "#3"},
				"south": {"uv": [0, 0, 0.02016, 0.01783], "texture": "#3"},
				"west": {"uv": [0, 0, 0.0124, 0.01783], "texture": "#3"},
				"up": {"uv": [0, 0, 0.02016, 0.0124], "texture": "#3"},
				"down": {"uv": [0, 0, 0.02016, 0.0124], "texture": "#3"}
			}
		},
		{
			"from": [8.975, 11.35, 1.575],
			"to": [9.625, 11.575, 2.05],
			"faces": {
				"north": {"uv": [0, 0, 0.02016, 0.00698], "texture": "#3"},
				"east": {"uv": [0, 0, 0.01473, 0.00698], "texture": "#3"},
				"south": {"uv": [0, 0, 0.02016, 0.00698], "texture": "#3"},
				"west": {"uv": [0, 0, 0.01473, 0.00698], "texture": "#3"},
				"up": {"uv": [0, 0, 0.02016, 0.01473], "texture": "#3"},
				"down": {"uv": [0, 0, 0.02016, 0.01473], "texture": "#3"}
			}
		},
		{
			"from": [8.975, 10.85, 1.175],
			"to": [9.625, 11, 1.55],
			"faces": {
				"north": {"uv": [0, 0, 0.02016, 0.00465], "texture": "#3"},
				"east": {"uv": [0, 0, 0.01163, 0.00465], "texture": "#3"},
				"south": {"uv": [0, 0, 0.02016, 0.00465], "texture": "#3"},
				"west": {"uv": [0, 0, 0.01163, 0.00465], "texture": "#3"},
				"up": {"uv": [0, 0, 0.02016, 0.01163], "texture": "#3"},
				"down": {"uv": [0, 0, 0.02016, 0.01163], "texture": "#3"}
			}
		},
		{
			"from": [8.975, 10.6, 1.175],
			"to": [9.625, 10.75, 1.5],
			"faces": {
				"north": {"uv": [0, 0, 0.02016, 0.00465], "texture": "#3"},
				"east": {"uv": [0, 0, 0.01008, 0.00465], "texture": "#3"},
				"south": {"uv": [0, 0, 0.02016, 0.00465], "texture": "#3"},
				"west": {"uv": [0, 0, 0.01008, 0.00465], "texture": "#3"},
				"up": {"uv": [0, 0, 0.02016, 0.01008], "texture": "#3"},
				"down": {"uv": [0, 0, 0.02016, 0.01008], "texture": "#3"}
			}
		},
		{
			"from": [8.975, 10.45, 1.175],
			"to": [9.625, 10.6, 1.475],
			"faces": {
				"north": {"uv": [0, 0, 0.02016, 0.00465], "texture": "#3"},
				"east": {"uv": [0, 0, 0.0093, 0.00465], "texture": "#3"},
				"south": {"uv": [0, 0, 0.02016, 0.00465], "texture": "#3"},
				"west": {"uv": [0, 0, 0.0093, 0.00465], "texture": "#3"},
				"up": {"uv": [0, 0, 0.02016, 0.0093], "texture": "#3"},
				"down": {"uv": [0, 0, 0.02016, 0.0093], "texture": "#3"}
			}
		},
		{
			"from": [8.975, 10.35, 1.175],
			"to": [9.625, 10.5, 1.45],
			"faces": {
				"north": {"uv": [0, 0, 0.02016, 0.00465], "texture": "#3"},
				"east": {"uv": [0, 0, 0.00853, 0.00465], "texture": "#3"},
				"south": {"uv": [0, 0, 0.02016, 0.00465], "texture": "#3"},
				"west": {"uv": [0, 0, 0.00853, 0.00465], "texture": "#3"},
				"up": {"uv": [0, 0, 0.02016, 0.00853], "texture": "#3"},
				"down": {"uv": [0, 0, 0.02016, 0.00853], "texture": "#3"}
			}
		},
		{
			"from": [8.975, 10.225, 1.175],
			"to": [9.625, 10.35, 1.425],
			"faces": {
				"north": {"uv": [0, 0, 0.02016, 0.00388], "texture": "#3"},
				"east": {"uv": [0, 0, 0.00775, 0.00388], "texture": "#3"},
				"south": {"uv": [0, 0, 0.02016, 0.00388], "texture": "#3"},
				"west": {"uv": [0, 0, 0.00775, 0.00388], "texture": "#3"},
				"up": {"uv": [0, 0, 0.02016, 0.00775], "texture": "#3"},
				"down": {"uv": [0, 0, 0.02016, 0.00775], "texture": "#3"}
			}
		},
		{
			"from": [8.975, 10.175, 1.175],
			"to": [9.625, 10.275, 1.35],
			"faces": {
				"north": {"uv": [0, 0, 0.02016, 0.0031], "texture": "#3"},
				"east": {"uv": [0, 0, 0.00543, 0.0031], "texture": "#3"},
				"south": {"uv": [0, 0, 0.02016, 0.0031], "texture": "#3"},
				"west": {"uv": [0, 0, 0.00543, 0.0031], "texture": "#3"},
				"up": {"uv": [0, 0, 0.02016, 0.00543], "texture": "#3"},
				"down": {"uv": [0, 0, 0.02016, 0.00543], "texture": "#3"}
			}
		},
		{
			"from": [8.975, 10.05, 1.175],
			"to": [9.625, 10.175, 1.25],
			"faces": {
				"north": {"uv": [0, 0, 0.02016, 0.00388], "texture": "#3"},
				"east": {"uv": [0, 0, 0.00233, 0.00388], "texture": "#3"},
				"south": {"uv": [0, 0, 0.02016, 0.00388], "texture": "#3"},
				"west": {"uv": [0, 0, 0.00233, 0.00388], "texture": "#3"},
				"up": {"uv": [0, 0, 0.02016, 0.00233], "texture": "#3"},
				"down": {"uv": [0, 0, 0.02016, 0.00233], "texture": "#3"}
			}
		},
		{
			"from": [8.975, 10.7, 1.175],
			"to": [9.625, 10.85, 1.525],
			"faces": {
				"north": {"uv": [0, 0, 0.02016, 0.00465], "texture": "#3"},
				"east": {"uv": [0, 0, 0.01085, 0.00465], "texture": "#3"},
				"south": {"uv": [0, 0, 0.02016, 0.00465], "texture": "#3"},
				"west": {"uv": [0, 0, 0.01085, 0.00465], "texture": "#3"},
				"up": {"uv": [0, 0, 0.02016, 0.01085], "texture": "#3"},
				"down": {"uv": [0, 0, 0.02016, 0.01085], "texture": "#3"}
			}
		},
		{
			"from": [8.975, 10.85, 1.175],
			"to": [9.625, 11, 1.45],
			"faces": {
				"north": {"uv": [0, 0, 0.02016, 0.00465], "texture": "#3"},
				"east": {"uv": [0, 0, 0.00853, 0.00465], "texture": "#3"},
				"south": {"uv": [0, 0, 0.02016, 0.00465], "texture": "#3"},
				"west": {"uv": [0, 0, 0.00853, 0.00465], "texture": "#3"},
				"up": {"uv": [0, 0, 0.02016, 0.00853], "texture": "#3"},
				"down": {"uv": [0, 0, 0.02016, 0.00853], "texture": "#3"}
			}
		},
		{
			"from": [7.875, 9.575, 2.9],
			"to": [10.3775, 10, 5.4],
			"faces": {
				"north": {"uv": [0, 0, 16, 16], "texture": "#2"},
				"east": {"uv": [0, 0, 16, 16], "texture": "#2"},
				"south": {"uv": [0, 0, 16, 16], "texture": "#2"},
				"west": {"uv": [0, 0, 16, 16], "texture": "#2"},
				"up": {"uv": [0, 0, 16, 16], "texture": "#2"},
				"down": {"uv": [0, 0, 16, 16], "texture": "#2"}
			}
		},
		{
			"from": [7.875, 9.975, 2.875],
			"to": [10.3775, 10.4, 3.675],
			"faces": {
				"north": {"uv": [0, 0, 16, 16], "texture": "#2"},
				"east": {"uv": [0, 0, 16, 16], "texture": "#2"},
				"south": {"uv": [0, 0, 16, 16], "texture": "#2"},
				"west": {"uv": [0, 0, 16, 16], "texture": "#2"},
				"up": {"uv": [0, 0, 16, 16], "texture": "#2"},
				"down": {"uv": [0, 0, 16, 16], "texture": "#2"}
			}
		},
		{
			"from": [7.875, 10.2, 2.725],
			"to": [10.3775, 10.625, 3.525],
			"faces": {
				"north": {"uv": [0, 0, 16, 16], "texture": "#2"},
				"east": {"uv": [0, 0, 16, 16], "texture": "#2"},
				"south": {"uv": [0, 0, 16, 16], "texture": "#2"},
				"west": {"uv": [0, 0, 16, 16], "texture": "#2"},
				"up": {"uv": [0, 0, 16, 16], "texture": "#2"},
				"down": {"uv": [0, 0, 16, 16], "texture": "#2"}
			}
		},
		{
			"from": [7.875, 10.25, 2.625],
			"to": [10.3775, 10.675, 3.425],
			"faces": {
				"north": {"uv": [0, 0, 16, 16], "texture": "#2"},
				"east": {"uv": [0, 0, 16, 16], "texture": "#2"},
				"south": {"uv": [0, 0, 16, 16], "texture": "#2"},
				"west": {"uv": [0, 0, 16, 16], "texture": "#2"},
				"up": {"uv": [0, 0, 16, 16], "texture": "#2"},
				"down": {"uv": [0, 0, 16, 16], "texture": "#2"}
			}
		},
		{
			"from": [7.875, 10.275, 2.575],
			"to": [10.3775, 10.7, 3.375],
			"faces": {
				"north": {"uv": [0, 0, 16, 16], "texture": "#2"},
				"east": {"uv": [0, 0, 16, 16], "texture": "#2"},
				"south": {"uv": [0, 0, 16, 16], "texture": "#2"},
				"west": {"uv": [0, 0, 16, 16], "texture": "#2"},
				"up": {"uv": [0, 0, 16, 16], "texture": "#2"},
				"down": {"uv": [0, 0, 16, 16], "texture": "#2"}
			}
		},
		{
			"from": [7.875, 10.325, 2.525],
			"to": [10.3775, 10.75, 3.325],
			"faces": {
				"north": {"uv": [0, 0, 16, 16], "texture": "#2"},
				"east": {"uv": [0, 0, 16, 16], "texture": "#2"},
				"south": {"uv": [0, 0, 16, 16], "texture": "#2"},
				"west": {"uv": [0, 0, 16, 16], "texture": "#2"},
				"up": {"uv": [0, 0, 16, 16], "texture": "#2"},
				"down": {"uv": [0, 0, 16, 16], "texture": "#2"}
			}
		},
		{
			"from": [7.875, 10.375, 2.475],
			"to": [10.3775, 10.8, 3.275],
			"faces": {
				"north": {"uv": [0, 0, 16, 16], "texture": "#2"},
				"east": {"uv": [0, 0, 16, 16], "texture": "#2"},
				"south": {"uv": [0, 0, 16, 16], "texture": "#2"},
				"west": {"uv": [0, 0, 16, 16], "texture": "#2"},
				"up": {"uv": [0, 0, 16, 16], "texture": "#2"},
				"down": {"uv": [0, 0, 16, 16], "texture": "#2"}
			}
		},
		{
			"from": [7.875, 8.25, 2.975],
			"to": [10.3775, 9.575, 5.325],
			"faces": {
				"north": {"uv": [0, 0, 16, 16], "texture": "#2"},
				"east": {"uv": [0, 0, 16, 16], "texture": "#2"},
				"south": {"uv": [0, 0, 16, 16], "texture": "#2"},
				"west": {"uv": [0, 0, 16, 16], "texture": "#2"},
				"up": {"uv": [0, 0, 16, 16], "texture": "#2"},
				"down": {"uv": [0, 0, 16, 16], "texture": "#2"}
			}
		},
		{
			"from": [7.875, 8.25, 2.25],
			"to": [10.3775, 8.475, 2.975],
			"faces": {
				"north": {"uv": [0, 0, 16, 16], "texture": "#2"},
				"east": {"uv": [0, 0, 16, 16], "texture": "#2"},
				"south": {"uv": [0, 0, 16, 16], "texture": "#2"},
				"west": {"uv": [0, 0, 16, 16], "texture": "#2"},
				"up": {"uv": [0, 0, 16, 16], "texture": "#2"},
				"down": {"uv": [0, 0, 16, 16], "texture": "#2"}
			}
		},
		{
			"from": [7.875, 8.175, 2.175],
			"to": [10.3775, 8.4, 5.15],
			"faces": {
				"north": {"uv": [0, 0, 16, 16], "texture": "#2"},
				"east": {"uv": [0, 0, 16, 16], "texture": "#2"},
				"south": {"uv": [0, 0, 16, 16], "texture": "#2"},
				"west": {"uv": [0, 0, 16, 16], "texture": "#2"},
				"up": {"uv": [0, 0, 16, 16], "texture": "#2"},
				"down": {"uv": [0, 0, 16, 16], "texture": "#2"}
			}
		},
		{
			"from": [7.875, 8.125, 2.175],
			"to": [10.3775, 8.35, 5.075],
			"faces": {
				"north": {"uv": [0, 0, 16, 16], "texture": "#2"},
				"east": {"uv": [0, 0, 16, 16], "texture": "#2"},
				"south": {"uv": [0, 0, 16, 16], "texture": "#2"},
				"west": {"uv": [0, 0, 16, 16], "texture": "#2"},
				"up": {"uv": [0, 0, 16, 16], "texture": "#2"},
				"down": {"uv": [0, 0, 16, 16], "texture": "#2"}
			}
		},
		{
			"from": [7.875, 7.5, 2.175],
			"to": [10.3775, 8.3, 5.025],
			"faces": {
				"north": {"uv": [0, 0, 16, 16], "texture": "#2"},
				"east": {"uv": [0, 0, 16, 16], "texture": "#2"},
				"south": {"uv": [0, 0, 16, 16], "texture": "#2"},
				"west": {"uv": [0, 0, 16, 16], "texture": "#2"},
				"up": {"uv": [0, 0, 16, 16], "texture": "#2"},
				"down": {"uv": [0, 0, 16, 16], "texture": "#2"}
			}
		},
		{
			"from": [7.875, 8.225, 2.175],
			"to": [10.3775, 8.45, 5.275],
			"faces": {
				"north": {"uv": [0, 0, 16, 16], "texture": "#2"},
				"east": {"uv": [0, 0, 16, 16], "texture": "#2"},
				"south": {"uv": [0, 0, 16, 16], "texture": "#2"},
				"west": {"uv": [0, 0, 16, 16], "texture": "#2"},
				"up": {"uv": [0, 0, 16, 16], "texture": "#2"},
				"down": {"uv": [0, 0, 16, 16], "texture": "#2"}
			}
		},
		{
			"from": [7.875, 8.25, 5.325],
			"to": [10.3775, 8.45, 5.35],
			"faces": {
				"north": {"uv": [0, 0, 16, 16], "texture": "#2"},
				"east": {"uv": [0, 0, 16, 16], "texture": "#2"},
				"south": {"uv": [0, 0, 16, 16], "texture": "#2"},
				"west": {"uv": [0, 0, 16, 16], "texture": "#2"},
				"up": {"uv": [0, 0, 16, 16], "texture": "#2"},
				"down": {"uv": [0, 0, 16, 16], "texture": "#2"}
			}
		},
		{
			"from": [7.875, 10, 5.175],
			"to": [10.3775, 10.025, 5.375],
			"faces": {
				"north": {"uv": [0, 0, 16, 16], "texture": "#2"},
				"east": {"uv": [0, 0, 16, 16], "texture": "#2"},
				"south": {"uv": [0, 0, 16, 16], "texture": "#2"},
				"west": {"uv": [0, 0, 16, 16], "texture": "#2"},
				"up": {"uv": [0, 0, 16, 16], "texture": "#2"},
				"down": {"uv": [0, 0, 16, 16], "texture": "#2"}
			}
		},
		{
			"from": [7.875, 10, 5.175],
			"to": [10.3775, 10.025, 5.4],
			"faces": {
				"north": {"uv": [0, 0, 16, 16], "texture": "#2"},
				"east": {"uv": [0, 0, 16, 16], "texture": "#2"},
				"south": {"uv": [0, 0, 16, 16], "texture": "#2"},
				"west": {"uv": [0, 0, 16, 16], "texture": "#2"},
				"up": {"uv": [0, 0, 16, 16], "texture": "#2"},
				"down": {"uv": [0, 0, 16, 16], "texture": "#2"}
			}
		},
		{
			"from": [7.875, 10.025, 5.275],
			"to": [10.3775, 10.1, 5.425],
			"faces": {
				"north": {"uv": [0, 0, 16, 16], "texture": "#2"},
				"east": {"uv": [0, 0, 16, 16], "texture": "#2"},
				"south": {"uv": [0, 0, 16, 16], "texture": "#2"},
				"west": {"uv": [0, 0, 16, 16], "texture": "#2"},
				"up": {"uv": [0, 0, 16, 16], "texture": "#2"},
				"down": {"uv": [0, 0, 16, 16], "texture": "#2"}
			}
		},
		{
			"from": [7.875, 10.05, 5.3],
			"to": [10.3775, 10.125, 5.45],
			"faces": {
				"north": {"uv": [0, 0, 16, 16], "texture": "#2"},
				"east": {"uv": [0, 0, 16, 16], "texture": "#2"},
				"south": {"uv": [0, 0, 16, 16], "texture": "#2"},
				"west": {"uv": [0, 0, 16, 16], "texture": "#2"},
				"up": {"uv": [0, 0, 16, 16], "texture": "#2"},
				"down": {"uv": [0, 0, 16, 16], "texture": "#2"}
			}
		},
		{
			"from": [7.875, 10.1, 5.325],
			"to": [10.3775, 10.175, 5.475],
			"faces": {
				"north": {"uv": [0, 0, 16, 16], "texture": "#2"},
				"east": {"uv": [0, 0, 16, 16], "texture": "#2"},
				"south": {"uv": [0, 0, 16, 16], "texture": "#2"},
				"west": {"uv": [0, 0, 16, 16], "texture": "#2"},
				"up": {"uv": [0, 0, 16, 16], "texture": "#2"},
				"down": {"uv": [0, 0, 16, 16], "texture": "#2"}
			}
		},
		{
			"from": [7.875, 10.125, 5.35],
			"to": [10.3775, 10.175, 5.5],
			"faces": {
				"north": {"uv": [0, 0, 16, 16], "texture": "#2"},
				"east": {"uv": [0, 0, 16, 16], "texture": "#2"},
				"south": {"uv": [0, 0, 16, 16], "texture": "#2"},
				"west": {"uv": [0, 0, 16, 16], "texture": "#2"},
				"up": {"uv": [0, 0, 16, 16], "texture": "#2"},
				"down": {"uv": [0, 0, 16, 16], "texture": "#2"}
			}
		},
		{
			"from": [7.875, 11.5, 0.85],
			"to": [10.4, 11.725, 2.675],
			"faces": {
				"north": {"uv": [0, 0, 16, 16], "texture": "#0"},
				"east": {"uv": [0, 0, 16, 16], "texture": "#0"},
				"south": {"uv": [0, 0, 16, 16], "texture": "#0"},
				"west": {"uv": [0, 0, 16, 16], "texture": "#0"},
				"up": {"uv": [0, 0, 16, 16], "texture": "#0"},
				"down": {"uv": [0, 0, 16, 16], "texture": "#0"}
			}
		},
		{
			"from": [7.875, 11.525, 0.85],
			"to": [10.4, 11.575, 1.4],
			"faces": {
				"north": {"uv": [0, 0, 16, 16], "texture": "#0"},
				"east": {"uv": [0, 0, 16, 16], "texture": "#0"},
				"south": {"uv": [0, 0, 16, 16], "texture": "#0"},
				"west": {"uv": [0, 0, 16, 16], "texture": "#0"},
				"up": {"uv": [0, 0, 16, 16], "texture": "#0"},
				"down": {"uv": [0, 0, 16, 16], "texture": "#0"}
			}
		},
		{
			"from": [7.875, 11.475, 0.85],
			"to": [10.4, 11.525, 1.325],
			"faces": {
				"north": {"uv": [0, 0, 16, 16], "texture": "#0"},
				"east": {"uv": [0, 0, 16, 16], "texture": "#0"},
				"south": {"uv": [0, 0, 16, 16], "texture": "#0"},
				"west": {"uv": [0, 0, 16, 16], "texture": "#0"},
				"up": {"uv": [0, 0, 16, 16], "texture": "#0"},
				"down": {"uv": [0, 0, 16, 16], "texture": "#0"}
			}
		},
		{
			"from": [7.875, 11.425, 0.875],
			"to": [10.4, 11.475, 1.275],
			"faces": {
				"north": {"uv": [0, 0, 16, 16], "texture": "#0"},
				"east": {"uv": [0, 0, 16, 16], "texture": "#0"},
				"south": {"uv": [0, 0, 16, 16], "texture": "#0"},
				"west": {"uv": [0, 0, 16, 16], "texture": "#0"},
				"up": {"uv": [0, 0, 16, 16], "texture": "#0"},
				"down": {"uv": [0, 0, 16, 16], "texture": "#0"}
			}
		},
		{
			"from": [7.875, 11.375, 0.875],
			"to": [10.4, 11.425, 1.225],
			"faces": {
				"north": {"uv": [0, 0, 16, 16], "texture": "#0"},
				"east": {"uv": [0, 0, 16, 16], "texture": "#0"},
				"south": {"uv": [0, 0, 16, 16], "texture": "#0"},
				"west": {"uv": [0, 0, 16, 16], "texture": "#0"},
				"up": {"uv": [0, 0, 16, 16], "texture": "#0"},
				"down": {"uv": [0, 0, 16, 16], "texture": "#0"}
			}
		},
		{
			"from": [7.875, 11.325, 0.875],
			"to": [10.4, 11.375, 1.2],
			"faces": {
				"north": {"uv": [0, 0, 16, 16], "texture": "#0"},
				"east": {"uv": [0, 0, 16, 16], "texture": "#0"},
				"south": {"uv": [0, 0, 16, 16], "texture": "#0"},
				"west": {"uv": [0, 0, 16, 16], "texture": "#0"},
				"up": {"uv": [0, 0, 16, 16], "texture": "#0"},
				"down": {"uv": [0, 0, 16, 16], "texture": "#0"}
			}
		},
		{
			"from": [7.875, 11.65, 0.85],
			"to": [10.4, 11.725, 2.675],
			"faces": {
				"north": {"uv": [0, 0, 16, 16], "texture": "#0"},
				"east": {"uv": [0, 0, 16, 16], "texture": "#0"},
				"south": {"uv": [0, 0, 16, 16], "texture": "#0"},
				"west": {"uv": [0, 0, 16, 16], "texture": "#0"},
				"up": {"uv": [0, 0, 16, 16], "texture": "#0"},
				"down": {"uv": [0, 0, 16, 16], "texture": "#0"}
			}
		},
		{
			"from": [7.875, 11.725, 0.85],
			"to": [10.4, 11.8, 1.85],
			"faces": {
				"north": {"uv": [0, 0, 16, 16], "texture": "#0"},
				"east": {"uv": [0, 0, 16, 16], "texture": "#0"},
				"south": {"uv": [0, 0, 16, 16], "texture": "#0"},
				"west": {"uv": [0, 0, 16, 16], "texture": "#0"},
				"up": {"uv": [0, 0, 16, 16], "texture": "#0"},
				"down": {"uv": [0, 0, 16, 16], "texture": "#0"}
			}
		},
		{
			"from": [7.875, 9.725, 0.825],
			"to": [10.4, 11.025, 1.125],
			"faces": {
				"north": {"uv": [0, 0, 16, 16], "texture": "#0"},
				"east": {"uv": [0, 0, 16, 16], "texture": "#0"},
				"south": {"uv": [0, 0, 16, 16], "texture": "#0"},
				"west": {"uv": [0, 0, 16, 16], "texture": "#0"},
				"up": {"uv": [0, 0, 16, 16], "texture": "#0"},
				"down": {"uv": [0, 0, 16, 16], "texture": "#0"}
			}
		},
		{
			"from": [7.875, 10.025, 0.875],
			"to": [10.4, 11.325, 1.175],
			"faces": {
				"north": {"uv": [0, 0, 16, 16], "texture": "#0"},
				"east": {"uv": [0, 0, 16, 16], "texture": "#0"},
				"south": {"uv": [0, 0, 16, 16], "texture": "#0"},
				"west": {"uv": [0, 0, 16, 16], "texture": "#0"},
				"up": {"uv": [0, 0, 16, 16], "texture": "#0"},
				"down": {"uv": [0, 0, 16, 16], "texture": "#0"}
			}
		},
		{
			"from": [7.875, 9.525, 0.775],
			"to": [10.4, 10.475, 1.1],
			"faces": {
				"north": {"uv": [0, 0, 16, 16], "texture": "#0"},
				"east": {"uv": [0, 0, 16, 16], "texture": "#0"},
				"south": {"uv": [0, 0, 16, 16], "texture": "#0"},
				"west": {"uv": [0, 0, 16, 16], "texture": "#0"},
				"up": {"uv": [0, 0, 16, 16], "texture": "#0"},
				"down": {"uv": [0, 0, 16, 16], "texture": "#0"}
			}
		},
		{
			"from": [7.875, 8.075, 0.775],
			"to": [10.4, 9.525, 1.075],
			"faces": {
				"north": {"uv": [0, 0, 16, 16], "texture": "#0"},
				"east": {"uv": [0, 0, 16, 16], "texture": "#0"},
				"south": {"uv": [0, 0, 16, 16], "texture": "#0"},
				"west": {"uv": [0, 0, 16, 16], "texture": "#0"},
				"up": {"uv": [0, 0, 16, 16], "texture": "#0"},
				"down": {"uv": [0, 0, 16, 16], "texture": "#0"}
			}
		},
		{
			"from": [7.875, 7.975, 1.1],
			"to": [10.4, 8.075, 2.2],
			"faces": {
				"north": {"uv": [0, 0, 16, 16], "texture": "#0"},
				"east": {"uv": [0, 0, 16, 16], "texture": "#0"},
				"south": {"uv": [0, 0, 16, 16], "texture": "#0"},
				"west": {"uv": [0, 0, 16, 16], "texture": "#0"},
				"up": {"uv": [0, 0, 16, 16], "texture": "#0"},
				"down": {"uv": [0, 0, 16, 16], "texture": "#0"}
			}
		},
		{
			"from": [7.875, 7.825, 1.125],
			"to": [10.4, 7.975, 2.2],
			"faces": {
				"north": {"uv": [0, 0, 16, 16], "texture": "#0"},
				"east": {"uv": [0, 0, 16, 16], "texture": "#0"},
				"south": {"uv": [0, 0, 16, 16], "texture": "#0"},
				"west": {"uv": [0, 0, 16, 16], "texture": "#0"},
				"up": {"uv": [0, 0, 16, 16], "texture": "#0"},
				"down": {"uv": [0, 0, 16, 16], "texture": "#0"}
			}
		},
		{
			"from": [7.875, 7.775, 1.15],
			"to": [10.4, 7.825, 2.2],
			"faces": {
				"north": {"uv": [0, 0, 16, 16], "texture": "#0"},
				"east": {"uv": [0, 0, 16, 16], "texture": "#0"},
				"south": {"uv": [0, 0, 16, 16], "texture": "#0"},
				"west": {"uv": [0, 0, 16, 16], "texture": "#0"},
				"up": {"uv": [0, 0, 16, 16], "texture": "#0"},
				"down": {"uv": [0, 0, 16, 16], "texture": "#0"}
			}
		},
		{
			"from": [7.875, 7.65, 1.175],
			"to": [10.4, 7.775, 2.2],
			"faces": {
				"north": {"uv": [0, 0, 16, 16], "texture": "#0"},
				"east": {"uv": [0, 0, 16, 16], "texture": "#0"},
				"south": {"uv": [0, 0, 16, 16], "texture": "#0"},
				"west": {"uv": [0, 0, 16, 16], "texture": "#0"},
				"up": {"uv": [0, 0, 16, 16], "texture": "#0"},
				"down": {"uv": [0, 0, 16, 16], "texture": "#0"}
			}
		},
		{
			"from": [7.875, 7.5, 1.2],
			"to": [10.4, 7.65, 2.2],
			"faces": {
				"north": {"uv": [0, 0, 16, 16], "texture": "#0"},
				"east": {"uv": [0, 0, 16, 16], "texture": "#0"},
				"south": {"uv": [0, 0, 16, 16], "texture": "#0"},
				"west": {"uv": [0, 0, 16, 16], "texture": "#0"},
				"up": {"uv": [0, 0, 16, 16], "texture": "#0"},
				"down": {"uv": [0, 0, 16, 16], "texture": "#0"}
			}
		},
		{
			"from": [7.875, 7.1, 1.275],
			"to": [10.4, 7.125, 2.2],
			"faces": {
				"north": {"uv": [0, 0, 16, 16], "texture": "#0"},
				"east": {"uv": [0, 0, 16, 16], "texture": "#0"},
				"south": {"uv": [0, 0, 16, 16], "texture": "#0"},
				"west": {"uv": [0, 0, 16, 16], "texture": "#0"},
				"up": {"uv": [0, 0, 16, 16], "texture": "#0"},
				"down": {"uv": [0, 0, 16, 16], "texture": "#0"}
			}
		},
		{
			"from": [7.875, 7.075, 1.35],
			"to": [10.4, 7.1, 2.2],
			"faces": {
				"north": {"uv": [0, 0, 16, 16], "texture": "#0"},
				"east": {"uv": [0, 0, 16, 16], "texture": "#0"},
				"south": {"uv": [0, 0, 16, 16], "texture": "#0"},
				"west": {"uv": [0, 0, 16, 16], "texture": "#0"},
				"up": {"uv": [0, 0, 16, 16], "texture": "#0"},
				"down": {"uv": [0, 0, 16, 16], "texture": "#0"}
			}
		},
		{
			"from": [7.875, 7.05, 1.425],
			"to": [10.4, 7.075, 2.2],
			"faces": {
				"north": {"uv": [0, 0, 16, 16], "texture": "#0"},
				"east": {"uv": [0, 0, 16, 16], "texture": "#0"},
				"south": {"uv": [0, 0, 16, 16], "texture": "#0"},
				"west": {"uv": [0, 0, 16, 16], "texture": "#0"},
				"up": {"uv": [0, 0, 16, 16], "texture": "#0"},
				"down": {"uv": [0, 0, 16, 16], "texture": "#0"}
			}
		},
		{
			"from": [7.875, 7.025, 1.475],
			"to": [10.4, 7.05, 2.2],
			"faces": {
				"north": {"uv": [0, 0, 16, 16], "texture": "#0"},
				"east": {"uv": [0, 0, 16, 16], "texture": "#0"},
				"south": {"uv": [0, 0, 16, 16], "texture": "#0"},
				"west": {"uv": [0, 0, 16, 16], "texture": "#0"},
				"up": {"uv": [0, 0, 16, 16], "texture": "#0"},
				"down": {"uv": [0, 0, 16, 16], "texture": "#0"}
			}
		},
		{
			"from": [7.875, 7, 1.525],
			"to": [10.4, 7.025, 2.2],
			"faces": {
				"north": {"uv": [0, 0, 16, 16], "texture": "#0"},
				"east": {"uv": [0, 0, 16, 16], "texture": "#0"},
				"south": {"uv": [0, 0, 16, 16], "texture": "#0"},
				"west": {"uv": [0, 0, 16, 16], "texture": "#0"},
				"up": {"uv": [0, 0, 16, 16], "texture": "#0"},
				"down": {"uv": [0, 0, 16, 16], "texture": "#0"}
			}
		},
		{
			"from": [7.875, 7, 2.2],
			"to": [10.4, 7.95, 2.225],
			"faces": {
				"north": {"uv": [0, 0, 16, 16], "texture": "#0"},
				"east": {"uv": [0, 0, 16, 16], "texture": "#0"},
				"south": {"uv": [0, 0, 16, 16], "texture": "#0"},
				"west": {"uv": [0, 0, 16, 16], "texture": "#0"},
				"up": {"uv": [0, 0, 16, 16], "texture": "#0"},
				"down": {"uv": [0, 0, 16, 16], "texture": "#0"}
			}
		},
		{
			"from": [7.875, 7, 2.225],
			"to": [10.4, 7.925, 2.25],
			"faces": {
				"north": {"uv": [0, 0, 16, 16], "texture": "#0"},
				"east": {"uv": [0, 0, 16, 16], "texture": "#0"},
				"south": {"uv": [0, 0, 16, 16], "texture": "#0"},
				"west": {"uv": [0, 0, 16, 16], "texture": "#0"},
				"up": {"uv": [0, 0, 16, 16], "texture": "#0"},
				"down": {"uv": [0, 0, 16, 16], "texture": "#0"}
			}
		},
		{
			"from": [7.875, 7.025, 2.25],
			"to": [10.4, 7.875, 2.275],
			"faces": {
				"north": {"uv": [0, 0, 16, 16], "texture": "#0"},
				"east": {"uv": [0, 0, 16, 16], "texture": "#0"},
				"south": {"uv": [0, 0, 16, 16], "texture": "#0"},
				"west": {"uv": [0, 0, 16, 16], "texture": "#0"},
				"up": {"uv": [0, 0, 16, 16], "texture": "#0"},
				"down": {"uv": [0, 0, 16, 16], "texture": "#0"}
			}
		},
		{
			"from": [7.875, 7.025, 2.275],
			"to": [10.4, 7.8, 2.3],
			"faces": {
				"north": {"uv": [0, 0, 16, 16], "texture": "#0"},
				"east": {"uv": [0, 0, 16, 16], "texture": "#0"},
				"south": {"uv": [0, 0, 16, 16], "texture": "#0"},
				"west": {"uv": [0, 0, 16, 16], "texture": "#0"},
				"up": {"uv": [0, 0, 16, 16], "texture": "#0"},
				"down": {"uv": [0, 0, 16, 16], "texture": "#0"}
			}
		},
		{
			"from": [7.875, 7.05, 2.3],
			"to": [10.4, 7.7, 2.325],
			"faces": {
				"north": {"uv": [0, 0, 16, 16], "texture": "#0"},
				"east": {"uv": [0, 0, 16, 16], "texture": "#0"},
				"south": {"uv": [0, 0, 16, 16], "texture": "#0"},
				"west": {"uv": [0, 0, 16, 16], "texture": "#0"},
				"up": {"uv": [0, 0, 16, 16], "texture": "#0"},
				"down": {"uv": [0, 0, 16, 16], "texture": "#0"}
			}
		},
		{
			"from": [7.875, 7.05, 2.325],
			"to": [10.4, 7.4, 2.35],
			"faces": {
				"north": {"uv": [0, 0, 16, 16], "texture": "#0"},
				"east": {"uv": [0, 0, 16, 16], "texture": "#0"},
				"south": {"uv": [0, 0, 16, 16], "texture": "#0"},
				"west": {"uv": [0, 0, 16, 16], "texture": "#0"},
				"up": {"uv": [0, 0, 16, 16], "texture": "#0"},
				"down": {"uv": [0, 0, 16, 16], "texture": "#0"}
			}
		},
		{
			"from": [7.875, 7.05, 2.35],
			"to": [10.4, 7.325, 2.375],
			"faces": {
				"north": {"uv": [0, 0, 16, 16], "texture": "#0"},
				"east": {"uv": [0, 0, 16, 16], "texture": "#0"},
				"south": {"uv": [0, 0, 16, 16], "texture": "#0"},
				"west": {"uv": [0, 0, 16, 16], "texture": "#0"},
				"up": {"uv": [0, 0, 16, 16], "texture": "#0"},
				"down": {"uv": [0, 0, 16, 16], "texture": "#0"}
			}
		},
		{
			"from": [7.875, 7.55, 2.275],
			"to": [10.4, 7.825, 3],
			"faces": {
				"north": {"uv": [0, 0, 16, 16], "texture": "#0"},
				"east": {"uv": [0, 0, 16, 16], "texture": "#0"},
				"south": {"uv": [0, 0, 16, 16], "texture": "#0"},
				"west": {"uv": [0, 0, 16, 16], "texture": "#0"},
				"up": {"uv": [0, 0, 16, 16], "texture": "#0"},
				"down": {"uv": [0, 0, 16, 16], "texture": "#0"}
			}
		},
		{
			"from": [7.875, 7.05, 2.325],
			"to": [10.4, 7.55, 3.7],
			"faces": {
				"north": {"uv": [0, 0, 16, 16], "texture": "#0"},
				"east": {"uv": [0, 0, 16, 16], "texture": "#0"},
				"south": {"uv": [0, 0, 16, 16], "texture": "#0"},
				"west": {"uv": [0, 0, 16, 16], "texture": "#0"},
				"up": {"uv": [0, 0, 16, 16], "texture": "#0"},
				"down": {"uv": [0, 0, 16, 16], "texture": "#0"}
			}
		},
		{
			"from": [7.875, 7, 3.7],
			"to": [10.4, 7.525, 5.2],
			"faces": {
				"north": {"uv": [0, 0, 16, 16], "texture": "#0"},
				"east": {"uv": [0, 0, 16, 16], "texture": "#0"},
				"south": {"uv": [0, 0, 16, 16], "texture": "#0"},
				"west": {"uv": [0, 0, 16, 16], "texture": "#0"},
				"up": {"uv": [0, 0, 16, 16], "texture": "#0"},
				"down": {"uv": [0, 0, 16, 16], "texture": "#0"}
			}
		},
		{
			"from": [7.875, 7.525, 3.75],
			"to": [10.4, 7.7, 5.325],
			"faces": {
				"north": {"uv": [0, 0, 16, 16], "texture": "#0"},
				"east": {"uv": [0, 0, 16, 16], "texture": "#0"},
				"south": {"uv": [0, 0, 16, 16], "texture": "#0"},
				"west": {"uv": [0, 0, 16, 16], "texture": "#0"},
				"up": {"uv": [0, 0, 16, 16], "texture": "#0"},
				"down": {"uv": [0, 0, 16, 16], "texture": "#0"}
			}
		},
		{
			"from": [7.875, 7.35, 3.75],
			"to": [10.4, 7.525, 5.325],
			"faces": {
				"north": {"uv": [0, 0, 16, 16], "texture": "#0"},
				"east": {"uv": [0, 0, 16, 16], "texture": "#0"},
				"south": {"uv": [0, 0, 16, 16], "texture": "#0"},
				"west": {"uv": [0, 0, 16, 16], "texture": "#0"},
				"up": {"uv": [0, 0, 16, 16], "texture": "#0"},
				"down": {"uv": [0, 0, 16, 16], "texture": "#0"}
			}
		},
		{
			"from": [7.875, 7.3, 3.7],
			"to": [10.4, 7.35, 5.275],
			"faces": {
				"north": {"uv": [0, 0, 16, 16], "texture": "#0"},
				"east": {"uv": [0, 0, 16, 16], "texture": "#0"},
				"south": {"uv": [0, 0, 16, 16], "texture": "#0"},
				"west": {"uv": [0, 0, 16, 16], "texture": "#0"},
				"up": {"uv": [0, 0, 16, 16], "texture": "#0"},
				"down": {"uv": [0, 0, 16, 16], "texture": "#0"}
			}
		},
		{
			"from": [7.875, 7.25, 3.65],
			"to": [10.4, 7.3, 5.225],
			"faces": {
				"north": {"uv": [0, 0, 16, 16], "texture": "#0"},
				"east": {"uv": [0, 0, 16, 16], "texture": "#0"},
				"south": {"uv": [0, 0, 16, 16], "texture": "#0"},
				"west": {"uv": [0, 0, 16, 16], "texture": "#0"},
				"up": {"uv": [0, 0, 16, 16], "texture": "#0"},
				"down": {"uv": [0, 0, 16, 16], "texture": "#0"}
			}
		},
		{
			"from": [7.875, 7.7, 3.75],
			"to": [10.4, 7.75, 5.325],
			"faces": {
				"north": {"uv": [0, 0, 16, 16], "texture": "#0"},
				"east": {"uv": [0, 0, 16, 16], "texture": "#0"},
				"south": {"uv": [0, 0, 16, 16], "texture": "#0"},
				"west": {"uv": [0, 0, 16, 16], "texture": "#0"},
				"up": {"uv": [0, 0, 16, 16], "texture": "#0"},
				"down": {"uv": [0, 0, 16, 16], "texture": "#0"}
			}
		},
		{
			"from": [7.875, 7.75, 3.825],
			"to": [10.4, 7.775, 4.45],
			"faces": {
				"north": {"uv": [0, 0, 16, 16], "texture": "#0"},
				"east": {"uv": [0, 0, 16, 16], "texture": "#0"},
				"south": {"uv": [0, 0, 16, 16], "texture": "#0"},
				"west": {"uv": [0, 0, 16, 16], "texture": "#0"},
				"up": {"uv": [0, 0, 16, 16], "texture": "#0"},
				"down": {"uv": [0, 0, 16, 16], "texture": "#0"}
			}
		},
		{
			"from": [7.875, 7.75, 4.675],
			"to": [10.4, 7.775, 5.325],
			"faces": {
				"north": {"uv": [0, 0, 16, 16], "texture": "#0"},
				"east": {"uv": [0, 0, 16, 16], "texture": "#0"},
				"south": {"uv": [0, 0, 16, 16], "texture": "#0"},
				"west": {"uv": [0, 0, 16, 16], "texture": "#0"},
				"up": {"uv": [0, 0, 16, 16], "texture": "#0"},
				"down": {"uv": [0, 0, 16, 16], "texture": "#0"}
			}
		},
		{
			"from": [7.875, 7.775, 4.725],
			"to": [10.4, 7.8, 5.325],
			"faces": {
				"north": {"uv": [0, 0, 16, 16], "texture": "#0"},
				"east": {"uv": [0, 0, 16, 16], "texture": "#0"},
				"south": {"uv": [0, 0, 16, 16], "texture": "#0"},
				"west": {"uv": [0, 0, 16, 16], "texture": "#0"},
				"up": {"uv": [0, 0, 16, 16], "texture": "#0"},
				"down": {"uv": [0, 0, 16, 16], "texture": "#0"}
			}
		},
		{
			"from": [7.875, 7.8, 4.775],
			"to": [10.4, 7.825, 5.325],
			"faces": {
				"north": {"uv": [0, 0, 16, 16], "texture": "#0"},
				"east": {"uv": [0, 0, 16, 16], "texture": "#0"},
				"south": {"uv": [0, 0, 16, 16], "texture": "#0"},
				"west": {"uv": [0, 0, 16, 16], "texture": "#0"},
				"up": {"uv": [0, 0, 16, 16], "texture": "#0"},
				"down": {"uv": [0, 0, 16, 16], "texture": "#0"}
			}
		},
		{
			"from": [7.875, 7.825, 4.825],
			"to": [10.4, 7.85, 5.325],
			"faces": {
				"north": {"uv": [0, 0, 16, 16], "texture": "#0"},
				"east": {"uv": [0, 0, 16, 16], "texture": "#0"},
				"south": {"uv": [0, 0, 16, 16], "texture": "#0"},
				"west": {"uv": [0, 0, 16, 16], "texture": "#0"},
				"up": {"uv": [0, 0, 16, 16], "texture": "#0"},
				"down": {"uv": [0, 0, 16, 16], "texture": "#0"}
			}
		},
		{
			"from": [7.875, 7.85, 4.85],
			"to": [10.4, 7.875, 5.325],
			"faces": {
				"north": {"uv": [0, 0, 16, 16], "texture": "#0"},
				"east": {"uv": [0, 0, 16, 16], "texture": "#0"},
				"south": {"uv": [0, 0, 16, 16], "texture": "#0"},
				"west": {"uv": [0, 0, 16, 16], "texture": "#0"},
				"up": {"uv": [0, 0, 16, 16], "texture": "#0"},
				"down": {"uv": [0, 0, 16, 16], "texture": "#0"}
			}
		},
		{
			"from": [7.875, 7.875, 4.875],
			"to": [10.4, 7.9, 5.325],
			"faces": {
				"north": {"uv": [0, 0, 16, 16], "texture": "#0"},
				"east": {"uv": [0, 0, 16, 16], "texture": "#0"},
				"south": {"uv": [0, 0, 16, 16], "texture": "#0"},
				"west": {"uv": [0, 0, 16, 16], "texture": "#0"},
				"up": {"uv": [0, 0, 16, 16], "texture": "#0"},
				"down": {"uv": [0, 0, 16, 16], "texture": "#0"}
			}
		},
		{
			"from": [7.875, 7.9, 4.9],
			"to": [10.4, 7.95, 5.325],
			"faces": {
				"north": {"uv": [0, 0, 16, 16], "texture": "#0"},
				"east": {"uv": [0, 0, 16, 16], "texture": "#0"},
				"south": {"uv": [0, 0, 16, 16], "texture": "#0"},
				"west": {"uv": [0, 0, 16, 16], "texture": "#0"},
				"up": {"uv": [0, 0, 16, 16], "texture": "#0"},
				"down": {"uv": [0, 0, 16, 16], "texture": "#0"}
			}
		},
		{
			"from": [7.875, 7.975, 4.95],
			"to": [10.4, 8, 5.325],
			"faces": {
				"north": {"uv": [0, 0, 16, 16], "texture": "#0"},
				"east": {"uv": [0, 0, 16, 16], "texture": "#0"},
				"south": {"uv": [0, 0, 16, 16], "texture": "#0"},
				"west": {"uv": [0, 0, 16, 16], "texture": "#0"},
				"up": {"uv": [0, 0, 16, 16], "texture": "#0"},
				"down": {"uv": [0, 0, 16, 16], "texture": "#0"}
			}
		},
		{
			"from": [7.875, 8, 4.975],
			"to": [10.4, 8.025, 5.325],
			"faces": {
				"north": {"uv": [0, 0, 16, 16], "texture": "#0"},
				"east": {"uv": [0, 0, 16, 16], "texture": "#0"},
				"south": {"uv": [0, 0, 16, 16], "texture": "#0"},
				"west": {"uv": [0, 0, 16, 16], "texture": "#0"},
				"up": {"uv": [0, 0, 16, 16], "texture": "#0"},
				"down": {"uv": [0, 0, 16, 16], "texture": "#0"}
			}
		},
		{
			"from": [7.875, 8.025, 5],
			"to": [10.4, 8.05, 5.35],
			"faces": {
				"north": {"uv": [0, 0, 16, 16], "texture": "#0"},
				"east": {"uv": [0, 0, 16, 16], "texture": "#0"},
				"south": {"uv": [0, 0, 16, 16], "texture": "#0"},
				"west": {"uv": [0, 0, 16, 16], "texture": "#0"},
				"up": {"uv": [0, 0, 16, 16], "texture": "#0"},
				"down": {"uv": [0, 0, 16, 16], "texture": "#0"}
			}
		},
		{
			"from": [7.875, 8.05, 5.025],
			"to": [10.4, 8.1, 5.35],
			"faces": {
				"north": {"uv": [0, 0, 16, 16], "texture": "#0"},
				"east": {"uv": [0, 0, 16, 16], "texture": "#0"},
				"south": {"uv": [0, 0, 16, 16], "texture": "#0"},
				"west": {"uv": [0, 0, 16, 16], "texture": "#0"},
				"up": {"uv": [0, 0, 16, 16], "texture": "#0"},
				"down": {"uv": [0, 0, 16, 16], "texture": "#0"}
			}
		},
		{
			"from": [7.875, 8.1, 5.05],
			"to": [10.4, 8.125, 5.35],
			"faces": {
				"north": {"uv": [0, 0, 16, 16], "texture": "#0"},
				"east": {"uv": [0, 0, 16, 16], "texture": "#0"},
				"south": {"uv": [0, 0, 16, 16], "texture": "#0"},
				"west": {"uv": [0, 0, 16, 16], "texture": "#0"},
				"up": {"uv": [0, 0, 16, 16], "texture": "#0"},
				"down": {"uv": [0, 0, 16, 16], "texture": "#0"}
			}
		},
		{
			"from": [7.875, 8.125, 5.075],
			"to": [10.4, 8.15, 5.35],
			"faces": {
				"north": {"uv": [0, 0, 16, 16], "texture": "#0"},
				"east": {"uv": [0, 0, 16, 16], "texture": "#0"},
				"south": {"uv": [0, 0, 16, 16], "texture": "#0"},
				"west": {"uv": [0, 0, 16, 16], "texture": "#0"},
				"up": {"uv": [0, 0, 16, 16], "texture": "#0"},
				"down": {"uv": [0, 0, 16, 16], "texture": "#0"}
			}
		},
		{
			"from": [7.875, 8.15, 5.1],
			"to": [10.4, 8.175, 5.35],
			"faces": {
				"north": {"uv": [0, 0, 16, 16], "texture": "#0"},
				"east": {"uv": [0, 0, 16, 16], "texture": "#0"},
				"south": {"uv": [0, 0, 16, 16], "texture": "#0"},
				"west": {"uv": [0, 0, 16, 16], "texture": "#0"},
				"up": {"uv": [0, 0, 16, 16], "texture": "#0"},
				"down": {"uv": [0, 0, 16, 16], "texture": "#0"}
			}
		},
		{
			"from": [7.875, 8.175, 5.15],
			"to": [10.4, 8.2, 5.35],
			"faces": {
				"north": {"uv": [0, 0, 16, 16], "texture": "#0"},
				"east": {"uv": [0, 0, 16, 16], "texture": "#0"},
				"south": {"uv": [0, 0, 16, 16], "texture": "#0"},
				"west": {"uv": [0, 0, 16, 16], "texture": "#0"},
				"up": {"uv": [0, 0, 16, 16], "texture": "#0"},
				"down": {"uv": [0, 0, 16, 16], "texture": "#0"}
			}
		},
		{
			"from": [7.875, 8.2, 5.2],
			"to": [10.4, 8.225, 5.35],
			"faces": {
				"north": {"uv": [0, 0, 16, 16], "texture": "#0"},
				"east": {"uv": [0, 0, 16, 16], "texture": "#0"},
				"south": {"uv": [0, 0, 16, 16], "texture": "#0"},
				"west": {"uv": [0, 0, 16, 16], "texture": "#0"},
				"up": {"uv": [0, 0, 16, 16], "texture": "#0"},
				"down": {"uv": [0, 0, 16, 16], "texture": "#0"}
			}
		},
		{
			"from": [7.875, 8.225, 5.275],
			"to": [10.4, 8.25, 5.35],
			"faces": {
				"north": {"uv": [0, 0, 16, 16], "texture": "#0"},
				"east": {"uv": [0, 0, 16, 16], "texture": "#0"},
				"south": {"uv": [0, 0, 16, 16], "texture": "#0"},
				"west": {"uv": [0, 0, 16, 16], "texture": "#0"},
				"up": {"uv": [0, 0, 16, 16], "texture": "#0"},
				"down": {"uv": [0, 0, 16, 16], "texture": "#0"}
			}
		},
		{
			"from": [7.875, 7.95, 4.925],
			"to": [10.4, 7.975, 5.325],
			"faces": {
				"north": {"uv": [0, 0, 16, 16], "texture": "#0"},
				"east": {"uv": [0, 0, 16, 16], "texture": "#0"},
				"south": {"uv": [0, 0, 16, 16], "texture": "#0"},
				"west": {"uv": [0, 0, 16, 16], "texture": "#0"},
				"up": {"uv": [0, 0, 16, 16], "texture": "#0"},
				"down": {"uv": [0, 0, 16, 16], "texture": "#0"}
			}
		},
		{
			"from": [7.875, 6.975, 3.7],
			"to": [10.4, 7, 5.175],
			"faces": {
				"north": {"uv": [0, 0, 16, 16], "texture": "#0"},
				"east": {"uv": [0, 0, 16, 16], "texture": "#0"},
				"south": {"uv": [0, 0, 16, 16], "texture": "#0"},
				"west": {"uv": [0, 0, 16, 16], "texture": "#0"},
				"up": {"uv": [0, 0, 16, 16], "texture": "#0"},
				"down": {"uv": [0, 0, 16, 16], "texture": "#0"}
			}
		},
		{
			"from": [7.875, 6.675, 3.65],
			"to": [10.4, 6.7, 4.525],
			"faces": {
				"north": {"uv": [0, 0, 16, 16], "texture": "#0"},
				"east": {"uv": [0, 0, 16, 16], "texture": "#0"},
				"south": {"uv": [0, 0, 16, 16], "texture": "#0"},
				"west": {"uv": [0, 0, 16, 16], "texture": "#0"},
				"up": {"uv": [0, 0, 16, 16], "texture": "#0"},
				"down": {"uv": [0, 0, 16, 16], "texture": "#0"}
			}
		},
		{
			"from": [7.875, 6.7, 3.6],
			"to": [10.4, 6.95, 4.6],
			"faces": {
				"north": {"uv": [0, 0, 16, 16], "texture": "#0"},
				"east": {"uv": [0, 0, 16, 16], "texture": "#0"},
				"south": {"uv": [0, 0, 16, 16], "texture": "#0"},
				"west": {"uv": [0, 0, 16, 16], "texture": "#0"},
				"up": {"uv": [0, 0, 16, 16], "texture": "#0"},
				"down": {"uv": [0, 0, 16, 16], "texture": "#0"}
			}
		},
		{
			"from": [7.875, 6.85, 4.6],
			"to": [10.4, 6.95, 5],
			"faces": {
				"north": {"uv": [0, 0, 16, 16], "texture": "#0"},
				"east": {"uv": [0, 0, 16, 16], "texture": "#0"},
				"south": {"uv": [0, 0, 16, 16], "texture": "#0"},
				"west": {"uv": [0, 0, 16, 16], "texture": "#0"},
				"up": {"uv": [0, 0, 16, 16], "texture": "#0"},
				"down": {"uv": [0, 0, 16, 16], "texture": "#0"}
			}
		},
		{
			"from": [7.875, 6.8, 4.6],
			"to": [10.4, 6.9, 4.9],
			"faces": {
				"north": {"uv": [0, 0, 16, 16], "texture": "#0"},
				"east": {"uv": [0, 0, 16, 16], "texture": "#0"},
				"south": {"uv": [0, 0, 16, 16], "texture": "#0"},
				"west": {"uv": [0, 0, 16, 16], "texture": "#0"},
				"up": {"uv": [0, 0, 16, 16], "texture": "#0"},
				"down": {"uv": [0, 0, 16, 16], "texture": "#0"}
			}
		},
		{
			"from": [7.875, 6.95, 3.7],
			"to": [10.4, 6.975, 5.125],
			"faces": {
				"north": {"uv": [0, 0, 16, 16], "texture": "#0"},
				"east": {"uv": [0, 0, 16, 16], "texture": "#0"},
				"south": {"uv": [0, 0, 16, 16], "texture": "#0"},
				"west": {"uv": [0, 0, 16, 16], "texture": "#0"},
				"up": {"uv": [0, 0, 16, 16], "texture": "#0"},
				"down": {"uv": [0, 0, 16, 16], "texture": "#0"}
			}
		},
		{
			"from": [7.875, 7, 2.5],
			"to": [10.4, 7.05, 3.7],
			"faces": {
				"north": {"uv": [0, 0, 16, 16], "texture": "#0"},
				"east": {"uv": [0, 0, 16, 16], "texture": "#0"},
				"south": {"uv": [0, 0, 16, 16], "texture": "#0"},
				"west": {"uv": [0, 0, 16, 16], "texture": "#0"},
				"up": {"uv": [0, 0, 16, 16], "texture": "#0"},
				"down": {"uv": [0, 0, 16, 16], "texture": "#0"}
			}
		},
		{
			"from": [7.875, 6.95, 3.075],
			"to": [10.4, 7, 3.7],
			"faces": {
				"north": {"uv": [0, 0, 16, 16], "texture": "#0"},
				"east": {"uv": [0, 0, 16, 16], "texture": "#0"},
				"south": {"uv": [0, 0, 16, 16], "texture": "#0"},
				"west": {"uv": [0, 0, 16, 16], "texture": "#0"},
				"up": {"uv": [0, 0, 16, 16], "texture": "#0"},
				"down": {"uv": [0, 0, 16, 16], "texture": "#0"}
			}
		},
		{
			"from": [7.875, 6.9, 3.1],
			"to": [10.4, 6.95, 3.7],
			"faces": {
				"north": {"uv": [0, 0, 16, 16], "texture": "#0"},
				"east": {"uv": [0, 0, 16, 16], "texture": "#0"},
				"south": {"uv": [0, 0, 16, 16], "texture": "#0"},
				"west": {"uv": [0, 0, 16, 16], "texture": "#0"},
				"up": {"uv": [0, 0, 16, 16], "texture": "#0"},
				"down": {"uv": [0, 0, 16, 16], "texture": "#0"}
			}
		},
		{
			"from": [7.875, 6.85, 3.125],
			"to": [10.4, 6.9, 3.7],
			"faces": {
				"north": {"uv": [0, 0, 16, 16], "texture": "#0"},
				"east": {"uv": [0, 0, 16, 16], "texture": "#0"},
				"south": {"uv": [0, 0, 16, 16], "texture": "#0"},
				"west": {"uv": [0, 0, 16, 16], "texture": "#0"},
				"up": {"uv": [0, 0, 16, 16], "texture": "#0"},
				"down": {"uv": [0, 0, 16, 16], "texture": "#0"}
			}
		},
		{
			"from": [7.875, 6.8, 3.175],
			"to": [10.4, 6.85, 3.7],
			"faces": {
				"north": {"uv": [0, 0, 16, 16], "texture": "#0"},
				"east": {"uv": [0, 0, 16, 16], "texture": "#0"},
				"south": {"uv": [0, 0, 16, 16], "texture": "#0"},
				"west": {"uv": [0, 0, 16, 16], "texture": "#0"},
				"up": {"uv": [0, 0, 16, 16], "texture": "#0"},
				"down": {"uv": [0, 0, 16, 16], "texture": "#0"}
			}
		},
		{
			"from": [7.875, 6.75, 3.225],
			"to": [10.4, 6.8, 3.7],
			"faces": {
				"north": {"uv": [0, 0, 16, 16], "texture": "#0"},
				"east": {"uv": [0, 0, 16, 16], "texture": "#0"},
				"south": {"uv": [0, 0, 16, 16], "texture": "#0"},
				"west": {"uv": [0, 0, 16, 16], "texture": "#0"},
				"up": {"uv": [0, 0, 16, 16], "texture": "#0"},
				"down": {"uv": [0, 0, 16, 16], "texture": "#0"}
			}
		},
		{
			"from": [7.875, 6.725, 3.35],
			"to": [10.4, 6.75, 3.7],
			"faces": {
				"north": {"uv": [0, 0, 16, 16], "texture": "#0"},
				"east": {"uv": [0, 0, 16, 16], "texture": "#0"},
				"south": {"uv": [0, 0, 16, 16], "texture": "#0"},
				"west": {"uv": [0, 0, 16, 16], "texture": "#0"},
				"up": {"uv": [0, 0, 16, 16], "texture": "#0"},
				"down": {"uv": [0, 0, 16, 16], "texture": "#0"}
			}
		},
		{
			"from": [7.875, 7.325, 2.225],
			"to": [10.4, 7.6, 3.35],
			"faces": {
				"north": {"uv": [0, 0, 16, 16], "texture": "#0"},
				"east": {"uv": [0, 0, 16, 16], "texture": "#0"},
				"south": {"uv": [0, 0, 16, 16], "texture": "#0"},
				"west": {"uv": [0, 0, 16, 16], "texture": "#0"},
				"up": {"uv": [0, 0, 16, 16], "texture": "#0"},
				"down": {"uv": [0, 0, 16, 16], "texture": "#0"}
			}
		},
		{
			"from": [7.875, 7.375, 2.15],
			"to": [10.4, 7.65, 3.275],
			"faces": {
				"north": {"uv": [0, 0, 16, 16], "texture": "#0"},
				"east": {"uv": [0, 0, 16, 16], "texture": "#0"},
				"south": {"uv": [0, 0, 16, 16], "texture": "#0"},
				"west": {"uv": [0, 0, 16, 16], "texture": "#0"},
				"up": {"uv": [0, 0, 16, 16], "texture": "#0"},
				"down": {"uv": [0, 0, 16, 16], "texture": "#0"}
			}
		},
		{
			"from": [7.875, 10, 3.65],
			"to": [10.4, 10.95, 5.175],
			"faces": {
				"north": {"uv": [0, 0, 16, 16], "texture": "#0"},
				"east": {"uv": [0, 0, 16, 16], "texture": "#0"},
				"south": {"uv": [0, 0, 16, 16], "texture": "#0"},
				"west": {"uv": [0, 0, 16, 16], "texture": "#0"},
				"up": {"uv": [0, 0, 16, 16], "texture": "#0"},
				"down": {"uv": [0, 0, 16, 16], "texture": "#0"}
			}
		},
		{
			"from": [7.875, 10.775, 5.15],
			"to": [10.4, 10.825, 5.45],
			"faces": {
				"north": {"uv": [0, 0, 16, 16], "texture": "#0"},
				"east": {"uv": [0, 0, 16, 16], "texture": "#0"},
				"south": {"uv": [0, 0, 16, 16], "texture": "#0"},
				"west": {"uv": [0, 0, 16, 16], "texture": "#0"},
				"up": {"uv": [0, 0, 16, 16], "texture": "#0"},
				"down": {"uv": [0, 0, 16, 16], "texture": "#0"}
			}
		},
		{
			"from": [7.875, 10.825, 5.15],
			"to": [10.4, 10.85, 5.425],
			"faces": {
				"north": {"uv": [0, 0, 16, 16], "texture": "#0"},
				"east": {"uv": [0, 0, 16, 16], "texture": "#0"},
				"south": {"uv": [0, 0, 16, 16], "texture": "#0"},
				"west": {"uv": [0, 0, 16, 16], "texture": "#0"},
				"up": {"uv": [0, 0, 16, 16], "texture": "#0"},
				"down": {"uv": [0, 0, 16, 16], "texture": "#0"}
			}
		},
		{
			"from": [7.875, 10.85, 5.15],
			"to": [10.4, 10.95, 5.4],
			"faces": {
				"north": {"uv": [0, 0, 16, 16], "texture": "#0"},
				"east": {"uv": [0, 0, 16, 16], "texture": "#0"},
				"south": {"uv": [0, 0, 16, 16], "texture": "#0"},
				"west": {"uv": [0, 0, 16, 16], "texture": "#0"},
				"up": {"uv": [0, 0, 16, 16], "texture": "#0"},
				"down": {"uv": [0, 0, 16, 16], "texture": "#0"}
			}
		},
		{
			"from": [7.875, 10.95, 5.075],
			"to": [10.4, 10.975, 5.4],
			"faces": {
				"north": {"uv": [0, 0, 16, 16], "texture": "#0"},
				"east": {"uv": [0, 0, 16, 16], "texture": "#0"},
				"south": {"uv": [0, 0, 16, 16], "texture": "#0"},
				"west": {"uv": [0, 0, 16, 16], "texture": "#0"},
				"up": {"uv": [0, 0, 16, 16], "texture": "#0"},
				"down": {"uv": [0, 0, 16, 16], "texture": "#0"}
			}
		},
		{
			"from": [7.875, 10.975, 5.1],
			"to": [10.4, 11, 5.4],
			"faces": {
				"north": {"uv": [0, 0, 16, 16], "texture": "#0"},
				"east": {"uv": [0, 0, 16, 16], "texture": "#0"},
				"south": {"uv": [0, 0, 16, 16], "texture": "#0"},
				"west": {"uv": [0, 0, 16, 16], "texture": "#0"},
				"up": {"uv": [0, 0, 16, 16], "texture": "#0"},
				"down": {"uv": [0, 0, 16, 16], "texture": "#0"}
			}
		},
		{
			"from": [7.875, 11, 5.15],
			"to": [10.4, 11.8, 5.375],
			"faces": {
				"north": {"uv": [0, 0, 16, 16], "texture": "#0"},
				"east": {"uv": [0, 0, 16, 16], "texture": "#0"},
				"south": {"uv": [0, 0, 16, 16], "texture": "#0"},
				"west": {"uv": [0, 0, 16, 16], "texture": "#0"},
				"up": {"uv": [0, 0, 16, 16], "texture": "#0"},
				"down": {"uv": [0, 0, 16, 16], "texture": "#0"}
			}
		},
		{
			"from": [7.875, 11.05, 5.125],
			"to": [10.4, 11.8, 5.15],
			"faces": {
				"north": {"uv": [0, 0, 16, 16], "texture": "#0"},
				"east": {"uv": [0, 0, 16, 16], "texture": "#0"},
				"south": {"uv": [0, 0, 16, 16], "texture": "#0"},
				"west": {"uv": [0, 0, 16, 16], "texture": "#0"},
				"up": {"uv": [0, 0, 16, 16], "texture": "#0"},
				"down": {"uv": [0, 0, 16, 16], "texture": "#0"}
			}
		},
		{
			"from": [7.875, 11.075, 5.1],
			"to": [10.4, 11.8, 5.125],
			"faces": {
				"north": {"uv": [0, 0, 16, 16], "texture": "#0"},
				"east": {"uv": [0, 0, 16, 16], "texture": "#0"},
				"south": {"uv": [0, 0, 16, 16], "texture": "#0"},
				"west": {"uv": [0, 0, 16, 16], "texture": "#0"},
				"up": {"uv": [0, 0, 16, 16], "texture": "#0"},
				"down": {"uv": [0, 0, 16, 16], "texture": "#0"}
			}
		},
		{
			"from": [7.875, 11.1, 5.075],
			"to": [10.4, 11.8, 5.1],
			"faces": {
				"north": {"uv": [0, 0, 16, 16], "texture": "#0"},
				"east": {"uv": [0, 0, 16, 16], "texture": "#0"},
				"south": {"uv": [0, 0, 16, 16], "texture": "#0"},
				"west": {"uv": [0, 0, 16, 16], "texture": "#0"},
				"up": {"uv": [0, 0, 16, 16], "texture": "#0"},
				"down": {"uv": [0, 0, 16, 16], "texture": "#0"}
			}
		},
		{
			"from": [7.875, 11.175, 2.5],
			"to": [10.4, 11.8, 5.075],
			"faces": {
				"north": {"uv": [0, 0, 16, 16], "texture": "#0"},
				"east": {"uv": [0, 0, 16, 16], "texture": "#0"},
				"south": {"uv": [0, 0, 16, 16], "texture": "#0"},
				"west": {"uv": [0, 0, 16, 16], "texture": "#0"},
				"up": {"uv": [0, 0, 16, 16], "texture": "#0"},
				"down": {"uv": [0, 0, 16, 16], "texture": "#0"}
			}
		},
		{
			"from": [7.875, 11.125, 2.775],
			"to": [10.4, 11.2, 2.8],
			"faces": {
				"north": {"uv": [0, 0, 16, 16], "texture": "#0"},
				"east": {"uv": [0, 0, 16, 16], "texture": "#0"},
				"south": {"uv": [0, 0, 16, 16], "texture": "#0"},
				"west": {"uv": [0, 0, 16, 16], "texture": "#0"},
				"up": {"uv": [0, 0, 16, 16], "texture": "#0"},
				"down": {"uv": [0, 0, 16, 16], "texture": "#0"}
			}
		},
		{
			"from": [7.875, 10.475, 2.425],
			"to": [10.4, 11.2, 2.875],
			"faces": {
				"north": {"uv": [0, 0, 16, 16], "texture": "#0"},
				"east": {"uv": [0, 0, 16, 16], "texture": "#0"},
				"south": {"uv": [0, 0, 16, 16], "texture": "#0"},
				"west": {"uv": [0, 0, 16, 16], "texture": "#0"},
				"up": {"uv": [0, 0, 16, 16], "texture": "#0"},
				"down": {"uv": [0, 0, 16, 16], "texture": "#0"}
			}
		},
		{
			"from": [7.875, 11.075, 4.375],
			"to": [10.4, 11.125, 4.725],
			"faces": {
				"north": {"uv": [0, 0, 16, 16], "texture": "#0"},
				"east": {"uv": [0, 0, 16, 16], "texture": "#0"},
				"south": {"uv": [0, 0, 16, 16], "texture": "#0"},
				"west": {"uv": [0, 0, 16, 16], "texture": "#0"},
				"up": {"uv": [0, 0, 16, 16], "texture": "#0"},
				"down": {"uv": [0, 0, 16, 16], "texture": "#0"}
			}
		},
		{
			"from": [7.875, 11.075, 3.925],
			"to": [10.4, 11.125, 4.275],
			"faces": {
				"north": {"uv": [0, 0, 16, 16], "texture": "#0"},
				"east": {"uv": [0, 0, 16, 16], "texture": "#0"},
				"south": {"uv": [0, 0, 16, 16], "texture": "#0"},
				"west": {"uv": [0, 0, 16, 16], "texture": "#0"},
				"up": {"uv": [0, 0, 16, 16], "texture": "#0"},
				"down": {"uv": [0, 0, 16, 16], "texture": "#0"}
			}
		},
		{
			"from": [7.875, 11.075, 3.475],
			"to": [10.4, 11.125, 3.825],
			"faces": {
				"north": {"uv": [0, 0, 16, 16], "texture": "#0"},
				"east": {"uv": [0, 0, 16, 16], "texture": "#0"},
				"south": {"uv": [0, 0, 16, 16], "texture": "#0"},
				"west": {"uv": [0, 0, 16, 16], "texture": "#0"},
				"up": {"uv": [0, 0, 16, 16], "texture": "#0"},
				"down": {"uv": [0, 0, 16, 16], "texture": "#0"}
			}
		},
		{
			"from": [7.875, 11.025, 4.35],
			"to": [10.4, 11.075, 4.7],
			"faces": {
				"north": {"uv": [0, 0, 16, 16], "texture": "#0"},
				"east": {"uv": [0, 0, 16, 16], "texture": "#0"},
				"south": {"uv": [0, 0, 16, 16], "texture": "#0"},
				"west": {"uv": [0, 0, 16, 16], "texture": "#0"},
				"up": {"uv": [0, 0, 16, 16], "texture": "#0"},
				"down": {"uv": [0, 0, 16, 16], "texture": "#0"}
			}
		},
		{
			"from": [7.875, 11.025, 3.45],
			"to": [10.4, 11.075, 3.8],
			"faces": {
				"north": {"uv": [0, 0, 16, 16], "texture": "#0"},
				"east": {"uv": [0, 0, 16, 16], "texture": "#0"},
				"south": {"uv": [0, 0, 16, 16], "texture": "#0"},
				"west": {"uv": [0, 0, 16, 16], "texture": "#0"},
				"up": {"uv": [0, 0, 16, 16], "texture": "#0"},
				"down": {"uv": [0, 0, 16, 16], "texture": "#0"}
			}
		},
		{
			"from": [7.875, 11.025, 3.9],
			"to": [10.4, 11.075, 4.25],
			"faces": {
				"north": {"uv": [0, 0, 16, 16], "texture": "#0"},
				"east": {"uv": [0, 0, 16, 16], "texture": "#0"},
				"south": {"uv": [0, 0, 16, 16], "texture": "#0"},
				"west": {"uv": [0, 0, 16, 16], "texture": "#0"},
				"up": {"uv": [0, 0, 16, 16], "texture": "#0"},
				"down": {"uv": [0, 0, 16, 16], "texture": "#0"}
			}
		},
		{
			"from": [7.875, 10.775, 3.575],
			"to": [10.4, 10.825, 3.875],
			"rotation": {"angle": 0, "axis": "y", "origin": [0, -0.05, -1.525]},
			"faces": {
				"north": {"uv": [0, 0, 16, 16], "texture": "#0"},
				"east": {"uv": [0, 0, 16, 16], "texture": "#0"},
				"south": {"uv": [0, 0, 16, 16], "texture": "#0"},
				"west": {"uv": [0, 0, 16, 16], "texture": "#0"},
				"up": {"uv": [0, 0, 16, 16], "texture": "#0"},
				"down": {"uv": [0, 0, 16, 16], "texture": "#0"}
			}
		},
		{
			"from": [7.875, 10.6, 5.15],
			"to": [10.4, 10.775, 5.375],
			"rotation": {"angle": 0, "axis": "y", "origin": [0, -0.175, 0]},
			"faces": {
				"north": {"uv": [0, 0, 16, 16], "texture": "#0"},
				"east": {"uv": [0, 0, 16, 16], "texture": "#0"},
				"south": {"uv": [0, 0, 16, 16], "texture": "#0"},
				"west": {"uv": [0, 0, 16, 16], "texture": "#0"},
				"up": {"uv": [0, 0, 16, 16], "texture": "#0"},
				"down": {"uv": [0, 0, 16, 16], "texture": "#0"}
			}
		},
		{
			"from": [7.875, 10.025, 3.75],
			"to": [10.4, 10.1, 5.275],
			"faces": {
				"north": {"uv": [0, 0, 16, 16], "texture": "#0"},
				"east": {"uv": [0, 0, 16, 16], "texture": "#0"},
				"south": {"uv": [0, 0, 16, 16], "texture": "#0"},
				"west": {"uv": [0, 0, 16, 16], "texture": "#0"},
				"up": {"uv": [0, 0, 16, 16], "texture": "#0"},
				"down": {"uv": [0, 0, 16, 16], "texture": "#0"}
			}
		},
		{
			"from": [7.875, 10.1, 3.575],
			"to": [10.4, 10.175, 5.325],
			"faces": {
				"north": {"uv": [0, 0, 16, 16], "texture": "#0"},
				"east": {"uv": [0, 0, 16, 16], "texture": "#0"},
				"south": {"uv": [0, 0, 16, 16], "texture": "#0"},
				"west": {"uv": [0, 0, 16, 16], "texture": "#0"},
				"up": {"uv": [0, 0, 16, 16], "texture": "#0"},
				"down": {"uv": [0, 0, 16, 16], "texture": "#0"}
			}
		},
		{
			"from": [7.875, 10.175, 3.575],
			"to": [10.4, 10.775, 5.5],
			"faces": {
				"north": {"uv": [0, 0, 16, 16], "texture": "#0"},
				"east": {"uv": [0, 0, 16, 16], "texture": "#0"},
				"south": {"uv": [0, 0, 16, 16], "texture": "#0"},
				"west": {"uv": [0, 0, 16, 16], "texture": "#0"},
				"up": {"uv": [0, 0, 16, 16], "texture": "#0"},
				"down": {"uv": [0, 0, 16, 16], "texture": "#0"}
			}
		},
		{
			"from": [7.875, 10.175, 3.525],
			"to": [10.4, 10.95, 3.575],
			"faces": {
				"north": {"uv": [0, 0, 16, 16], "texture": "#0"},
				"east": {"uv": [0, 0, 16, 16], "texture": "#0"},
				"south": {"uv": [0, 0, 16, 16], "texture": "#0"},
				"west": {"uv": [0, 0, 16, 16], "texture": "#0"},
				"up": {"uv": [0, 0, 16, 16], "texture": "#0"},
				"down": {"uv": [0, 0, 16, 16], "texture": "#0"}
			}
		},
		{
			"from": [7.875, 10.275, 3.475],
			"to": [10.4, 10.95, 3.525],
			"faces": {
				"north": {"uv": [0, 0, 16, 16], "texture": "#0"},
				"east": {"uv": [0, 0, 16, 16], "texture": "#0"},
				"south": {"uv": [0, 0, 16, 16], "texture": "#0"},
				"west": {"uv": [0, 0, 16, 16], "texture": "#0"},
				"up": {"uv": [0, 0, 16, 16], "texture": "#0"},
				"down": {"uv": [0, 0, 16, 16], "texture": "#0"}
			}
		},
		{
			"from": [7.875, 10.4, 3.425],
			"to": [10.4, 10.95, 3.475],
			"faces": {
				"north": {"uv": [0, 0, 16, 16], "texture": "#0"},
				"east": {"uv": [0, 0, 16, 16], "texture": "#0"},
				"south": {"uv": [0, 0, 16, 16], "texture": "#0"},
				"west": {"uv": [0, 0, 16, 16], "texture": "#0"},
				"up": {"uv": [0, 0, 16, 16], "texture": "#0"},
				"down": {"uv": [0, 0, 16, 16], "texture": "#0"}
			}
		},
		{
			"from": [7.875, 10.5, 2.85],
			"to": [10.4, 10.95, 3],
			"faces": {
				"north": {"uv": [0, 0, 16, 16], "texture": "#0"},
				"east": {"uv": [0, 0, 16, 16], "texture": "#0"},
				"south": {"uv": [0, 0, 16, 16], "texture": "#0"},
				"west": {"uv": [0, 0, 16, 16], "texture": "#0"},
				"up": {"uv": [0, 0, 16, 16], "texture": "#0"},
				"down": {"uv": [0, 0, 16, 16], "texture": "#0"}
			}
		},
		{
			"from": [7.875, 10.95, 2.9],
			"to": [10.4, 11, 3.125],
			"faces": {
				"north": {"uv": [0, 0, 16, 16], "texture": "#0"},
				"east": {"uv": [0, 0, 16, 16], "texture": "#0"},
				"south": {"uv": [0, 0, 16, 16], "texture": "#0"},
				"west": {"uv": [0, 0, 16, 16], "texture": "#0"},
				"up": {"uv": [0, 0, 16, 16], "texture": "#0"},
				"down": {"uv": [0, 0, 16, 16], "texture": "#0"}
			}
		},
		{
			"from": [7.875, 11.05, 3],
			"to": [10.4, 11.075, 3.175],
			"faces": {
				"north": {"uv": [0, 0, 16, 16], "texture": "#0"},
				"east": {"uv": [0, 0, 16, 16], "texture": "#0"},
				"south": {"uv": [0, 0, 16, 16], "texture": "#0"},
				"west": {"uv": [0, 0, 16, 16], "texture": "#0"},
				"up": {"uv": [0, 0, 16, 16], "texture": "#0"},
				"down": {"uv": [0, 0, 16, 16], "texture": "#0"}
			}
		},
		{
			"from": [7.875, 11.075, 3.025],
			"to": [10.4, 11.1, 3.175],
			"faces": {
				"north": {"uv": [0, 0, 16, 16], "texture": "#0"},
				"east": {"uv": [0, 0, 16, 16], "texture": "#0"},
				"south": {"uv": [0, 0, 16, 16], "texture": "#0"},
				"west": {"uv": [0, 0, 16, 16], "texture": "#0"},
				"up": {"uv": [0, 0, 16, 16], "texture": "#0"},
				"down": {"uv": [0, 0, 16, 16], "texture": "#0"}
			}
		},
		{
			"from": [7.875, 10.95, 2.95],
			"to": [10.4, 11.05, 3.175],
			"faces": {
				"north": {"uv": [0, 0, 16, 16], "texture": "#0"},
				"east": {"uv": [0, 0, 16, 16], "texture": "#0"},
				"south": {"uv": [0, 0, 16, 16], "texture": "#0"},
				"west": {"uv": [0, 0, 16, 16], "texture": "#0"},
				"up": {"uv": [0, 0, 16, 16], "texture": "#0"},
				"down": {"uv": [0, 0, 16, 16], "texture": "#0"}
			}
		},
		{
			"from": [7.875, 10.4, 3],
			"to": [10.4, 10.95, 3.425],
			"faces": {
				"north": {"uv": [0, 0, 16, 16], "texture": "#0"},
				"east": {"uv": [0, 0, 16, 16], "texture": "#0"},
				"south": {"uv": [0, 0, 16, 16], "texture": "#0"},
				"west": {"uv": [0, 0, 16, 16], "texture": "#0"},
				"up": {"uv": [0, 0, 16, 16], "texture": "#0"},
				"down": {"uv": [0, 0, 16, 16], "texture": "#0"}
			}
		},
		{
			"from": [7.875, 10.175, 3.575],
			"to": [10.4, 10.95, 3.65],
			"faces": {
				"north": {"uv": [0, 0, 16, 16], "texture": "#0"},
				"east": {"uv": [0, 0, 16, 16], "texture": "#0"},
				"south": {"uv": [0, 0, 16, 16], "texture": "#0"},
				"west": {"uv": [0, 0, 16, 16], "texture": "#0"},
				"up": {"uv": [0, 0, 16, 16], "texture": "#0"},
				"down": {"uv": [0, 0, 16, 16], "texture": "#0"}
			}
		},
		{
			"from": [7.875, 7.425, 2.05],
			"to": [10.4, 7.7, 3.175],
			"faces": {
				"north": {"uv": [0, 0, 16, 16], "texture": "#0"},
				"east": {"uv": [0, 0, 16, 16], "texture": "#0"},
				"south": {"uv": [0, 0, 16, 16], "texture": "#0"},
				"west": {"uv": [0, 0, 16, 16], "texture": "#0"},
				"up": {"uv": [0, 0, 16, 16], "texture": "#0"},
				"down": {"uv": [0, 0, 16, 16], "texture": "#0"}
			}
		},
		{
			"from": [7.875, 7.475, 1.95],
			"to": [10.4, 7.75, 3.075],
			"faces": {
				"north": {"uv": [0, 0, 16, 16], "texture": "#0"},
				"east": {"uv": [0, 0, 16, 16], "texture": "#0"},
				"south": {"uv": [0, 0, 16, 16], "texture": "#0"},
				"west": {"uv": [0, 0, 16, 16], "texture": "#0"},
				"up": {"uv": [0, 0, 16, 16], "texture": "#0"},
				"down": {"uv": [0, 0, 16, 16], "texture": "#0"}
			}
		},
		{
			"from": [7.875, 7.45, 2],
			"to": [10.4, 7.725, 3.125],
			"faces": {
				"north": {"uv": [0, 0, 16, 16], "texture": "#0"},
				"east": {"uv": [0, 0, 16, 16], "texture": "#0"},
				"south": {"uv": [0, 0, 16, 16], "texture": "#0"},
				"west": {"uv": [0, 0, 16, 16], "texture": "#0"},
				"up": {"uv": [0, 0, 16, 16], "texture": "#0"},
				"down": {"uv": [0, 0, 16, 16], "texture": "#0"}
			}
		},
		{
			"from": [7.875, 7.875, 2.25],
			"to": [10.4, 7.925, 2.375],
			"faces": {
				"north": {"uv": [0, 0, 16, 16], "texture": "#0"},
				"east": {"uv": [0, 0, 16, 16], "texture": "#0"},
				"south": {"uv": [0, 0, 16, 16], "texture": "#0"},
				"west": {"uv": [0, 0, 16, 16], "texture": "#0"},
				"up": {"uv": [0, 0, 16, 16], "texture": "#0"},
				"down": {"uv": [0, 0, 16, 16], "texture": "#0"}
			}
		},
		{
			"from": [7.875, 7.825, 2.25],
			"to": [10.4, 7.875, 2.95],
			"faces": {
				"north": {"uv": [0, 0, 16, 16], "texture": "#0"},
				"east": {"uv": [0, 0, 16, 16], "texture": "#0"},
				"south": {"uv": [0, 0, 16, 16], "texture": "#0"},
				"west": {"uv": [0, 0, 16, 16], "texture": "#0"},
				"up": {"uv": [0, 0, 16, 16], "texture": "#0"},
				"down": {"uv": [0, 0, 16, 16], "texture": "#0"}
			}
		},
		{
			"from": [7.875, 7.125, 1.25],
			"to": [10.4, 7.375, 2.2],
			"faces": {
				"north": {"uv": [0, 0, 16, 16], "texture": "#0"},
				"east": {"uv": [0, 0, 16, 16], "texture": "#0"},
				"south": {"uv": [0, 0, 16, 16], "texture": "#0"},
				"west": {"uv": [0, 0, 16, 16], "texture": "#0"},
				"up": {"uv": [0, 0, 16, 16], "texture": "#0"},
				"down": {"uv": [0, 0, 16, 16], "texture": "#0"}
			}
		},
		{
			"from": [7.875, 7.375, 1.225],
			"to": [10.4, 7.5, 2.2],
			"faces": {
				"north": {"uv": [0, 0, 16, 16], "texture": "#0"},
				"east": {"uv": [0, 0, 16, 16], "texture": "#0"},
				"south": {"uv": [0, 0, 16, 16], "texture": "#0"},
				"west": {"uv": [0, 0, 16, 16], "texture": "#0"},
				"up": {"uv": [0, 0, 16, 16], "texture": "#0"},
				"down": {"uv": [0, 0, 16, 16], "texture": "#0"}
			}
		},
		{
			"from": [7.875, 7.25, 1.075],
			"to": [10.4, 8.45, 2.175],
			"faces": {
				"north": {"uv": [0, 0, 16, 16], "texture": "#0"},
				"east": {"uv": [0, 0, 16, 16], "texture": "#0"},
				"south": {"uv": [0, 0, 16, 16], "texture": "#0"},
				"west": {"uv": [0, 0, 16, 16], "texture": "#0"},
				"up": {"uv": [0, 0, 16, 16], "texture": "#0"},
				"down": {"uv": [0, 0, 16, 16], "texture": "#0"}
			}
		},
		{
			"from": [7.875, 8.75, 1.1],
			"to": [10.4, 8.875, 1.125],
			"faces": {
				"north": {"uv": [0, 0, 16, 16], "texture": "#0"},
				"east": {"uv": [0, 0, 16, 16], "texture": "#0"},
				"south": {"uv": [0, 0, 16, 16], "texture": "#0"},
				"west": {"uv": [0, 0, 16, 16], "texture": "#0"},
				"up": {"uv": [0, 0, 16, 16], "texture": "#0"},
				"down": {"uv": [0, 0, 16, 16], "texture": "#0"}
			}
		},
		{
			"from": [7.875, 8.75, 1.125],
			"to": [10.4, 8.825, 1.15],
			"faces": {
				"north": {"uv": [0, 0, 16, 16], "texture": "#0"},
				"east": {"uv": [0, 0, 16, 16], "texture": "#0"},
				"south": {"uv": [0, 0, 16, 16], "texture": "#0"},
				"west": {"uv": [0, 0, 16, 16], "texture": "#0"},
				"up": {"uv": [0, 0, 16, 16], "texture": "#0"},
				"down": {"uv": [0, 0, 16, 16], "texture": "#0"}
			}
		},
		{
			"from": [7.875, 8.75, 1.15],
			"to": [10.4, 8.8, 1.175],
			"faces": {
				"north": {"uv": [0, 0, 16, 16], "texture": "#0"},
				"east": {"uv": [0, 0, 16, 16], "texture": "#0"},
				"south": {"uv": [0, 0, 16, 16], "texture": "#0"},
				"west": {"uv": [0, 0, 16, 16], "texture": "#0"},
				"up": {"uv": [0, 0, 16, 16], "texture": "#0"},
				"down": {"uv": [0, 0, 16, 16], "texture": "#0"}
			}
		},
		{
			"from": [7.875, 8.75, 1.175],
			"to": [10.4, 8.775, 1.225],
			"faces": {
				"north": {"uv": [0, 0, 16, 16], "texture": "#0"},
				"east": {"uv": [0, 0, 16, 16], "texture": "#0"},
				"south": {"uv": [0, 0, 16, 16], "texture": "#0"},
				"west": {"uv": [0, 0, 16, 16], "texture": "#0"},
				"up": {"uv": [0, 0, 16, 16], "texture": "#0"},
				"down": {"uv": [0, 0, 16, 16], "texture": "#0"}
			}
		},
		{
			"from": [7.875, 8.75, 1.075],
			"to": [10.4, 8.9, 1.1],
			"faces": {
				"north": {"uv": [0, 0, 16, 16], "texture": "#0"},
				"east": {"uv": [0, 0, 16, 16], "texture": "#0"},
				"south": {"uv": [0, 0, 16, 16], "texture": "#0"},
				"west": {"uv": [0, 0, 16, 16], "texture": "#0"},
				"up": {"uv": [0, 0, 16, 16], "texture": "#0"},
				"down": {"uv": [0, 0, 16, 16], "texture": "#0"}
			}
		},
		{
			"from": [7.875, 8.1, 0.475],
			"to": [10.4, 8.8, 0.775],
			"faces": {
				"north": {"uv": [0, 0, 16, 16], "texture": "#0"},
				"east": {"uv": [0, 0, 16, 16], "texture": "#0"},
				"south": {"uv": [0, 0, 16, 16], "texture": "#0"},
				"west": {"uv": [0, 0, 16, 16], "texture": "#0"},
				"up": {"uv": [0, 0, 16, 16], "texture": "#0"},
				"down": {"uv": [0, 0, 16, 16], "texture": "#0"}
			}
		},
		{
			"from": [7.875, 12, 0.6],
			"to": [10.4, 12.7, 0.8],
			"faces": {
				"north": {"uv": [0, 0, 16, 16], "texture": "#4"},
				"east": {"uv": [0, 0, 16, 16], "texture": "#4"},
				"south": {"uv": [0, 0, 16, 16], "texture": "#4"},
				"west": {"uv": [0, 0, 16, 16], "texture": "#4"},
				"up": {"uv": [0, 0, 16, 16], "texture": "#4"},
				"down": {"uv": [0, 0, 16, 16], "texture": "#4"}
			}
		},
		{
			"from": [7.875, 11.9, 0.4],
			"to": [10.4, 12.6, 0.6],
			"faces": {
				"north": {"uv": [0, 0, 16, 16], "texture": "#4"},
				"east": {"uv": [0, 0, 16, 16], "texture": "#4"},
				"south": {"uv": [0, 0, 16, 16], "texture": "#4"},
				"west": {"uv": [0, 0, 16, 16], "texture": "#4"},
				"up": {"uv": [0, 0, 16, 16], "texture": "#4"},
				"down": {"uv": [0, 0, 16, 16], "texture": "#4"}
			}
		},
		{
			"from": [7.875, 11.5, 0.3],
			"to": [10.4, 12.5, 0.5],
			"faces": {
				"north": {"uv": [0, 0, 16, 16], "texture": "#4"},
				"east": {"uv": [0, 0, 16, 16], "texture": "#4"},
				"south": {"uv": [0, 0, 16, 16], "texture": "#4"},
				"west": {"uv": [0, 0, 16, 16], "texture": "#4"},
				"up": {"uv": [0, 0, 16, 16], "texture": "#4"},
				"down": {"uv": [0, 0, 16, 16], "texture": "#4"}
			}
		},
		{
			"from": [7.875, 11.3, 0.2],
			"to": [10.4, 12.3, 0.3],
			"faces": {
				"north": {"uv": [0, 0, 16, 16], "texture": "#4"},
				"east": {"uv": [0, 0, 16, 16], "texture": "#4"},
				"south": {"uv": [0, 0, 16, 16], "texture": "#4"},
				"west": {"uv": [0, 0, 16, 16], "texture": "#4"},
				"up": {"uv": [0, 0, 16, 16], "texture": "#4"},
				"down": {"uv": [0, 0, 16, 16], "texture": "#4"}
			}
		},
		{
			"from": [7.875, 8.5, 0],
			"to": [10.4, 11.2, 0.4],
			"faces": {
				"north": {"uv": [0, 0, 16, 16], "texture": "#4"},
				"east": {"uv": [0, 0, 16, 16], "texture": "#4"},
				"south": {"uv": [0, 0, 16, 16], "texture": "#4"},
				"west": {"uv": [0, 0, 16, 16], "texture": "#4"},
				"up": {"uv": [0, 0, 16, 16], "texture": "#4"},
				"down": {"uv": [0, 0, 16, 16], "texture": "#4"}
			}
		},
		{
			"from": [7.875, 10, 0.1],
			"to": [10.4, 12, 0.8],
			"faces": {
				"north": {"uv": [0, 0, 16, 16], "texture": "#4"},
				"east": {"uv": [0, 0, 16, 16], "texture": "#4"},
				"south": {"uv": [0, 0, 16, 16], "texture": "#4"},
				"west": {"uv": [0, 0, 16, 16], "texture": "#4"},
				"up": {"uv": [0, 0, 16, 16], "texture": "#4"},
				"down": {"uv": [0, 0, 16, 16], "texture": "#4"}
			}
		},
		{
			"from": [7.875, 10.475, 0.55],
			"to": [10.4, 12, 0.825],
			"faces": {
				"north": {"uv": [0, 0, 16, 16], "texture": "#4"},
				"east": {"uv": [0, 0, 16, 16], "texture": "#4"},
				"south": {"uv": [0, 0, 16, 16], "texture": "#4"},
				"west": {"uv": [0, 0, 16, 16], "texture": "#4"},
				"up": {"uv": [0, 0, 16, 16], "texture": "#4"},
				"down": {"uv": [0, 0, 16, 16], "texture": "#4"}
			}
		},
		{
			"from": [7.875, 11.025, 0.6],
			"to": [10.4, 12, 0.875],
			"faces": {
				"north": {"uv": [0, 0, 16, 16], "texture": "#4"},
				"east": {"uv": [0, 0, 16, 16], "texture": "#4"},
				"south": {"uv": [0, 0, 16, 16], "texture": "#4"},
				"west": {"uv": [0, 0, 16, 16], "texture": "#4"},
				"up": {"uv": [0, 0, 16, 16], "texture": "#4"},
				"down": {"uv": [0, 0, 16, 16], "texture": "#4"}
			}
		},
		{
			"from": [7.875, 9.6, 0.4],
			"to": [10.4, 10.6, 0.8],
			"faces": {
				"north": {"uv": [0, 0, 16, 16], "texture": "#4"},
				"east": {"uv": [0, 0, 16, 16], "texture": "#4"},
				"south": {"uv": [0, 0, 16, 16], "texture": "#4"},
				"west": {"uv": [0, 0, 16, 16], "texture": "#4"},
				"up": {"uv": [0, 0, 16, 16], "texture": "#4"},
				"down": {"uv": [0, 0, 16, 16], "texture": "#4"}
			}
		},
		{
			"from": [7.875, 8.8, 0.4],
			"to": [10.4, 10.2, 0.775],
			"faces": {
				"north": {"uv": [0, 0, 16, 16], "texture": "#4"},
				"east": {"uv": [0, 0, 16, 16], "texture": "#4"},
				"south": {"uv": [0, 0, 16, 16], "texture": "#4"},
				"west": {"uv": [0, 0, 16, 16], "texture": "#4"},
				"up": {"uv": [0, 0, 16, 16], "texture": "#4"},
				"down": {"uv": [0, 0, 16, 16], "texture": "#4"}
			}
		},
		{
			"from": [7.875, 8.7, 0.1],
			"to": [10.4, 8.86, 0.7],
			"faces": {
				"north": {"uv": [0, 0, 16, 16], "texture": "#4"},
				"east": {"uv": [0, 0, 16, 16], "texture": "#4"},
				"south": {"uv": [0, 0, 16, 16], "texture": "#4"},
				"west": {"uv": [0, 0, 16, 16], "texture": "#4"},
				"up": {"uv": [0, 0, 16, 16], "texture": "#4"},
				"down": {"uv": [0, 0, 16, 16], "texture": "#4"}
			}
		},
		{
			"from": [7.875, 8.6, 0],
			"to": [10.4, 8.76, 0.6],
			"faces": {
				"north": {"uv": [0, 0, 16, 16], "texture": "#4"},
				"east": {"uv": [0, 0, 16, 16], "texture": "#4"},
				"south": {"uv": [0, 0, 16, 16], "texture": "#4"},
				"west": {"uv": [0, 0, 16, 16], "texture": "#4"},
				"up": {"uv": [0, 0, 16, 16], "texture": "#4"},
				"down": {"uv": [0, 0, 16, 16], "texture": "#4"}
			}
		},
		{
			"from": [7.875, 8.5, 0],
			"to": [10.4, 8.66, 0.5],
			"faces": {
				"north": {"uv": [0, 0, 16, 16], "texture": "#4"},
				"east": {"uv": [0, 0, 16, 16], "texture": "#4"},
				"south": {"uv": [0, 0, 16, 16], "texture": "#4"},
				"west": {"uv": [0, 0, 16, 16], "texture": "#4"},
				"up": {"uv": [0, 0, 16, 16], "texture": "#4"},
				"down": {"uv": [0, 0, 16, 16], "texture": "#4"}
			}
		},
		{
			"from": [7.875, 7.9, 0.05],
			"to": [10.4, 8.56, 0.45],
			"faces": {
				"north": {"uv": [0, 0, 16, 16], "texture": "#4"},
				"east": {"uv": [0, 0, 16, 16], "texture": "#4"},
				"south": {"uv": [0, 0, 16, 16], "texture": "#4"},
				"west": {"uv": [0, 0, 16, 16], "texture": "#4"},
				"up": {"uv": [0, 0, 16, 16], "texture": "#4"},
				"down": {"uv": [0, 0, 16, 16], "texture": "#4"}
			}
		},
		{
			"from": [7.875, 7.1, 0.4],
			"to": [10.4, 8.1, 0.8],
			"faces": {
				"north": {"uv": [0, 0, 16, 16], "texture": "#4"},
				"east": {"uv": [0, 0, 16, 16], "texture": "#4"},
				"south": {"uv": [0, 0, 16, 16], "texture": "#4"},
				"west": {"uv": [0, 0, 16, 16], "texture": "#4"},
				"up": {"uv": [0, 0, 16, 16], "texture": "#4"},
				"down": {"uv": [0, 0, 16, 16], "texture": "#4"}
			}
		},
		{
			"from": [7.875, 7.7, 0.1],
			"to": [10.4, 8.7, 0.4],
			"faces": {
				"north": {"uv": [0, 0, 16, 16], "texture": "#4"},
				"east": {"uv": [0, 0, 16, 16], "texture": "#4"},
				"south": {"uv": [0, 0, 16, 16], "texture": "#4"},
				"west": {"uv": [0, 0, 16, 16], "texture": "#4"},
				"up": {"uv": [0, 0, 16, 16], "texture": "#4"},
				"down": {"uv": [0, 0, 16, 16], "texture": "#4"}
			}
		},
		{
			"from": [7.875, 7.6, 0.15],
			"to": [10.4, 8.6, 0.25],
			"faces": {
				"north": {"uv": [0, 0, 16, 16], "texture": "#4"},
				"east": {"uv": [0, 0, 16, 16], "texture": "#4"},
				"south": {"uv": [0, 0, 16, 16], "texture": "#4"},
				"west": {"uv": [0, 0, 16, 16], "texture": "#4"},
				"up": {"uv": [0, 0, 16, 16], "texture": "#4"},
				"down": {"uv": [0, 0, 16, 16], "texture": "#4"}
			}
		},
		{
			"from": [7.875, 7.425, 0.175],
			"to": [10.4, 8.525, 0.475],
			"faces": {
				"north": {"uv": [0, 0, 16, 16], "texture": "#4"},
				"east": {"uv": [0, 0, 16, 16], "texture": "#4"},
				"south": {"uv": [0, 0, 16, 16], "texture": "#4"},
				"west": {"uv": [0, 0, 16, 16], "texture": "#4"},
				"up": {"uv": [0, 0, 16, 16], "texture": "#4"},
				"down": {"uv": [0, 0, 16, 16], "texture": "#4"}
			}
		},
		{
			"from": [7.875, 7.25, 0.25],
			"to": [10.4, 7.35, 0.55],
			"faces": {
				"north": {"uv": [0, 0, 16, 16], "texture": "#4"},
				"east": {"uv": [0, 0, 16, 16], "texture": "#4"},
				"south": {"uv": [0, 0, 16, 16], "texture": "#4"},
				"west": {"uv": [0, 0, 16, 16], "texture": "#4"},
				"up": {"uv": [0, 0, 16, 16], "texture": "#4"},
				"down": {"uv": [0, 0, 16, 16], "texture": "#4"}
			}
		},
		{
			"from": [7.875, 7.1, 0.3],
			"to": [10.4, 7.25, 0.6],
			"faces": {
				"north": {"uv": [0, 0, 16, 16], "texture": "#4"},
				"east": {"uv": [0, 0, 16, 16], "texture": "#4"},
				"south": {"uv": [0, 0, 16, 16], "texture": "#4"},
				"west": {"uv": [0, 0, 16, 16], "texture": "#4"},
				"up": {"uv": [0, 0, 16, 16], "texture": "#4"},
				"down": {"uv": [0, 0, 16, 16], "texture": "#4"}
			}
		},
		{
			"from": [7.875, 7.35, 0.225],
			"to": [10.4, 7.45, 0.525],
			"faces": {
				"north": {"uv": [0, 0, 16, 16], "texture": "#4"},
				"east": {"uv": [0, 0, 16, 16], "texture": "#4"},
				"south": {"uv": [0, 0, 16, 16], "texture": "#4"},
				"west": {"uv": [0, 0, 16, 16], "texture": "#4"},
				"up": {"uv": [0, 0, 16, 16], "texture": "#4"},
				"down": {"uv": [0, 0, 16, 16], "texture": "#4"}
			}
		},
		{
			"from": [7.875, 7.2, 0.8],
			"to": [10.4, 8.075, 1.1],
			"faces": {
				"north": {"uv": [0, 0, 16, 16], "texture": "#4"},
				"east": {"uv": [0, 0, 16, 16], "texture": "#4"},
				"south": {"uv": [0, 0, 16, 16], "texture": "#4"},
				"west": {"uv": [0, 0, 16, 16], "texture": "#4"},
				"up": {"uv": [0, 0, 16, 16], "texture": "#4"},
				"down": {"uv": [0, 0, 16, 16], "texture": "#4"}
			}
		},
		{
			"from": [7.875, 7.125, 1.1],
			"to": [10.4, 7.975, 1.125],
			"faces": {
				"north": {"uv": [0, 0, 16, 16], "texture": "#4"},
				"east": {"uv": [0, 0, 16, 16], "texture": "#4"},
				"south": {"uv": [0, 0, 16, 16], "texture": "#4"},
				"west": {"uv": [0, 0, 16, 16], "texture": "#4"},
				"up": {"uv": [0, 0, 16, 16], "texture": "#4"},
				"down": {"uv": [0, 0, 16, 16], "texture": "#4"}
			}
		},
		{
			"from": [7.875, 7.15, 1.125],
			"to": [10.4, 7.825, 1.15],
			"faces": {
				"north": {"uv": [0, 0, 16, 16], "texture": "#4"},
				"east": {"uv": [0, 0, 16, 16], "texture": "#4"},
				"south": {"uv": [0, 0, 16, 16], "texture": "#4"},
				"west": {"uv": [0, 0, 16, 16], "texture": "#4"},
				"up": {"uv": [0, 0, 16, 16], "texture": "#4"},
				"down": {"uv": [0, 0, 16, 16], "texture": "#4"}
			}
		},
		{
			"from": [7.875, 7.175, 1.15],
			"to": [10.4, 7.775, 1.175],
			"faces": {
				"north": {"uv": [0, 0, 16, 16], "texture": "#4"},
				"east": {"uv": [0, 0, 16, 16], "texture": "#4"},
				"south": {"uv": [0, 0, 16, 16], "texture": "#4"},
				"west": {"uv": [0, 0, 16, 16], "texture": "#4"},
				"up": {"uv": [0, 0, 16, 16], "texture": "#4"},
				"down": {"uv": [0, 0, 16, 16], "texture": "#4"}
			}
		},
		{
			"from": [7.875, 7.175, 1.175],
			"to": [10.4, 7.65, 1.2],
			"faces": {
				"north": {"uv": [0, 0, 16, 16], "texture": "#4"},
				"east": {"uv": [0, 0, 16, 16], "texture": "#4"},
				"south": {"uv": [0, 0, 16, 16], "texture": "#4"},
				"west": {"uv": [0, 0, 16, 16], "texture": "#4"},
				"up": {"uv": [0, 0, 16, 16], "texture": "#4"},
				"down": {"uv": [0, 0, 16, 16], "texture": "#4"}
			}
		},
		{
			"from": [7.875, 7.15, 1.2],
			"to": [10.4, 7.5, 1.225],
			"faces": {
				"north": {"uv": [0, 0, 16, 16], "texture": "#4"},
				"east": {"uv": [0, 0, 16, 16], "texture": "#4"},
				"south": {"uv": [0, 0, 16, 16], "texture": "#4"},
				"west": {"uv": [0, 0, 16, 16], "texture": "#4"},
				"up": {"uv": [0, 0, 16, 16], "texture": "#4"},
				"down": {"uv": [0, 0, 16, 16], "texture": "#4"}
			}
		},
		{
			"from": [7.875, 7.125, 1.225],
			"to": [10.4, 7.375, 1.25],
			"faces": {
				"north": {"uv": [0, 0, 16, 16], "texture": "#4"},
				"east": {"uv": [0, 0, 16, 16], "texture": "#4"},
				"south": {"uv": [0, 0, 16, 16], "texture": "#4"},
				"west": {"uv": [0, 0, 16, 16], "texture": "#4"},
				"up": {"uv": [0, 0, 16, 16], "texture": "#4"},
				"down": {"uv": [0, 0, 16, 16], "texture": "#4"}
			}
		},
		{
			"from": [7.875, 7.1, 0.8],
			"to": [10.4, 7.275, 0.85],
			"faces": {
				"north": {"uv": [0, 0, 16, 16], "texture": "#4"},
				"east": {"uv": [0, 0, 16, 16], "texture": "#4"},
				"south": {"uv": [0, 0, 16, 16], "texture": "#4"},
				"west": {"uv": [0, 0, 16, 16], "texture": "#4"},
				"up": {"uv": [0, 0, 16, 16], "texture": "#4"},
				"down": {"uv": [0, 0, 16, 16], "texture": "#4"}
			}
		},
		{
			"from": [7.875, 7.15, 0.85],
			"to": [10.4, 7.325, 0.9],
			"faces": {
				"north": {"uv": [0, 0, 16, 16], "texture": "#4"},
				"east": {"uv": [0, 0, 16, 16], "texture": "#4"},
				"south": {"uv": [0, 0, 16, 16], "texture": "#4"},
				"west": {"uv": [0, 0, 16, 16], "texture": "#4"},
				"up": {"uv": [0, 0, 16, 16], "texture": "#4"},
				"down": {"uv": [0, 0, 16, 16], "texture": "#4"}
			}
		},
		{
			"from": [7.875, 7.175, 0.9],
			"to": [10.4, 7.35, 0.95],
			"faces": {
				"north": {"uv": [0, 0, 16, 16], "texture": "#4"},
				"east": {"uv": [0, 0, 16, 16], "texture": "#4"},
				"south": {"uv": [0, 0, 16, 16], "texture": "#4"},
				"west": {"uv": [0, 0, 16, 16], "texture": "#4"},
				"up": {"uv": [0, 0, 16, 16], "texture": "#4"},
				"down": {"uv": [0, 0, 16, 16], "texture": "#4"}
			}
		}
	],
	"display": {
		"thirdperson_righthand": {
			"rotation": [1, -180, 1],
			"translation": [1.25, -4, -6.75],
			"scale": [1, 1.17, 1.17]
		},
		"thirdperson_lefthand": {
			"rotation": [1, -180, 1],
			"translation": [-1.25, -4, -7.25],
			"scale": [1, 1.17, 1.17]
		},
		"firstperson_righthand": {
			"rotation": [-2, -180, -10],
			"translation": [2.75, -5.75, -7],
			"scale": [1, 1.74, 2.15]
		},
		"firstperson_lefthand": {
			"rotation": [-6, -180, -15],
			"translation": [0.5, -2.5, -2.5],
			"scale": [1, 1.17, 1.17]
		},
		"ground": {
			"rotation": [-9, 0, -12],
			"translation": [-1.5, 0, 5.25]
		},
		"gui": {
			"rotation": [-81.98, -63.06, -80.02],
			"translation": [-1.75, -2.25, 0.5]
		},
		"fixed": {
			"rotation": [5, 95, -4],
			"translation": [0, -2.25, -7]
		}
	},
	"groups": [
		{
			"name": "group",
			"origin": [0, 0, 0],
			"color": 0,
			"children": [
				{
					"name": "group",
					"origin": [8, 8, 8],
					"color": 0,
					"children": [0]
				},
				{
					"name": "group",
					"origin": [8, 8, 8],
					"color": 0,
					"children": [1, 2, 3, 4]
				},
				{
					"name": "group",
					"origin": [0, 0, 0],
					"color": 0,
					"children": [5]
				},
				{
					"name": "group",
					"origin": [0, 0, 0],
					"color": 0,
					"children": [6, 7, 8, 9, 10, 11, 12, 13, 14, 15, 16]
				},
				{
					"name": "group",
					"origin": [0, 0, 0],
					"color": 0,
					"children": [17, 18, 19, 20, 21, 22, 23, 24, 25, 26, 27, 28, 29, 30, 31, 32, 33, 34, 35, 36]
				},
				{
					"name": "group",
					"origin": [0, 0, 0],
					"color": 0,
					"children": [37, 38, 39, 40, 41, 42, 43, 44, 45, 46, 47]
				},
				{
					"name": "group",
					"origin": [8, 8, 8],
					"color": 1,
					"children": [48, 49, 50, 51, 52, 53, 54, 55, 56, 57, 58, 59, 60, 61, 62, 63, 64, 65, 66, 67]
				},
				{
					"name": "group",
					"origin": [8, 8, 8],
					"color": 0,
					"children": [68, 69, 70, 71, 72, 73, 74, 75, 76, 77, 78, 79, 80, 81, 82, 83, 84, 85, 86, 87, 88, 89, 90, 91, 92, 93, 94, 95, 96, 97, 98, 99, 100, 101, 102, 103, 104, 105, 106, 107, 108, 109, 110, 111, 112, 113, 114, 115, 116, 117, 118, 119, 120, 121, 122, 123, 124, 125, 126, 127, 128, 129, 130, 131, 132, 133, 134, 135, 136, 137, 138, 139, 140, 141, 142, 143, 144, 145, 146, 147, 148, 149, 150, 151, 152, 153, 154, 155, 156, 157, 158, 159, 160, 161, 162, 163, 164, 165, 166, 167, 168, 169, 170, 171, 172, 173, 174, 175, 176, 177, 178, 179, 180, 181, 182, 183, 184, 185, 186]
				},
				{
					"name": "group",
					"origin": [8, 8, 8],
					"color": 9,
					"children": [187, 188, 189, 190, 191, 192, 193, 194, 195, 196, 197, 198, 199, 200, 201, 202, 203, 204, 205, 206, 207, 208, 209, 210, 211, 212, 213, 214, 215, 216, 217]
				}
			]
		}
	]
}