{
  "parent": "money_heart:custom/bustersword",
  "textures": {
    "0": "money_heart:blocks/gray_concrete_powder",
    "1": "money_heart:blocks/iron_block",
    "2": "money_heart:blocks/fire_coral_block",
    "3": "money_heart:blocks/gray_concrete_powder",
    "particle": "money_heart:items/bs"
  }
}