{
	"credit": "Made with Blockbench",
	"parent": "M700",
	"textures": {
		"0": "black_concrete",
		"1": "gray_concrete",
		"2": "gray_concrete_powder",
		"3": "orange_terracotta",
		"4": "packed_ice",
		"particle": "black_concrete"
	},
	"elements": [
		{
			"from": [8, 6.975, 13.7],
			"to": [8.6, 8.3, 16.175],
			"rotation": {"angle": 0, "axis": "x", "origin": [8.3, 8.375, 14.15]},
			"faces": {
				"north": {"uv": [0, 0, 16, 16], "texture": "#3"},
				"east": {"uv": [0, 0, 16, 16], "texture": "#3"},
				"south": {"uv": [0, 0, 16, 16], "texture": "#3"},
				"west": {"uv": [0, 0, 16, 16], "texture": "#3"},
				"up": {"uv": [0, 0, 16, 16], "texture": "#3"},
				"down": {"uv": [0, 0, 16, 16], "texture": "#3"}
			}
		},
		{
			"from": [8, 6.76309, 11.38489],
			"to": [8.6, 7.88809, 16.55989],
			"rotation": {"angle": 22.5, "axis": "x", "origin": [8.3, 7.32559, 13.97239]},
			"faces": {
				"north": {"uv": [0, 0, 16, 16], "texture": "#3"},
				"east": {"uv": [0, 0, 16, 16], "texture": "#3"},
				"south": {"uv": [0, 0, 16, 16], "texture": "#3"},
				"west": {"uv": [0, 0, 16, 16], "texture": "#3"},
				"up": {"uv": [0, 0, 16, 16], "texture": "#3"},
				"down": {"uv": [0, 0, 16, 16], "texture": "#3"}
			}
		},
		{
			"from": [8, 8.02915, 11.48325],
			"to": [8.6, 9.16665, 16.72075],
			"rotation": {"angle": 0, "axis": "x", "origin": [8.3, 7.19165, 14.29575]},
			"faces": {
				"north": {"uv": [0, 0, 16, 16], "texture": "#3"},
				"east": {"uv": [0, 0, 16, 16], "texture": "#3"},
				"south": {"uv": [0, 0, 16, 16], "texture": "#3"},
				"west": {"uv": [0, 0, 16, 16], "texture": "#3"},
				"up": {"uv": [0, 0, 16, 16], "texture": "#3"},
				"down": {"uv": [0, 0, 16, 16], "texture": "#3"}
			}
		},
		{
			"from": [8, 5.81571, 16.14767],
			"to": [8.6, 9.16665, 16.72075],
			"rotation": {"angle": 0, "axis": "x", "origin": [8.3, 8.59165, 14.10825]},
			"faces": {
				"north": {"uv": [0, 0, 16, 16], "rotation": 180, "texture": "#3"},
				"east": {"uv": [0, 0, 16, 16], "rotation": 90, "texture": "#3"},
				"south": {"uv": [0, 0, 16, 16], "texture": "#3"},
				"west": {"uv": [0, 0, 16, 16], "rotation": 270, "texture": "#3"},
				"up": {"uv": [0, 0, 16, 16], "texture": "#3"},
				"down": {"uv": [0, 0, 16, 16], "rotation": 180, "texture": "#3"}
			}
		},
		{
			"from": [8, 7.80464, 11.15874],
			"to": [8.6, 8.87772, 11.90967],
			"rotation": {"angle": -45, "axis": "x", "origin": [8.3, 7.49118, 11.63421]},
			"faces": {
				"north": {"uv": [0, 0, 16, 16], "texture": "#3"},
				"east": {"uv": [0, 0, 16, 16], "texture": "#3"},
				"south": {"uv": [0, 0, 16, 16], "texture": "#3"},
				"west": {"uv": [0, 0, 16, 16], "texture": "#3"},
				"up": {"uv": [0, 0, 16, 16], "texture": "#3"},
				"down": {"uv": [0, 0, 16, 16], "texture": "#3"}
			}
		},
		{
			"from": [8, 7.49071, 9.42267],
			"to": [8.6, 8.24165, 10.79575],
			"rotation": {"angle": 22.5, "axis": "x", "origin": [8.3, 7.49118, 11.63421]},
			"faces": {
				"north": {"uv": [0, 0, 16, 16], "rotation": 180, "texture": "#3"},
				"east": {"uv": [0, 0, 16, 16], "rotation": 90, "texture": "#3"},
				"south": {"uv": [0, 0, 16, 16], "texture": "#3"},
				"west": {"uv": [0, 0, 16, 16], "rotation": 270, "texture": "#3"},
				"up": {"uv": [0, 0, 16, 16], "texture": "#3"},
				"down": {"uv": [0, 0, 16, 16], "rotation": 180, "texture": "#3"}
			}
		},
		{
			"from": [8, 8.29071, 8.79767],
			"to": [8.6, 9.04165, 10.17075],
			"rotation": {"angle": 0, "axis": "x", "origin": [8.3, 7.49118, 11.63421]},
			"faces": {
				"north": {"uv": [0, 0, 16, 16], "rotation": 180, "texture": "#3"},
				"east": {"uv": [0, 0, 16, 16], "rotation": 90, "texture": "#3"},
				"south": {"uv": [0, 0, 16, 16], "texture": "#3"},
				"west": {"uv": [0, 0, 16, 16], "rotation": 270, "texture": "#3"},
				"up": {"uv": [0, 0, 16, 16], "texture": "#3"},
				"down": {"uv": [0, 0, 16, 16], "rotation": 180, "texture": "#3"}
			}
		},
		{
			"from": [8, 8.76498, 9.05107],
			"to": [8.6, 9.15923, 9.66212],
			"rotation": {"angle": 22.5, "axis": "x", "origin": [8.3, 8.93711, 9.50659]},
			"faces": {
				"north": {"uv": [0, 0, 16, 16], "rotation": 180, "texture": "#3"},
				"east": {"uv": [0, 0, 16, 16], "rotation": 90, "texture": "#3"},
				"south": {"uv": [0, 0, 16, 16], "texture": "#3"},
				"west": {"uv": [0, 0, 16, 16], "rotation": 270, "texture": "#3"},
				"up": {"uv": [0, 0, 16, 16], "texture": "#3"},
				"down": {"uv": [0, 0, 16, 16], "rotation": 180, "texture": "#3"}
			}
		},
		{
			"from": [8, 8.71308, 9.38563],
			"to": [8.6, 9.10733, 9.99669],
			"rotation": {"angle": 0, "axis": "x", "origin": [8.3, 8.9602, 9.51616]},
			"faces": {
				"north": {"uv": [0, 0, 16, 16], "rotation": 180, "texture": "#3"},
				"east": {"uv": [0, 0, 16, 16], "rotation": 90, "texture": "#3"},
				"south": {"uv": [0, 0, 16, 16], "texture": "#3"},
				"west": {"uv": [0, 0, 16, 16], "rotation": 270, "texture": "#3"},
				"up": {"uv": [0, 0, 16, 16], "texture": "#3"},
				"down": {"uv": [0, 0, 16, 16], "rotation": 180, "texture": "#3"}
			}
		},
		{
			"from": [8, 8.68574, 9.87305],
			"to": [8.6, 9.08, 10.4841],
			"rotation": {"angle": 22.5, "axis": "x", "origin": [8.3, 8.78287, 10.00358]},
			"faces": {
				"north": {"uv": [0, 0, 16, 16], "rotation": 180, "texture": "#3"},
				"east": {"uv": [0, 0, 16, 16], "rotation": 90, "texture": "#3"},
				"south": {"uv": [0, 0, 16, 16], "texture": "#3"},
				"west": {"uv": [0, 0, 16, 16], "rotation": 270, "texture": "#3"},
				"up": {"uv": [0, 0, 16, 16], "texture": "#3"},
				"down": {"uv": [0, 0, 16, 16], "rotation": 180, "texture": "#3"}
			}
		},
		{
			"from": [8, 8.69071, -0.12733],
			"to": [8.6, 9.31665, 9.17075],
			"rotation": {"angle": 0, "axis": "x", "origin": [8.3, 7.49118, 11.63421]},
			"faces": {
				"north": {"uv": [0, 0, 16, 16], "rotation": 180, "texture": "#3"},
				"east": {"uv": [0, 0, 16, 16], "rotation": 90, "texture": "#3"},
				"south": {"uv": [0, 0, 16, 16], "texture": "#3"},
				"west": {"uv": [0, 0, 16, 16], "rotation": 270, "texture": "#3"},
				"up": {"uv": [0, 0, 16, 16], "texture": "#3"},
				"down": {"uv": [0, 0, 16, 16], "rotation": 180, "texture": "#3"}
			}
		},
		{
			"from": [8, 8.29071, 6.67267],
			"to": [8.6, 8.71665, 9.17075],
			"rotation": {"angle": 0, "axis": "x", "origin": [8.3, 7.49118, 11.63421]},
			"faces": {
				"north": {"uv": [0, 0, 16, 16], "rotation": 180, "texture": "#3"},
				"east": {"uv": [0, 0, 16, 16], "rotation": 90, "texture": "#3"},
				"south": {"uv": [0, 0, 16, 16], "texture": "#3"},
				"west": {"uv": [0, 0, 16, 16], "rotation": 270, "texture": "#3"},
				"up": {"uv": [0, 0, 16, 16], "texture": "#3"},
				"down": {"uv": [0, 0, 16, 16], "rotation": 180, "texture": "#3"}
			}
		},
		{
			"from": [8, 8.39071, 3.97267],
			"to": [8.6, 8.81665, 6.47075],
			"rotation": {"angle": 0, "axis": "x", "origin": [8.3, 7.49118, 11.63421]},
			"faces": {
				"north": {"uv": [0, 0, 16, 16], "rotation": 180, "texture": "#3"},
				"east": {"uv": [0, 0, 16, 16], "rotation": 90, "texture": "#3"},
				"south": {"uv": [0, 0, 16, 16], "texture": "#3"},
				"west": {"uv": [0, 0, 16, 16], "rotation": 270, "texture": "#3"},
				"up": {"uv": [0, 0, 16, 16], "texture": "#3"},
				"down": {"uv": [0, 0, 16, 16], "rotation": 180, "texture": "#3"}
			}
		},
		{
			"from": [8, 8.49071, 1.24767],
			"to": [8.6, 8.91665, 3.74575],
			"rotation": {"angle": 0, "axis": "x", "origin": [8.3, 7.49118, 11.63421]},
			"faces": {
				"north": {"uv": [0, 0, 16, 16], "rotation": 180, "texture": "#3"},
				"east": {"uv": [0, 0, 16, 16], "rotation": 90, "texture": "#3"},
				"south": {"uv": [0, 0, 16, 16], "texture": "#3"},
				"west": {"uv": [0, 0, 16, 16], "rotation": 270, "texture": "#3"},
				"up": {"uv": [0, 0, 16, 16], "texture": "#3"},
				"down": {"uv": [0, 0, 16, 16], "rotation": 180, "texture": "#3"}
			}
		},
		{
			"from": [8, 8.64071, -0.12733],
			"to": [8.6, 9.01665, 0.92075],
			"rotation": {"angle": 0, "axis": "x", "origin": [8.3, 7.49118, 11.63421]},
			"faces": {
				"north": {"uv": [0, 0, 16, 16], "rotation": 180, "texture": "#3"},
				"east": {"uv": [0, 0, 16, 16], "rotation": 90, "texture": "#3"},
				"south": {"uv": [0, 0, 16, 16], "texture": "#3"},
				"west": {"uv": [0, 0, 16, 16], "rotation": 270, "texture": "#3"},
				"up": {"uv": [0, 0, 16, 16], "texture": "#3"},
				"down": {"uv": [0, 0, 16, 16], "rotation": 180, "texture": "#3"}
			}
		},
		{
			"from": [8, 8.62721, 0.83646],
			"to": [8.6, 9.05314, 1.35954],
			"rotation": {"angle": 22.5, "axis": "x", "origin": [8.3, 8.84017, 0.9605]},
			"faces": {
				"north": {"uv": [0, 0, 16, 16], "rotation": 180, "texture": "#3"},
				"east": {"uv": [0, 0, 16, 16], "rotation": 90, "texture": "#3"},
				"south": {"uv": [0, 0, 16, 16], "texture": "#3"},
				"west": {"uv": [0, 0, 16, 16], "rotation": 270, "texture": "#3"},
				"up": {"uv": [0, 0, 16, 16], "texture": "#3"},
				"down": {"uv": [0, 0, 16, 16], "rotation": 180, "texture": "#3"}
			}
		},
		{
			"from": [8, 9.41262, 6.45747],
			"to": [8.6, 9.83855, 6.98055],
			"rotation": {"angle": 22.5, "axis": "x", "origin": [8.3, 9.62558, 4.00651]},
			"faces": {
				"north": {"uv": [0, 0, 16, 16], "rotation": 180, "texture": "#3"},
				"east": {"uv": [0, 0, 16, 16], "rotation": 90, "texture": "#3"},
				"south": {"uv": [0, 0, 16, 16], "texture": "#3"},
				"west": {"uv": [0, 0, 16, 16], "rotation": 270, "texture": "#3"},
				"up": {"uv": [0, 0, 16, 16], "texture": "#3"},
				"down": {"uv": [0, 0, 16, 16], "rotation": 180, "texture": "#3"}
			}
		},
		{
			"from": [8, 9.18734, 3.69277],
			"to": [8.6, 9.61327, 4.21585],
			"rotation": {"angle": 22.5, "axis": "x", "origin": [8.3, 9.4003, 2.09181]},
			"faces": {
				"north": {"uv": [0, 0, 16, 16], "rotation": 180, "texture": "#3"},
				"east": {"uv": [0, 0, 16, 16], "rotation": 90, "texture": "#3"},
				"south": {"uv": [0, 0, 16, 16], "texture": "#3"},
				"west": {"uv": [0, 0, 16, 16], "rotation": 270, "texture": "#3"},
				"up": {"uv": [0, 0, 16, 16], "texture": "#3"},
				"down": {"uv": [0, 0, 16, 16], "rotation": 180, "texture": "#3"}
			}
		},
		{
			"from": [8, 7.59071, 9.68881],
			"to": [8.6, 8.36358, 11.14575],
			"rotation": {"angle": 22.5, "axis": "x", "origin": [8.3, 7.49118, 11.63421]},
			"faces": {
				"north": {"uv": [0, 0, 16, 16], "rotation": 180, "texture": "#3"},
				"east": {"uv": [0, 0, 16, 16], "rotation": 90, "texture": "#3"},
				"south": {"uv": [0, 0, 16, 16], "texture": "#3"},
				"west": {"uv": [0, 0, 16, 16], "rotation": 270, "texture": "#3"},
				"up": {"uv": [0, 0, 16, 16], "texture": "#3"},
				"down": {"uv": [0, 0, 16, 16], "rotation": 180, "texture": "#3"}
			}
		},
		{
			"from": [8, 7.07964, 10.98374],
			"to": [8.6, 8.47772, 11.90967],
			"rotation": {"angle": -22.5, "axis": "x", "origin": [8.3, 7.49118, 11.63421]},
			"faces": {
				"north": {"uv": [0, 0, 16, 16], "texture": "#3"},
				"east": {"uv": [0, 0, 16, 16], "texture": "#3"},
				"south": {"uv": [0, 0, 16, 16], "texture": "#3"},
				"west": {"uv": [0, 0, 16, 16], "texture": "#3"},
				"up": {"uv": [0, 0, 16, 16], "texture": "#3"},
				"down": {"uv": [0, 0, 16, 16], "texture": "#3"}
			}
		},
		{
			"from": [8, 7.60102, 10.8412],
			"to": [8.6, 9.11826, 11.81837],
			"rotation": {"angle": -22.5, "axis": "x", "origin": [8.3, 8.30006, 11.52917]},
			"faces": {
				"north": {"uv": [0, 0, 16, 16], "texture": "#3"},
				"east": {"uv": [0, 0, 16, 16], "texture": "#3"},
				"south": {"uv": [0, 0, 16, 16], "texture": "#3"},
				"west": {"uv": [0, 0, 16, 16], "texture": "#3"},
				"up": {"uv": [0, 0, 16, 16], "texture": "#3"},
				"down": {"uv": [0, 0, 16, 16], "texture": "#3"}
			}
		},
		{
			"from": [8.175, 9.3, 4.875],
			"to": [8.425, 9.65, 9.275],
			"rotation": {"angle": 0, "axis": "y", "origin": [7.8, 1.4, -2.2]},
			"faces": {
				"north": {"uv": [0, 0, 0.25, 0.35], "texture": "#0"},
				"east": {"uv": [0, 0, 4.4, 0.35], "texture": "#0"},
				"south": {"uv": [0, 0, 0.25, 0.35], "texture": "#0"},
				"west": {"uv": [0, 0, 4.4, 0.35], "texture": "#0"},
				"up": {"uv": [0, 0, 0.25, 4.4], "texture": "#0"},
				"down": {"uv": [0, 0, 0.25, 4.4], "texture": "#0"}
			}
		},
		{
			"from": [8.175, 9.3, 9.25],
			"to": [8.425, 9.525, 9.675],
			"rotation": {"angle": 0, "axis": "y", "origin": [7.8, 1.4, -2.2]},
			"faces": {
				"north": {"uv": [0, 0, 0.25, 0.225], "texture": "#0"},
				"east": {"uv": [0, 0, 0.425, 0.225], "texture": "#0"},
				"south": {"uv": [0, 0, 0.25, 0.225], "texture": "#0"},
				"west": {"uv": [0, 0, 0.425, 0.225], "texture": "#0"},
				"up": {"uv": [0, 0, 0.25, 0.425], "texture": "#0"},
				"down": {"uv": [0, 0, 0.25, 0.425], "texture": "#0"}
			}
		},
		{
			"from": [8.175, 9.35224, 9.21577],
			"to": [8.425, 9.57724, 9.54077],
			"rotation": {"angle": 22.5, "axis": "x", "origin": [8.3, 9.46474, 9.42827]},
			"faces": {
				"north": {"uv": [0, 0, 0.25, 0.225], "texture": "#0"},
				"east": {"uv": [0, 0, 0.325, 0.225], "texture": "#0"},
				"south": {"uv": [0, 0, 0.25, 0.225], "texture": "#0"},
				"west": {"uv": [0, 0, 0.325, 0.225], "texture": "#0"},
				"up": {"uv": [0, 0, 0.25, 0.325], "texture": "#0"},
				"down": {"uv": [0, 0, 0.25, 0.325], "texture": "#0"}
			}
		},
		{
			"from": [8.175, 9.20063, 2.62474],
			"to": [8.425, 9.55063, 3.64974],
			"rotation": {"angle": 0, "axis": "y", "origin": [7.8, 1.27563, -3.52526]},
			"faces": {
				"north": {"uv": [0, 0, 0.25, 0.35], "texture": "#0"},
				"east": {"uv": [0, 0, 1.025, 0.35], "texture": "#0"},
				"south": {"uv": [0, 0, 0.25, 0.35], "texture": "#0"},
				"west": {"uv": [0, 0, 1.025, 0.35], "texture": "#0"},
				"up": {"uv": [0, 0, 0.25, 1.025], "texture": "#0"},
				"down": {"uv": [0, 0, 0.25, 1.025], "texture": "#0"}
			}
		},
		{
			"from": [8.175, 9.15063, 1.52474],
			"to": [8.425, 9.50063, 2.54974],
			"rotation": {"angle": 0, "axis": "y", "origin": [7.8, 1.27563, -3.52526]},
			"faces": {
				"north": {"uv": [0, 0, 0.25, 0.35], "texture": "#0"},
				"east": {"uv": [0, 0, 1.025, 0.35], "texture": "#0"},
				"south": {"uv": [0, 0, 0.25, 0.35], "texture": "#0"},
				"west": {"uv": [0, 0, 1.025, 0.35], "texture": "#0"},
				"up": {"uv": [0, 0, 0.25, 1.025], "texture": "#0"},
				"down": {"uv": [0, 0, 0.25, 1.025], "texture": "#0"}
			}
		},
		{
			"from": [8.175, 9.20063, -0.67526],
			"to": [8.425, 9.45063, 0.74974],
			"rotation": {"angle": 0, "axis": "y", "origin": [7.8, 1.27563, -3.52526]},
			"faces": {
				"north": {"uv": [0, 0, 0.25, 0.25], "texture": "#0"},
				"east": {"uv": [0, 0, 1.425, 0.25], "texture": "#0"},
				"south": {"uv": [0, 0, 0.25, 0.25], "texture": "#0"},
				"west": {"uv": [0, 0, 1.425, 0.25], "texture": "#0"},
				"up": {"uv": [0, 0, 0.25, 1.425], "texture": "#0"},
				"down": {"uv": [0, 0, 0.25, 1.425], "texture": "#0"}
			}
		},
		{
			"from": [8.175, 9.22563, 0.07474],
			"to": [8.425, 9.47563, 1.49974],
			"rotation": {"angle": 0, "axis": "y", "origin": [7.8, 1.27563, -3.52526]},
			"faces": {
				"north": {"uv": [0, 0, 0.25, 0.25], "texture": "#0"},
				"east": {"uv": [0, 0, 1.425, 0.25], "texture": "#0"},
				"south": {"uv": [0, 0, 0.25, 0.25], "texture": "#0"},
				"west": {"uv": [0, 0, 1.425, 0.25], "texture": "#0"},
				"up": {"uv": [0, 0, 0.25, 1.425], "texture": "#0"},
				"down": {"uv": [0, 0, 0.25, 1.425], "texture": "#0"}
			}
		},
		{
			"from": [8.175, 9.25, 3.75],
			"to": [8.425, 9.6, 4.775],
			"rotation": {"angle": 0, "axis": "y", "origin": [7.8, 1.4, -2.2]},
			"faces": {
				"north": {"uv": [0, 0, 0.25, 0.35], "texture": "#0"},
				"east": {"uv": [0, 0, 1.025, 0.35], "texture": "#0"},
				"south": {"uv": [0, 0, 0.25, 0.35], "texture": "#0"},
				"west": {"uv": [0, 0, 1.025, 0.35], "texture": "#0"},
				"up": {"uv": [0, 0, 0.25, 1.025], "texture": "#0"},
				"down": {"uv": [0, 0, 0.25, 1.025], "texture": "#0"}
			}
		},
		{
			"from": [8.175, 8.92107, 4.69499],
			"to": [8.425, 9.27107, 5.01999],
			"rotation": {"angle": -22.5, "axis": "x", "origin": [8.3, 9.09607, 3.99499]},
			"faces": {
				"north": {"uv": [0, 0, 0.25, 0.35], "texture": "#0"},
				"east": {"uv": [0, 0, 0.325, 0.35], "texture": "#0"},
				"south": {"uv": [0, 0, 0.25, 0.35], "texture": "#0"},
				"west": {"uv": [0, 0, 0.325, 0.35], "texture": "#0"},
				"up": {"uv": [0, 0, 0.25, 0.325], "texture": "#0"},
				"down": {"uv": [0, 0, 0.25, 0.325], "texture": "#0"}
			}
		},
		{
			"from": [8.175, 8.87107, 3.56999],
			"to": [8.425, 9.22107, 3.89499],
			"rotation": {"angle": -22.5, "axis": "x", "origin": [8.3, 9.04607, 2.86999]},
			"faces": {
				"north": {"uv": [0, 0, 0.25, 0.35], "texture": "#0"},
				"east": {"uv": [0, 0, 0.325, 0.35], "texture": "#0"},
				"south": {"uv": [0, 0, 0.25, 0.35], "texture": "#0"},
				"west": {"uv": [0, 0, 0.325, 0.35], "texture": "#0"},
				"up": {"uv": [0, 0, 0.25, 0.325], "texture": "#0"},
				"down": {"uv": [0, 0, 0.25, 0.325], "texture": "#0"}
			}
		},
		{
			"from": [8.175, 9.33102, 1.55255],
			"to": [8.425, 9.53102, 1.72755],
			"rotation": {"angle": -22.5, "axis": "x", "origin": [8.3, 9.00602, 1.70255]},
			"faces": {
				"north": {"uv": [0, 0, 0.25, 0.2], "texture": "#0"},
				"east": {"uv": [0, 0, 0.175, 0.2], "texture": "#0"},
				"south": {"uv": [0, 0, 0.25, 0.2], "texture": "#0"},
				"west": {"uv": [0, 0, 0.175, 0.2], "texture": "#0"},
				"up": {"uv": [0, 0, 0.25, 0.175], "texture": "#0"},
				"down": {"uv": [0, 0, 0.25, 0.175], "texture": "#0"}
			}
		},
		{
			"from": [8.175, 9.30602, 0.10255],
			"to": [8.425, 9.50602, 0.27755],
			"rotation": {"angle": -22.5, "axis": "x", "origin": [8.3, 8.98102, 0.25255]},
			"faces": {
				"north": {"uv": [0, 0, 0.25, 0.2], "texture": "#0"},
				"east": {"uv": [0, 0, 0.175, 0.2], "texture": "#0"},
				"south": {"uv": [0, 0, 0.25, 0.2], "texture": "#0"},
				"west": {"uv": [0, 0, 0.175, 0.2], "texture": "#0"},
				"up": {"uv": [0, 0, 0.25, 0.175], "texture": "#0"},
				"down": {"uv": [0, 0, 0.25, 0.175], "texture": "#0"}
			}
		},
		{
			"from": [8.175, 9.28102, -0.79745],
			"to": [8.425, 9.48102, -0.47245],
			"rotation": {"angle": -22.5, "axis": "x", "origin": [8.3, 8.95602, -0.49745]},
			"faces": {
				"north": {"uv": [0, 0, 0.25, 0.2], "texture": "#0"},
				"east": {"uv": [0, 0, 0.325, 0.2], "texture": "#0"},
				"south": {"uv": [0, 0, 0.25, 0.2], "texture": "#0"},
				"west": {"uv": [0, 0, 0.325, 0.2], "texture": "#0"},
				"up": {"uv": [0, 0, 0.25, 0.325], "texture": "#0"},
				"down": {"uv": [0, 0, 0.25, 0.325], "texture": "#0"}
			}
		},
		{
			"from": [8.175, 9.38102, 2.50255],
			"to": [8.425, 9.58102, 2.82755],
			"rotation": {"angle": -22.5, "axis": "x", "origin": [8.3, 9.05602, 2.80255]},
			"faces": {
				"north": {"uv": [0, 0, 0.25, 0.2], "texture": "#0"},
				"east": {"uv": [0, 0, 0.325, 0.2], "texture": "#0"},
				"south": {"uv": [0, 0, 0.25, 0.2], "texture": "#0"},
				"west": {"uv": [0, 0, 0.325, 0.2], "texture": "#0"},
				"up": {"uv": [0, 0, 0.25, 0.325], "texture": "#0"},
				"down": {"uv": [0, 0, 0.25, 0.325], "texture": "#0"}
			}
		},
		{
			"from": [8.175, 9.15, -5.5],
			"to": [8.425, 9.4, 9.675],
			"rotation": {"angle": 0, "axis": "y", "origin": [7.8, 1.4, -2.2]},
			"faces": {
				"north": {"uv": [0, 0, 0.25, 0.25], "texture": "#0"},
				"east": {"uv": [0, 0, 15.175, 0.25], "texture": "#0"},
				"south": {"uv": [0, 0, 0.25, 0.25], "texture": "#0"},
				"west": {"uv": [0, 0, 15.175, 0.25], "texture": "#0"},
				"up": {"uv": [0, 0, 0.25, 15.175], "texture": "#0"},
				"down": {"uv": [0, 0, 0.25, 15.175], "texture": "#0"}
			}
		},
		{
			"from": [7.975, 9.75, 6.1],
			"to": [8.625, 9.875, 9],
			"rotation": {"angle": 0, "axis": "y", "origin": [7.8, 1.4, -2.2]},
			"faces": {
				"north": {"uv": [0, 0, 0.65, 0.125], "texture": "#0"},
				"east": {"uv": [0, 0, 2.9, 0.125], "texture": "#0"},
				"south": {"uv": [0, 0, 0.65, 0.125], "texture": "#0"},
				"west": {"uv": [0, 0, 2.9, 0.125], "texture": "#0"},
				"up": {"uv": [0, 0, 0.65, 2.9], "texture": "#0"},
				"down": {"uv": [0, 0, 0.65, 2.9], "texture": "#0"}
			}
		},
		{
			"from": [8.05, 9.625, 6.275],
			"to": [8.55, 9.75, 6.975],
			"rotation": {"angle": 0, "axis": "y", "origin": [7.8, 1.4, -2.2]},
			"faces": {
				"north": {"uv": [0, 0, 0.5, 0.125], "texture": "#0"},
				"east": {"uv": [0, 0, 0.7, 0.125], "texture": "#0"},
				"south": {"uv": [0, 0, 0.5, 0.125], "texture": "#0"},
				"west": {"uv": [0, 0, 0.7, 0.125], "texture": "#0"},
				"up": {"uv": [0, 0, 0.5, 0.7], "texture": "#0"},
				"down": {"uv": [0, 0, 0.5, 0.7], "texture": "#0"}
			}
		},
		{
			"from": [8.075, 9.625, 8.325],
			"to": [8.525, 10.725, 8.525],
			"rotation": {"angle": 0, "axis": "x", "origin": [8.3, 9.6875, 8.4625]},
			"faces": {
				"north": {"uv": [0, 0, 0.45, 1.1], "rotation": 180, "texture": "#0"},
				"east": {"uv": [0, 0, 1.1, 0.2], "rotation": 90, "texture": "#0"},
				"south": {"uv": [0, 0, 0.45, 1.1], "texture": "#0"},
				"west": {"uv": [0, 0, 1.1, 0.2], "rotation": 270, "texture": "#0"},
				"up": {"uv": [0, 0, 0.45, 0.2], "texture": "#0"},
				"down": {"uv": [0, 0, 0.45, 0.2], "rotation": 180, "texture": "#0"}
			}
		},
		{
			"from": [8.05, 9.625, 8.15],
			"to": [8.55, 9.825, 8.75],
			"rotation": {"angle": 0, "axis": "x", "origin": [8.3, 9.6875, 8.4625]},
			"faces": {
				"north": {"uv": [0, 0, 0.5, 0.2], "texture": "#0"},
				"east": {"uv": [0, 0, 0.6, 0.2], "texture": "#0"},
				"south": {"uv": [0, 0, 0.5, 0.2], "texture": "#0"},
				"west": {"uv": [0, 0, 0.6, 0.2], "texture": "#0"},
				"up": {"uv": [0, 0, 0.5, 0.6], "texture": "#0"},
				"down": {"uv": [0, 0, 0.5, 0.6], "texture": "#0"}
			}
		},
		{
			"from": [8.075, 9.625, 6.4],
			"to": [8.525, 10.725, 6.6],
			"rotation": {"angle": 0, "axis": "x", "origin": [8.3, 9.6875, 8.4625]},
			"faces": {
				"north": {"uv": [0, 0, 0.45, 1.1], "rotation": 180, "texture": "#0"},
				"east": {"uv": [0, 0, 1.1, 0.2], "rotation": 90, "texture": "#0"},
				"south": {"uv": [0, 0, 0.45, 1.1], "texture": "#0"},
				"west": {"uv": [0, 0, 1.1, 0.2], "rotation": 270, "texture": "#0"},
				"up": {"uv": [0, 0, 0.45, 0.2], "texture": "#0"},
				"down": {"uv": [0, 0, 0.45, 0.2], "rotation": 180, "texture": "#0"}
			}
		},
		{
			"from": [7.85, 9.93548, 3.89187],
			"to": [8.75, 10.83548, 5.14187],
			"rotation": {"angle": 0, "axis": "y", "origin": [7.8, 1.41048, -2.20813]},
			"faces": {
				"north": {"uv": [0, 0, 0.9, 0.9], "texture": "#1"},
				"east": {"uv": [0, 0, 1.25, 0.9], "texture": "#1"},
				"south": {"uv": [0, 0, 0.9, 0.9], "texture": "#1"},
				"west": {"uv": [0, 0, 1.25, 0.9], "texture": "#1"},
				"up": {"uv": [0, 0, 0.9, 1.25], "texture": "#1"},
				"down": {"uv": [0, 0, 0.9, 1.25], "texture": "#1"}
			}
		},
		{
			"from": [7.9, 9.98548, 4.89187],
			"to": [8.7, 10.78548, 5.39187],
			"rotation": {"angle": 0, "axis": "y", "origin": [7.8, 1.41048, -2.20813]},
			"faces": {
				"north": {"uv": [0, 0, 0.8, 0.8], "texture": "#1"},
				"east": {"uv": [0, 0, 0.5, 0.8], "texture": "#1"},
				"south": {"uv": [0, 0, 0.8, 0.8], "texture": "#1"},
				"west": {"uv": [0, 0, 0.5, 0.8], "texture": "#1"},
				"up": {"uv": [0, 0, 0.8, 0.5], "texture": "#1"},
				"down": {"uv": [0, 0, 0.8, 0.5], "texture": "#1"}
			}
		},
		{
			"from": [7.95, 10.03548, 5.21687],
			"to": [8.65, 10.73548, 5.59187],
			"rotation": {"angle": 0, "axis": "y", "origin": [7.8, 1.41048, -2.20813]},
			"faces": {
				"north": {"uv": [0, 0, 0.7, 0.7], "texture": "#1"},
				"east": {"uv": [0, 0, 0.375, 0.7], "texture": "#1"},
				"south": {"uv": [0, 0, 0.7, 0.7], "texture": "#1"},
				"west": {"uv": [0, 0, 0.375, 0.7], "texture": "#1"},
				"up": {"uv": [0, 0, 0.7, 0.375], "texture": "#1"},
				"down": {"uv": [0, 0, 0.7, 0.375], "texture": "#1"}
			}
		},
		{
			"from": [8, 10.08548, 5.21687],
			"to": [8.6, 10.68548, 5.81687],
			"rotation": {"angle": 0, "axis": "y", "origin": [7.8, 1.41048, -2.20813]},
			"faces": {
				"north": {"uv": [0, 0, 0.6, 0.6], "texture": "#1"},
				"east": {"uv": [0, 0, 0.6, 0.6], "texture": "#1"},
				"south": {"uv": [0, 0, 0.6, 0.6], "texture": "#1"},
				"west": {"uv": [0, 0, 0.6, 0.6], "texture": "#1"},
				"up": {"uv": [0, 0, 0.6, 0.6], "texture": "#1"},
				"down": {"uv": [0, 0, 0.6, 0.6], "texture": "#1"}
			}
		},
		{
			"from": [8.1, 10.2, 5.8],
			"to": [8.5, 10.6, 9.275],
			"rotation": {"angle": 0, "axis": "y", "origin": [7.8, 1.4, -2.2]},
			"faces": {
				"north": {"uv": [0, 0, 0.4, 0.4], "texture": "#1"},
				"east": {"uv": [0, 0, 3.475, 0.4], "texture": "#1"},
				"south": {"uv": [0, 0, 0.4, 0.4], "texture": "#1"},
				"west": {"uv": [0, 0, 3.475, 0.4], "texture": "#1"},
				"up": {"uv": [0, 0, 0.4, 3.475], "texture": "#1"},
				"down": {"uv": [0, 0, 0.4, 3.475], "texture": "#1"}
			}
		},
		{
			"from": [8.075, 10.175, 5.8],
			"to": [8.525, 10.625, 5.975],
			"rotation": {"angle": 0, "axis": "y", "origin": [7.8, 1.4, -2.2]},
			"faces": {
				"north": {"uv": [0, 0, 0.45, 0.45], "texture": "#1"},
				"east": {"uv": [0, 0, 0.175, 0.45], "texture": "#1"},
				"south": {"uv": [0, 0, 0.45, 0.45], "texture": "#1"},
				"west": {"uv": [0, 0, 0.175, 0.45], "texture": "#1"},
				"up": {"uv": [0, 0, 0.45, 0.175], "texture": "#1"},
				"down": {"uv": [0, 0, 0.45, 0.175], "texture": "#1"}
			}
		},
		{
			"from": [8.15, 10.275, 7.225],
			"to": [8.45, 11.05, 7.625],
			"rotation": {"angle": 0, "axis": "y", "origin": [7.8, 1.4, -2.2]},
			"faces": {
				"north": {"uv": [0, 0, 0.3, 0.775], "texture": "#1"},
				"east": {"uv": [0, 0, 0.4, 0.775], "texture": "#1"},
				"south": {"uv": [0, 0, 0.3, 0.775], "texture": "#1"},
				"west": {"uv": [0, 0, 0.4, 0.775], "texture": "#1"},
				"up": {"uv": [0, 0, 0.3, 0.4], "texture": "#1"},
				"down": {"uv": [0, 0, 0.3, 0.4], "texture": "#1"}
			}
		},
		{
			"from": [8.15, 10.4, 7.3],
			"to": [8.45, 11.175, 7.55],
			"rotation": {"angle": 0, "axis": "y", "origin": [7.8, 1.4, -2.2]},
			"faces": {
				"north": {"uv": [0, 0, 0.3, 0.775], "texture": "#1"},
				"east": {"uv": [0, 0, 0.25, 0.775], "texture": "#1"},
				"south": {"uv": [0, 0, 0.3, 0.775], "texture": "#1"},
				"west": {"uv": [0, 0, 0.25, 0.775], "texture": "#1"},
				"up": {"uv": [0, 0, 0.3, 0.25], "texture": "#1"},
				"down": {"uv": [0, 0, 0.3, 0.25], "texture": "#1"}
			}
		},
		{
			"from": [7.925, 10.05, 10.525],
			"to": [8.675, 10.8, 11.025],
			"rotation": {"angle": 0, "axis": "y", "origin": [7.8, 1.4, -2.2]},
			"faces": {
				"north": {"uv": [0, 0, 0.75, 0.75], "texture": "#1"},
				"east": {"uv": [0, 0, 0.5, 0.75], "texture": "#1"},
				"south": {"uv": [0, 0, 0.75, 0.75], "texture": "#1"},
				"west": {"uv": [0, 0, 0.5, 0.75], "texture": "#1"},
				"up": {"uv": [0, 0, 0.75, 0.5], "texture": "#1"},
				"down": {"uv": [0, 0, 0.75, 0.5], "texture": "#1"}
			}
		},
		{
			"from": [7.95, 10.075, 9.825],
			"to": [8.65, 10.775, 10.6],
			"rotation": {"angle": 0, "axis": "y", "origin": [7.8, 1.4, -2.2]},
			"faces": {
				"north": {"uv": [0, 0, 0.7, 0.7], "texture": "#1"},
				"east": {"uv": [0, 0, 0.775, 0.7], "texture": "#1"},
				"south": {"uv": [0, 0, 0.7, 0.7], "texture": "#1"},
				"west": {"uv": [0, 0, 0.775, 0.7], "texture": "#1"},
				"up": {"uv": [0, 0, 0.7, 0.775], "texture": "#1"},
				"down": {"uv": [0, 0, 0.7, 0.775], "texture": "#1"}
			}
		},
		{
			"from": [8, 10.125, 9.275],
			"to": [8.6, 10.725, 10.05],
			"rotation": {"angle": 0, "axis": "y", "origin": [7.8, 1.4, -2.2]},
			"faces": {
				"north": {"uv": [0, 0, 0.6, 0.6], "texture": "#1"},
				"east": {"uv": [0, 0, 0.775, 0.6], "texture": "#1"},
				"south": {"uv": [0, 0, 0.6, 0.6], "texture": "#1"},
				"west": {"uv": [0, 0, 0.775, 0.6], "texture": "#1"},
				"up": {"uv": [0, 0, 0.6, 0.775], "texture": "#1"},
				"down": {"uv": [0, 0, 0.6, 0.775], "texture": "#1"}
			}
		},
		{
			"from": [8.1, 7.8, 8.125],
			"to": [8.5, 8.3, 8.225],
			"rotation": {"angle": 0, "axis": "y", "origin": [7.8, 1.4, -2.2]},
			"faces": {
				"north": {"uv": [0, 0, 16, 16], "texture": "#2"},
				"east": {"uv": [0, 0, 16, 16], "texture": "#2"},
				"south": {"uv": [0, 0, 16, 16], "texture": "#2"},
				"west": {"uv": [0, 0, 16, 16], "texture": "#2"},
				"up": {"uv": [0, 0, 16, 16], "texture": "#2"},
				"down": {"uv": [0, 0, 16, 16], "texture": "#2"}
			}
		},
		{
			"from": [8.1, 8.075, 8.125],
			"to": [8.5, 8.325, 8.225],
			"rotation": {"angle": 22.5, "axis": "x", "origin": [8.3, 8.05, 8.175]},
			"faces": {
				"north": {"uv": [0, 0, 16, 16], "texture": "#2"},
				"east": {"uv": [0, 0, 16, 16], "texture": "#2"},
				"south": {"uv": [0, 0, 16, 16], "texture": "#2"},
				"west": {"uv": [0, 0, 16, 16], "texture": "#2"},
				"up": {"uv": [0, 0, 16, 16], "texture": "#2"},
				"down": {"uv": [0, 0, 16, 16], "texture": "#2"}
			}
		},
		{
			"from": [8.1, 8.05, 8.2],
			"to": [8.5, 8.125, 8.525],
			"rotation": {"angle": -45, "axis": "x", "origin": [8.3, 8.05, 8.175]},
			"faces": {
				"north": {"uv": [0, 0, 16, 16], "rotation": 180, "texture": "#2"},
				"east": {"uv": [0, 0, 16, 16], "rotation": 270, "texture": "#2"},
				"south": {"uv": [0, 0, 16, 16], "texture": "#2"},
				"west": {"uv": [0, 0, 16, 16], "rotation": 90, "texture": "#2"},
				"up": {"uv": [0, 0, 16, 16], "rotation": 180, "texture": "#2"},
				"down": {"uv": [0, 0, 16, 16], "texture": "#2"}
			}
		},
		{
			"from": [8.1, 7.4455, 8.2623],
			"to": [8.5, 7.52599, 8.58407],
			"rotation": {"angle": 45, "axis": "x", "origin": [8.3, 7.78849, 8.62157]},
			"faces": {
				"north": {"uv": [0, 0, 16, 16], "rotation": 180, "texture": "#2"},
				"east": {"uv": [0, 0, 16, 16], "rotation": 270, "texture": "#2"},
				"south": {"uv": [0, 0, 16, 16], "texture": "#2"},
				"west": {"uv": [0, 0, 16, 16], "rotation": 90, "texture": "#2"},
				"up": {"uv": [0, 0, 16, 16], "rotation": 180, "texture": "#2"},
				"down": {"uv": [0, 0, 16, 16], "texture": "#2"}
			}
		},
		{
			"from": [8.1, 7.48871, 8.35187],
			"to": [8.5, 7.5692, 8.47364],
			"rotation": {"angle": 22.5, "axis": "x", "origin": [8.3, 7.52895, 8.56276]},
			"faces": {
				"north": {"uv": [0, 0, 16, 16], "rotation": 180, "texture": "#2"},
				"east": {"uv": [0, 0, 16, 16], "rotation": 270, "texture": "#2"},
				"south": {"uv": [0, 0, 16, 16], "texture": "#2"},
				"west": {"uv": [0, 0, 16, 16], "rotation": 90, "texture": "#2"},
				"up": {"uv": [0, 0, 16, 16], "rotation": 180, "texture": "#2"},
				"down": {"uv": [0, 0, 16, 16], "texture": "#2"}
			}
		},
		{
			"from": [8.1, 7.60352, 8.98034],
			"to": [8.5, 7.684, 9.1021],
			"rotation": {"angle": -22.5, "axis": "x", "origin": [8.3, 7.64376, 9.19122]},
			"faces": {
				"north": {"uv": [0, 0, 16, 16], "rotation": 180, "texture": "#2"},
				"east": {"uv": [0, 0, 16, 16], "rotation": 270, "texture": "#2"},
				"south": {"uv": [0, 0, 16, 16], "texture": "#2"},
				"west": {"uv": [0, 0, 16, 16], "rotation": 90, "texture": "#2"},
				"up": {"uv": [0, 0, 16, 16], "rotation": 180, "texture": "#2"},
				"down": {"uv": [0, 0, 16, 16], "texture": "#2"}
			}
		},
		{
			"from": [8.1, 7.94785, 9.30328],
			"to": [8.5, 8.29462, 9.43377],
			"rotation": {"angle": 0, "axis": "x", "origin": [8.3, 8.15874, 9.39352]},
			"faces": {
				"north": {"uv": [0, 0, 16, 16], "texture": "#2"},
				"east": {"uv": [0, 0, 16, 16], "texture": "#2"},
				"south": {"uv": [0, 0, 16, 16], "texture": "#2"},
				"west": {"uv": [0, 0, 16, 16], "texture": "#2"},
				"up": {"uv": [0, 0, 16, 16], "texture": "#2"},
				"down": {"uv": [0, 0, 16, 16], "texture": "#2"}
			}
		},
		{
			"from": [8.1, 7.9164, 9.22564],
			"to": [8.5, 8.23817, 9.35613],
			"rotation": {"angle": -22.5, "axis": "x", "origin": [8.3, 8.12728, 9.31588]},
			"faces": {
				"north": {"uv": [0, 0, 16, 16], "texture": "#2"},
				"east": {"uv": [0, 0, 16, 16], "texture": "#2"},
				"south": {"uv": [0, 0, 16, 16], "texture": "#2"},
				"west": {"uv": [0, 0, 16, 16], "texture": "#2"},
				"up": {"uv": [0, 0, 16, 16], "texture": "#2"},
				"down": {"uv": [0, 0, 16, 16], "texture": "#2"}
			}
		},
		{
			"from": [8.1, 7.8501, 9.29367],
			"to": [8.5, 8.02186, 9.34915],
			"rotation": {"angle": 0, "axis": "x", "origin": [8.3, 8.01098, 9.29641]},
			"faces": {
				"north": {"uv": [0, 0, 16, 16], "texture": "#2"},
				"east": {"uv": [0, 0, 16, 16], "texture": "#2"},
				"south": {"uv": [0, 0, 16, 16], "texture": "#2"},
				"west": {"uv": [0, 0, 16, 16], "texture": "#2"},
				"up": {"uv": [0, 0, 16, 16], "texture": "#2"},
				"down": {"uv": [0, 0, 16, 16], "texture": "#2"}
			}
		},
		{
			"from": [8.1, 8.1664, 9.25064],
			"to": [8.5, 8.43817, 9.43113],
			"rotation": {"angle": -45, "axis": "x", "origin": [8.3, 8.12728, 9.31588]},
			"faces": {
				"north": {"uv": [0, 0, 16, 16], "texture": "#2"},
				"east": {"uv": [0, 0, 16, 16], "texture": "#2"},
				"south": {"uv": [0, 0, 16, 16], "texture": "#2"},
				"west": {"uv": [0, 0, 16, 16], "texture": "#2"},
				"up": {"uv": [0, 0, 16, 16], "texture": "#2"},
				"down": {"uv": [0, 0, 16, 16], "texture": "#2"}
			}
		},
		{
			"from": [8.1, 7.76696, 8.69993],
			"to": [8.5, 7.82245, 8.8217],
			"rotation": {"angle": -22.5, "axis": "x", "origin": [8.3, 7.9947, 8.93581]},
			"faces": {
				"north": {"uv": [0, 0, 16, 16], "rotation": 180, "texture": "#2"},
				"east": {"uv": [0, 0, 16, 16], "rotation": 270, "texture": "#2"},
				"south": {"uv": [0, 0, 16, 16], "texture": "#2"},
				"west": {"uv": [0, 0, 16, 16], "rotation": 90, "texture": "#2"},
				"up": {"uv": [0, 0, 16, 16], "rotation": 180, "texture": "#2"},
				"down": {"uv": [0, 0, 16, 16], "texture": "#2"}
			}
		},
		{
			"from": [8.1, 7.84071, 8.68741],
			"to": [8.5, 7.8962, 8.85918],
			"rotation": {"angle": -45, "axis": "x", "origin": [8.3, 8.06846, 8.9233]},
			"faces": {
				"north": {"uv": [0, 0, 16, 16], "rotation": 180, "texture": "#2"},
				"east": {"uv": [0, 0, 16, 16], "rotation": 270, "texture": "#2"},
				"south": {"uv": [0, 0, 16, 16], "texture": "#2"},
				"west": {"uv": [0, 0, 16, 16], "rotation": 90, "texture": "#2"},
				"up": {"uv": [0, 0, 16, 16], "rotation": 180, "texture": "#2"},
				"down": {"uv": [0, 0, 16, 16], "texture": "#2"}
			}
		},
		{
			"from": [8.1, 7.93128, 9.09111],
			"to": [8.5, 8.05305, 9.1466],
			"rotation": {"angle": 22.5, "axis": "x", "origin": [8.3, 8.16716, 8.91886]},
			"faces": {
				"north": {"uv": [0, 0, 16, 16], "texture": "#2"},
				"east": {"uv": [0, 0, 16, 16], "texture": "#2"},
				"south": {"uv": [0, 0, 16, 16], "texture": "#2"},
				"west": {"uv": [0, 0, 16, 16], "texture": "#2"},
				"up": {"uv": [0, 0, 16, 16], "texture": "#2"},
				"down": {"uv": [0, 0, 16, 16], "texture": "#2"}
			}
		},
		{
			"from": [8.1, 8.15628, 8.91611],
			"to": [8.5, 8.32805, 8.9716],
			"rotation": {"angle": -45, "axis": "x", "origin": [8.3, 8.16716, 8.91886]},
			"faces": {
				"north": {"uv": [0, 0, 16, 16], "texture": "#2"},
				"east": {"uv": [0, 0, 16, 16], "texture": "#2"},
				"south": {"uv": [0, 0, 16, 16], "texture": "#2"},
				"west": {"uv": [0, 0, 16, 16], "texture": "#2"},
				"up": {"uv": [0, 0, 16, 16], "texture": "#2"},
				"down": {"uv": [0, 0, 16, 16], "texture": "#2"}
			}
		},
		{
			"from": [8.1, 7.85225, 8.97106],
			"to": [8.5, 8.07402, 9.02655],
			"rotation": {"angle": 0, "axis": "x", "origin": [8.3, 7.96313, 9.02381]},
			"faces": {
				"north": {"uv": [0, 0, 16, 16], "texture": "#2"},
				"east": {"uv": [0, 0, 16, 16], "texture": "#2"},
				"south": {"uv": [0, 0, 16, 16], "texture": "#2"},
				"west": {"uv": [0, 0, 16, 16], "texture": "#2"},
				"up": {"uv": [0, 0, 16, 16], "texture": "#2"},
				"down": {"uv": [0, 0, 16, 16], "texture": "#2"}
			}
		},
		{
			"from": [8.1, 7.95225, 8.97106],
			"to": [8.5, 8.24902, 9.05155],
			"rotation": {"angle": 0, "axis": "x", "origin": [8.3, 7.96313, 9.02381]},
			"faces": {
				"north": {"uv": [0, 0, 16, 16], "texture": "#2"},
				"east": {"uv": [0, 0, 16, 16], "texture": "#2"},
				"south": {"uv": [0, 0, 16, 16], "texture": "#2"},
				"west": {"uv": [0, 0, 16, 16], "texture": "#2"},
				"up": {"uv": [0, 0, 16, 16], "texture": "#2"},
				"down": {"uv": [0, 0, 16, 16], "texture": "#2"}
			}
		},
		{
			"from": [8.1, 8.20225, 8.89606],
			"to": [8.5, 8.29902, 9.00155],
			"rotation": {"angle": 0, "axis": "x", "origin": [8.3, 7.96313, 9.02381]},
			"faces": {
				"north": {"uv": [0, 0, 16, 16], "texture": "#2"},
				"east": {"uv": [0, 0, 16, 16], "texture": "#2"},
				"south": {"uv": [0, 0, 16, 16], "texture": "#2"},
				"west": {"uv": [0, 0, 16, 16], "texture": "#2"},
				"up": {"uv": [0, 0, 16, 16], "texture": "#2"},
				"down": {"uv": [0, 0, 16, 16], "texture": "#2"}
			}
		},
		{
			"from": [8.1, 8.25225, 8.84606],
			"to": [8.5, 8.29902, 8.90155],
			"rotation": {"angle": 0, "axis": "x", "origin": [8.3, 7.96313, 9.02381]},
			"faces": {
				"north": {"uv": [0, 0, 16, 16], "texture": "#2"},
				"east": {"uv": [0, 0, 16, 16], "texture": "#2"},
				"south": {"uv": [0, 0, 16, 16], "texture": "#2"},
				"west": {"uv": [0, 0, 16, 16], "texture": "#2"},
				"up": {"uv": [0, 0, 16, 16], "texture": "#2"},
				"down": {"uv": [0, 0, 16, 16], "texture": "#2"}
			}
		},
		{
			"from": [8.1, 8.03576, 8.92461],
			"to": [8.5, 8.20753, 9.0301],
			"rotation": {"angle": -22.5, "axis": "x", "origin": [8.3, 8.14664, 8.97736]},
			"faces": {
				"north": {"uv": [0, 0, 16, 16], "texture": "#2"},
				"east": {"uv": [0, 0, 16, 16], "texture": "#2"},
				"south": {"uv": [0, 0, 16, 16], "texture": "#2"},
				"west": {"uv": [0, 0, 16, 16], "texture": "#2"},
				"up": {"uv": [0, 0, 16, 16], "texture": "#2"},
				"down": {"uv": [0, 0, 16, 16], "texture": "#2"}
			}
		},
		{
			"from": [8.1, 7.97458, 9.03011],
			"to": [8.5, 8.17135, 9.0856],
			"rotation": {"angle": 0, "axis": "x", "origin": [8.3, 8.21046, 8.85785]},
			"faces": {
				"north": {"uv": [0, 0, 16, 16], "texture": "#2"},
				"east": {"uv": [0, 0, 16, 16], "texture": "#2"},
				"south": {"uv": [0, 0, 16, 16], "texture": "#2"},
				"west": {"uv": [0, 0, 16, 16], "texture": "#2"},
				"up": {"uv": [0, 0, 16, 16], "texture": "#2"},
				"down": {"uv": [0, 0, 16, 16], "texture": "#2"}
			}
		},
		{
			"from": [8.1, 8.06624, 8.95718],
			"to": [8.5, 8.26301, 9.01266],
			"rotation": {"angle": -22.5, "axis": "x", "origin": [8.3, 8.30212, 8.78492]},
			"faces": {
				"north": {"uv": [0, 0, 16, 16], "texture": "#2"},
				"east": {"uv": [0, 0, 16, 16], "texture": "#2"},
				"south": {"uv": [0, 0, 16, 16], "texture": "#2"},
				"west": {"uv": [0, 0, 16, 16], "texture": "#2"},
				"up": {"uv": [0, 0, 16, 16], "texture": "#2"},
				"down": {"uv": [0, 0, 16, 16], "texture": "#2"}
			}
		},
		{
			"from": [8.1, 7.8347, 9.39045],
			"to": [8.5, 7.95647, 9.47093],
			"rotation": {"angle": 22.5, "axis": "x", "origin": [8.3, 8.04559, 9.43069]},
			"faces": {
				"north": {"uv": [0, 0, 16, 16], "texture": "#2"},
				"east": {"uv": [0, 0, 16, 16], "texture": "#2"},
				"south": {"uv": [0, 0, 16, 16], "texture": "#2"},
				"west": {"uv": [0, 0, 16, 16], "texture": "#2"},
				"up": {"uv": [0, 0, 16, 16], "texture": "#2"},
				"down": {"uv": [0, 0, 16, 16], "texture": "#2"}
			}
		},
		{
			"from": [8.1, 7.70981, 9.03407],
			"to": [8.5, 7.79029, 9.40583],
			"rotation": {"angle": -45, "axis": "x", "origin": [8.3, 7.75005, 9.24495]},
			"faces": {
				"north": {"uv": [0, 0, 16, 16], "rotation": 180, "texture": "#2"},
				"east": {"uv": [0, 0, 16, 16], "rotation": 270, "texture": "#2"},
				"south": {"uv": [0, 0, 16, 16], "texture": "#2"},
				"west": {"uv": [0, 0, 16, 16], "rotation": 90, "texture": "#2"},
				"up": {"uv": [0, 0, 16, 16], "rotation": 180, "texture": "#2"},
				"down": {"uv": [0, 0, 16, 16], "texture": "#2"}
			}
		},
		{
			"from": [8.1, 7.52588, 8.46502],
			"to": [8.5, 7.60637, 9.01179],
			"rotation": {"angle": 0, "axis": "x", "origin": [8.3, 7.49112, 8.77591]},
			"faces": {
				"north": {"uv": [0, 0, 16, 16], "rotation": 180, "texture": "#2"},
				"east": {"uv": [0, 0, 16, 16], "rotation": 270, "texture": "#2"},
				"south": {"uv": [0, 0, 16, 16], "texture": "#2"},
				"west": {"uv": [0, 0, 16, 16], "rotation": 90, "texture": "#2"},
				"up": {"uv": [0, 0, 16, 16], "rotation": 180, "texture": "#2"},
				"down": {"uv": [0, 0, 16, 16], "texture": "#2"}
			}
		},
		{
			"from": [8, 6.86795, 10.99563],
			"to": [8.6, 6.94295, 11.92156],
			"rotation": {"angle": -22.5, "axis": "x", "origin": [8.3, 7.39295, 11.29656]},
			"faces": {
				"north": {"uv": [0, 0, 0.6, 0.075], "texture": "#0"},
				"east": {"uv": [0, 0, 0.92594, 0.075], "texture": "#0"},
				"south": {"uv": [0, 0, 0.6, 0.075], "texture": "#0"},
				"west": {"uv": [0, 0, 0.92594, 0.075], "texture": "#0"},
				"up": {"uv": [0, 0, 0.6, 0.92594], "texture": "#0"},
				"down": {"uv": [0, 0, 0.6, 0.92594], "texture": "#0"}
			}
		},
		{
			"from": [8, 9.16665, 16.725],
			"to": [8.6, 5.81571, 17.19575],
			"rotation": {"angle": 0, "axis": "y", "origin": [7.8, 0.44165, -2.2]},
			"faces": {
				"north": {"uv": [0, 0, 0.6, 0], "texture": "#0"},
				"east": {"uv": [0, 0, 0.47074, 0], "texture": "#0"},
				"south": {"uv": [0, 0, 0.6, 0], "texture": "#0"},
				"west": {"uv": [0, 0, 0.47074, 0], "texture": "#0"},
				"up": {"uv": [0, 0, 0.6, 0.47074], "texture": "#0"},
				"down": {"uv": [0, 0, 0.6, 0.47074], "texture": "#0"}
			}
		},
		{
			"from": [8.05, 10.13548, 3.81687],
			"to": [8.55, 10.63548, 3.94187],
			"rotation": {"angle": 45, "axis": "z", "origin": [8.3, 10.38548, 3.87937]},
			"faces": {
				"north": {"uv": [0, 0, 16, 16], "texture": "#4"},
				"east": {"uv": [0, 0, 16, 16], "texture": "#4"},
				"south": {"uv": [0, 0, 16, 16], "texture": "#4"},
				"west": {"uv": [0, 0, 16, 16], "texture": "#4"},
				"up": {"uv": [0, 0, 16, 16], "texture": "#4"},
				"down": {"uv": [0, 0, 16, 16], "texture": "#4"}
			}
		},
		{
			"from": [8.15, 10.23548, 11.01687],
			"to": [8.45, 10.53548, 11.09187],
			"rotation": {"angle": 45, "axis": "z", "origin": [8.3, 10.38548, 3.87937]},
			"faces": {
				"north": {"uv": [0, 0, 16, 16], "texture": "#4"},
				"east": {"uv": [0, 0, 16, 16], "texture": "#4"},
				"south": {"uv": [0, 0, 16, 16], "texture": "#4"},
				"west": {"uv": [0, 0, 16, 16], "texture": "#4"},
				"up": {"uv": [0, 0, 16, 16], "texture": "#4"},
				"down": {"uv": [0, 0, 16, 16], "texture": "#4"}
			}
		}
	],
	"gui_light": "front",
	"display": {
		"firstperson_righthand": {
			"rotation": [-5, -11, 0],
			"translation": [0.75, 0.5, 0],
			"scale": [2, 2, 2]
		},
		"firstperson_lefthand": {
			"rotation": [-6, 7, 0],
			"translation": [1, 1.5, 0],
			"scale": [2, 2, 2]
		},
		"gui": {
			"rotation": [68, 54, -68],
			"translation": [0.25, -0.75, 0],
			"scale": [0.8, 0.8, 0.8]
		},
		"fixed": {
			"rotation": [0, -91, 0],
			"translation": [-2, 0, -2.25]
		}
	},
	"groups": [
		{
			"name": "group",
			"origin": [0.5, 6.975, 16.35],
			"color": 0,
			"children": [0, 1, 2, 3, 4, 5, 6, 7, 8, 9, 10, 11, 12, 13, 14, 15, 16, 17, 18, 19, 20]
		},
		{
			"name": "group",
			"origin": [0, 0, 0],
			"color": 0,
			"children": [21, 22, 23, 24, 25, 26, 27, 28, 29, 30, 31, 32, 33, 34, 35, 36, 37, 38, 39, 40]
		},
		{
			"name": "group",
			"origin": [0, 0, 0],
			"color": 0,
			"children": [41, 42, 43, 44, 45, 46, 47, 48, 49, 50, 51]
		},
		{
			"name": "group",
			"origin": [0.5, 6.09112, 10.97591],
			"color": 0,
			"children": [52, 53, 54, 55, 56, 57, 58, 59, 60, 61, 62, 63, 64, 65, 66, 67, 68, 69, 70, 71, 72, 73, 74, 75]
		},
		{
			"name": "group",
			"origin": [0, -0.95835, 0],
			"color": 0,
			"children": [76, 77]
		},
		{
			"name": "group",
			"origin": [0.5, 8.98548, 6.07937],
			"color": 0,
			"children": [78, 79]
		}
	]
}