{
  "parent": "amod:custom/restoration_machine",
  "textures": {
    "all": "amod:blocks/zombieore_ore_block",
    "particle": "amod:blocks/zombieore_ore_block",
    "0": "amod:blocks/blast_furnace_front",
    "1": "amod:blocks/machine_water",
    "2": "amod:blocks/glass",
    "3": "amod:blocks/water_bucket"
  }
}