{
	"credit": "Made with Blockbench",
	"textures": {
		"0": "gold_block",
		"1": "red_concrete_powder",
		"2": "iron_block",
		"3": "redstone_block",
		"4": "black_concrete",
		"particle": "gold_block"
	},
	"elements": [
		{
			"from": [7.5, 8.15, 2.75],
			"to": [8.5, 8.35, 5],
			"rotation": {"angle": 45, "axis": "x", "origin": [8, 7.75, 4.175]},
			"faces": {
				"north": {"uv": [0, 0, 1, 0.2], "texture": "#0"},
				"east": {"uv": [0, 0, 2.25, 0.2], "texture": "#0"},
				"south": {"uv": [0, 0, 1, 0.2], "texture": "#0"},
				"west": {"uv": [0, 0, 2.25, 0.2], "texture": "#0"},
				"up": {"uv": [0, 0, 1, 2.25], "texture": "#0"},
				"down": {"uv": [0, 0, 1, 2.25], "texture": "#0"}
			}
		},
		{
			"from": [7.5, 7.625, 3.475],
			"to": [8.5, 7.875, 4.875],
			"rotation": {"angle": 0, "axis": "x", "origin": [8, 7.75, 4.175]},
			"faces": {
				"north": {"uv": [0, 0, 1, 0.25], "rotation": 180, "texture": "#0"},
				"east": {"uv": [0, 0, 0.25, 1.4], "rotation": 270, "texture": "#0"},
				"south": {"uv": [0, 0, 1, 0.25], "texture": "#0"},
				"west": {"uv": [0, 0, 0.25, 1.4], "rotation": 90, "texture": "#0"},
				"up": {"uv": [0, 0, 1, 1.4], "rotation": 180, "texture": "#0"},
				"down": {"uv": [0, 0, 1, 1.4], "texture": "#0"}
			}
		},
		{
			"from": [7.5, 7.825, 3.375],
			"to": [8.5, 8.075, 4.675],
			"rotation": {"angle": 0, "axis": "x", "origin": [8, 7.75, 4.175]},
			"faces": {
				"north": {"uv": [0, 0, 1, 0.25], "rotation": 180, "texture": "#0"},
				"east": {"uv": [0, 0, 0.25, 1.3], "rotation": 270, "texture": "#0"},
				"south": {"uv": [0, 0, 1, 0.25], "texture": "#0"},
				"west": {"uv": [0, 0, 0.25, 1.3], "rotation": 90, "texture": "#0"},
				"up": {"uv": [0, 0, 1, 1.3], "rotation": 180, "texture": "#0"},
				"down": {"uv": [0, 0, 1, 1.3], "texture": "#0"}
			}
		},
		{
			"from": [7.5, 8.025, 3.375],
			"to": [8.5, 8.275, 4.475],
			"rotation": {"angle": 0, "axis": "x", "origin": [8, 7.75, 4.175]},
			"faces": {
				"north": {"uv": [0, 0, 1, 0.25], "rotation": 180, "texture": "#0"},
				"east": {"uv": [0, 0, 0.25, 1.1], "rotation": 270, "texture": "#0"},
				"south": {"uv": [0, 0, 1, 0.25], "texture": "#0"},
				"west": {"uv": [0, 0, 0.25, 1.1], "rotation": 90, "texture": "#0"},
				"up": {"uv": [0, 0, 1, 1.1], "rotation": 180, "texture": "#0"},
				"down": {"uv": [0, 0, 1, 1.1], "texture": "#0"}
			}
		},
		{
			"from": [7.5, 8.225, 3.375],
			"to": [8.5, 8.475, 4.275],
			"rotation": {"angle": 0, "axis": "x", "origin": [8, 7.75, 4.175]},
			"faces": {
				"north": {"uv": [0, 0, 1, 0.25], "rotation": 180, "texture": "#0"},
				"east": {"uv": [0, 0, 0.25, 0.9], "rotation": 270, "texture": "#0"},
				"south": {"uv": [0, 0, 1, 0.25], "texture": "#0"},
				"west": {"uv": [0, 0, 0.25, 0.9], "rotation": 90, "texture": "#0"},
				"up": {"uv": [0, 0, 1, 0.9], "rotation": 180, "texture": "#0"},
				"down": {"uv": [0, 0, 1, 0.9], "texture": "#0"}
			}
		},
		{
			"from": [7.5, 8.425, 3.375],
			"to": [8.5, 8.675, 4.075],
			"rotation": {"angle": 0, "axis": "x", "origin": [8, 7.75, 4.175]},
			"faces": {
				"north": {"uv": [0, 0, 1, 0.25], "rotation": 180, "texture": "#0"},
				"east": {"uv": [0, 0, 0.25, 0.7], "rotation": 270, "texture": "#0"},
				"south": {"uv": [0, 0, 1, 0.25], "texture": "#0"},
				"west": {"uv": [0, 0, 0.25, 0.7], "rotation": 90, "texture": "#0"},
				"up": {"uv": [0, 0, 1, 0.7], "rotation": 180, "texture": "#0"},
				"down": {"uv": [0, 0, 1, 0.7], "texture": "#0"}
			}
		},
		{
			"from": [7.5, 8.625, 3.375],
			"to": [8.5, 8.875, 3.875],
			"rotation": {"angle": 0, "axis": "x", "origin": [8, 7.75, 4.175]},
			"faces": {
				"north": {"uv": [0, 0, 1, 0.25], "rotation": 180, "texture": "#0"},
				"east": {"uv": [0, 0, 0.25, 0.5], "rotation": 270, "texture": "#0"},
				"south": {"uv": [0, 0, 1, 0.25], "texture": "#0"},
				"west": {"uv": [0, 0, 0.25, 0.5], "rotation": 90, "texture": "#0"},
				"up": {"uv": [0, 0, 1, 0.5], "rotation": 180, "texture": "#0"},
				"down": {"uv": [0, 0, 1, 0.5], "texture": "#0"}
			}
		},
		{
			"from": [7.5, 8.725, 3.375],
			"to": [8.5, 8.975, 3.775],
			"rotation": {"angle": 0, "axis": "x", "origin": [8, 7.75, 4.175]},
			"faces": {
				"north": {"uv": [0, 0, 1, 0.25], "rotation": 180, "texture": "#0"},
				"east": {"uv": [0, 0, 0.25, 0.4], "rotation": 270, "texture": "#0"},
				"south": {"uv": [0, 0, 1, 0.25], "texture": "#0"},
				"west": {"uv": [0, 0, 0.25, 0.4], "rotation": 90, "texture": "#0"},
				"up": {"uv": [0, 0, 1, 0.4], "rotation": 180, "texture": "#0"},
				"down": {"uv": [0, 0, 1, 0.4], "texture": "#0"}
			}
		},
		{
			"from": [7.5, 6.925, 3.375],
			"to": [8.5, 9.18189, 3.59164],
			"rotation": {"angle": 0, "axis": "x", "origin": [8, 7.75, 4.175]},
			"faces": {
				"north": {"uv": [0, 0, 1, 2.25689], "rotation": 180, "texture": "#0"},
				"east": {"uv": [0, 0, 2.25689, 0.21664], "rotation": 270, "texture": "#0"},
				"south": {"uv": [0, 0, 1, 2.25689], "texture": "#0"},
				"west": {"uv": [0, 0, 2.25689, 0.21664], "rotation": 90, "texture": "#0"},
				"up": {"uv": [0, 0, 1, 0.21664], "rotation": 180, "texture": "#0"},
				"down": {"uv": [0, 0, 1, 0.21664], "texture": "#0"}
			}
		},
		{
			"from": [7.5, 6.525, 1.775],
			"to": [8.5, 6.78189, 3.39164],
			"rotation": {"angle": 0, "axis": "x", "origin": [8, 7.75, 4.175]},
			"faces": {
				"north": {"uv": [0, 0, 1, 0.25689], "rotation": 180, "texture": "#0"},
				"east": {"uv": [0, 0, 0.25689, 1.61664], "rotation": 270, "texture": "#0"},
				"south": {"uv": [0, 0, 1, 0.25689], "texture": "#0"},
				"west": {"uv": [0, 0, 0.25689, 1.61664], "rotation": 90, "texture": "#0"},
				"up": {"uv": [0, 0, 1, 1.61664], "rotation": 180, "texture": "#0"},
				"down": {"uv": [0, 0, 1, 1.61664], "texture": "#0"}
			}
		},
		{
			"from": [7.5, 6.125, 2.875],
			"to": [8.5, 6.78189, 3.39164],
			"rotation": {"angle": 0, "axis": "x", "origin": [8, 7.75, 4.175]},
			"faces": {
				"north": {"uv": [0, 0, 1, 0.65689], "rotation": 180, "texture": "#0"},
				"east": {"uv": [0, 0, 0.65689, 0.51664], "rotation": 270, "texture": "#0"},
				"south": {"uv": [0, 0, 1, 0.65689], "texture": "#0"},
				"west": {"uv": [0, 0, 0.65689, 0.51664], "rotation": 90, "texture": "#0"},
				"up": {"uv": [0, 0, 1, 0.51664], "rotation": 180, "texture": "#0"},
				"down": {"uv": [0, 0, 1, 0.51664], "texture": "#0"}
			}
		},
		{
			"from": [7.5, 6.325, 2.375],
			"to": [8.5, 6.78189, 2.89164],
			"rotation": {"angle": 0, "axis": "x", "origin": [8, 7.75, 4.175]},
			"faces": {
				"north": {"uv": [0, 0, 1, 0.45689], "rotation": 180, "texture": "#0"},
				"east": {"uv": [0, 0, 0.45689, 0.51664], "rotation": 270, "texture": "#0"},
				"south": {"uv": [0, 0, 1, 0.45689], "texture": "#0"},
				"west": {"uv": [0, 0, 0.45689, 0.51664], "rotation": 90, "texture": "#0"},
				"up": {"uv": [0, 0, 1, 0.51664], "rotation": 180, "texture": "#0"},
				"down": {"uv": [0, 0, 1, 0.51664], "texture": "#0"}
			}
		},
		{
			"from": [7.5, 6.195, 1.81739],
			"to": [8.5, 6.45189, 3.73403],
			"rotation": {"angle": 22.5, "axis": "x", "origin": [8, 6.72344, 2.62571]},
			"faces": {
				"north": {"uv": [0, 0, 1, 0.25689], "rotation": 180, "texture": "#0"},
				"east": {"uv": [0, 0, 0.25689, 1.91664], "rotation": 270, "texture": "#0"},
				"south": {"uv": [0, 0, 1, 0.25689], "texture": "#0"},
				"west": {"uv": [0, 0, 0.25689, 1.91664], "rotation": 90, "texture": "#0"},
				"up": {"uv": [0, 0, 1, 1.91664], "rotation": 180, "texture": "#0"},
				"down": {"uv": [0, 0, 1, 1.91664], "texture": "#0"}
			}
		},
		{
			"from": [7.5, -0.15, 4.75],
			"to": [8.5, 4.45, 6.6],
			"rotation": {"angle": 0, "axis": "y", "origin": [7.5, -4, 0]},
			"faces": {
				"north": {"uv": [0, 0, 1, 4.6], "texture": "#4"},
				"east": {"uv": [0, 0, 16, 16], "texture": "#4"},
				"south": {"uv": [0, 0, 1, 4.6], "texture": "#4"},
				"west": {"uv": [0, 0, 1.85, 4.6], "texture": "#4"},
				"up": {"uv": [0, 0, 1, 1.85], "texture": "#4"},
				"down": {"uv": [0, 0, 1, 1.85], "texture": "#4"}
			}
		},
		{
			"from": [7.5, -0.15, 5.75],
			"to": [8.5, 0.85, 8.1],
			"rotation": {"angle": 0, "axis": "y", "origin": [7.5, -4, 0]},
			"faces": {
				"north": {"uv": [0, 0, 1, 1], "texture": "#4"},
				"east": {"uv": [0, 0, 16, 16], "texture": "#4"},
				"south": {"uv": [0, 0, 1, 1], "texture": "#4"},
				"west": {"uv": [0, 0, 2.35, 1], "texture": "#4"},
				"up": {"uv": [0, 0, 1, 2.35], "texture": "#4"},
				"down": {"uv": [0, 0, 1, 2.35], "texture": "#4"}
			}
		},
		{
			"from": [7.5, 0.8273, 5.7406],
			"to": [8.5, 1.8273, 8.0906],
			"rotation": {"angle": 45, "axis": "x", "origin": [8, 1.3273, 6.9156]},
			"faces": {
				"north": {"uv": [0, 0, 1, 1], "texture": "#4"},
				"east": {"uv": [0, 0, 16, 16], "texture": "#4"},
				"south": {"uv": [0, 0, 1, 1], "texture": "#4"},
				"west": {"uv": [0, 0, 2.35, 1], "texture": "#4"},
				"up": {"uv": [0, 0, 1, 2.35], "texture": "#4"},
				"down": {"uv": [0, 0, 1, 2.35], "texture": "#4"}
			}
		},
		{
			"from": [7.5, 1.0523, 6.4156],
			"to": [8.5, 3.9023, 7.4156],
			"rotation": {"angle": 0, "axis": "x", "origin": [8, 1.3273, 6.9156]},
			"faces": {
				"north": {"uv": [0, 0, 1, 2.85], "rotation": 180, "texture": "#4"},
				"east": {"uv": [0, 0, 16, 16], "rotation": 270, "texture": "#4"},
				"south": {"uv": [0, 0, 1, 2.85], "texture": "#4"},
				"west": {"uv": [0, 0, 2.85, 1], "rotation": 90, "texture": "#4"},
				"up": {"uv": [0, 0, 1, 1], "rotation": 180, "texture": "#4"},
				"down": {"uv": [0, 0, 1, 1], "texture": "#4"}
			}
		},
		{
			"from": [7.5, 2.3523, 6.4156],
			"to": [8.5, 3.0023, 8.2156],
			"rotation": {"angle": 0, "axis": "x", "origin": [8, 1.3273, 6.9156]},
			"faces": {
				"north": {"uv": [0, 0, 1, 0.65], "rotation": 180, "texture": "#4"},
				"east": {"uv": [0, 0, 16, 16], "rotation": 270, "texture": "#4"},
				"south": {"uv": [0, 0, 1, 0.65], "texture": "#4"},
				"west": {"uv": [0, 0, 0.65, 1.8], "rotation": 90, "texture": "#4"},
				"up": {"uv": [0, 0, 1, 1.8], "rotation": 180, "texture": "#4"},
				"down": {"uv": [0, 0, 1, 1.8], "texture": "#4"}
			}
		},
		{
			"from": [7.5, 2.8935, 7.72218],
			"to": [8.5, 3.5435, 8.82218],
			"rotation": {"angle": -45, "axis": "x", "origin": [8, 3.2185, 8.62218]},
			"faces": {
				"north": {"uv": [0, 0, 1, 0.65], "rotation": 180, "texture": "#4"},
				"east": {"uv": [0, 0, 16, 16], "rotation": 270, "texture": "#4"},
				"south": {"uv": [0, 0, 1, 0.65], "texture": "#4"},
				"west": {"uv": [0, 0, 0.65, 1.1], "rotation": 90, "texture": "#4"},
				"up": {"uv": [0, 0, 1, 1.1], "rotation": 180, "texture": "#4"},
				"down": {"uv": [0, 0, 1, 1.1], "texture": "#4"}
			}
		},
		{
			"from": [7.5, 3.13011, 8.34341],
			"to": [8.5, 4.23011, 8.99341],
			"rotation": {"angle": 0, "axis": "x", "origin": [8, 3.13011, 8.66841]},
			"faces": {
				"north": {"uv": [0, 0, 1, 1.1], "texture": "#4"},
				"east": {"uv": [0, 0, 16, 16], "texture": "#4"},
				"south": {"uv": [0, 0, 1, 1.1], "texture": "#4"},
				"west": {"uv": [0, 0, 0.65, 1.1], "texture": "#4"},
				"up": {"uv": [0, 0, 1, 0.65], "texture": "#4"},
				"down": {"uv": [0, 0, 1, 0.65], "texture": "#4"}
			}
		},
		{
			"from": [6, 3.8, 5],
			"to": [10, 7.8, 9],
			"rotation": {"angle": 0, "axis": "y", "origin": [8, -4, 0]},
			"faces": {
				"north": {"uv": [0, 0, 4, 4], "texture": "#1"},
				"east": {"uv": [0, 0, 4, 4], "texture": "#1"},
				"south": {"uv": [0, 0, 4, 4], "texture": "#1"},
				"west": {"uv": [0, 0, 4, 4], "texture": "#1"},
				"up": {"uv": [0, 0, 4, 4], "texture": "#1"},
				"down": {"uv": [0, 0, 4, 4], "texture": "#1"}
			}
		},
		{
			"from": [6.25, 4.05, 8.75],
			"to": [9.75, 7.55, 10],
			"rotation": {"angle": 0, "axis": "y", "origin": [8, -4, 0]},
			"faces": {
				"north": {"uv": [0, 0, 3.5, 3.5], "texture": "#1"},
				"east": {"uv": [0, 0, 1.25, 3.5], "texture": "#1"},
				"south": {"uv": [0, 0, 3.5, 3.5], "texture": "#1"},
				"west": {"uv": [0, 0, 1.25, 3.5], "texture": "#1"},
				"up": {"uv": [0, 0, 3.5, 1.25], "texture": "#1"},
				"down": {"uv": [0, 0, 3.5, 1.25], "texture": "#1"}
			}
		},
		{
			"from": [6, 4.25, 4.55],
			"to": [10, 7.65, 5],
			"rotation": {"angle": 0, "axis": "y", "origin": [8, -4, 0]},
			"faces": {
				"north": {"uv": [0, 0, 4, 3.4], "texture": "#1"},
				"east": {"uv": [0, 0, 0.45, 3.4], "texture": "#1"},
				"south": {"uv": [0, 0, 4, 3.4], "texture": "#1"},
				"west": {"uv": [0, 0, 0.45, 3.4], "texture": "#1"},
				"up": {"uv": [0, 0, 4, 0.45], "texture": "#1"},
				"down": {"uv": [0, 0, 4, 0.45], "texture": "#1"}
			}
		},
		{
			"from": [6, 4.65, 4.15],
			"to": [10, 7.65, 4.6],
			"rotation": {"angle": 0, "axis": "y", "origin": [8, -4, 0]},
			"faces": {
				"north": {"uv": [0, 0, 4, 3], "texture": "#1"},
				"east": {"uv": [0, 0, 0.45, 3], "texture": "#1"},
				"south": {"uv": [0, 0, 4, 3], "texture": "#1"},
				"west": {"uv": [0, 0, 0.45, 3], "texture": "#1"},
				"up": {"uv": [0, 0, 4, 0.45], "texture": "#1"},
				"down": {"uv": [0, 0, 4, 0.45], "texture": "#1"}
			}
		},
		{
			"from": [6, 4.95, 3.75],
			"to": [10, 7.65, 4.2],
			"rotation": {"angle": 0, "axis": "y", "origin": [8, -4, 0]},
			"faces": {
				"north": {"uv": [0, 0, 4, 2.7], "texture": "#1"},
				"east": {"uv": [0, 0, 0.45, 2.7], "texture": "#1"},
				"south": {"uv": [0, 0, 4, 2.7], "texture": "#1"},
				"west": {"uv": [0, 0, 0.45, 2.7], "texture": "#1"},
				"up": {"uv": [0, 0, 4, 0.45], "texture": "#1"},
				"down": {"uv": [0, 0, 4, 0.45], "texture": "#1"}
			}
		},
		{
			"from": [6, 5.75, 3.35],
			"to": [10, 7.65, 3.8],
			"rotation": {"angle": 0, "axis": "y", "origin": [8, -4, 0]},
			"faces": {
				"north": {"uv": [0, 0, 4, 1.9], "texture": "#1"},
				"east": {"uv": [0, 0, 0.45, 1.9], "texture": "#1"},
				"south": {"uv": [0, 0, 4, 1.9], "texture": "#1"},
				"west": {"uv": [0, 0, 0.45, 1.9], "texture": "#1"},
				"up": {"uv": [0, 0, 4, 0.45], "texture": "#1"},
				"down": {"uv": [0, 0, 4, 0.45], "texture": "#1"}
			}
		},
		{
			"from": [6.55, 4.35, 9.25],
			"to": [9.45, 7.25, 10.5],
			"rotation": {"angle": 0, "axis": "y", "origin": [8, -4, 0]},
			"faces": {
				"north": {"uv": [0, 0, 2.9, 2.9], "texture": "#2"},
				"east": {"uv": [0, 0, 1.25, 2.9], "texture": "#2"},
				"south": {"uv": [0, 0, 2.9, 2.9], "texture": "#2"},
				"west": {"uv": [0, 0, 1.25, 2.9], "texture": "#2"},
				"up": {"uv": [0, 0, 2.9, 1.25], "texture": "#2"},
				"down": {"uv": [0, 0, 2.9, 1.25], "texture": "#2"}
			}
		},
		{
			"from": [6.875, 4.75, 9.95],
			"to": [9.075, 6.95, 11.2],
			"rotation": {"angle": 0, "axis": "y", "origin": [8, -4, 0]},
			"faces": {
				"north": {"uv": [0, 0, 2.2, 2.2], "texture": "#2"},
				"east": {"uv": [0, 0, 1.25, 2.2], "texture": "#2"},
				"south": {"uv": [0, 0, 2.2, 2.2], "texture": "#2"},
				"west": {"uv": [0, 0, 1.25, 2.2], "texture": "#2"},
				"up": {"uv": [0, 0, 2.2, 1.25], "texture": "#2"},
				"down": {"uv": [0, 0, 2.2, 1.25], "texture": "#2"}
			}
		},
		{
			"from": [7.2, 5.15, 10.55],
			"to": [8.8, 6.75, 11.8],
			"rotation": {"angle": 0, "axis": "y", "origin": [8, -4, 0]},
			"faces": {
				"north": {"uv": [0, 0, 1.6, 1.6], "texture": "#2"},
				"east": {"uv": [0, 0, 1.25, 1.6], "texture": "#2"},
				"south": {"uv": [0, 0, 1.6, 1.6], "texture": "#2"},
				"west": {"uv": [0, 0, 1.25, 1.6], "texture": "#2"},
				"up": {"uv": [0, 0, 1.6, 1.25], "texture": "#2"},
				"down": {"uv": [0, 0, 1.6, 1.25], "texture": "#2"}
			}
		},
		{
			"from": [7.45, 5.45, 10.95],
			"to": [8.55, 6.55, 12.2],
			"rotation": {"angle": 0, "axis": "y", "origin": [8, -4, 0]},
			"faces": {
				"north": {"uv": [0, 0, 1.1, 1.1], "texture": "#2"},
				"east": {"uv": [0, 0, 1.25, 1.1], "texture": "#2"},
				"south": {"uv": [0, 0, 1.1, 1.1], "texture": "#2"},
				"west": {"uv": [0, 0, 1.25, 1.1], "texture": "#2"},
				"up": {"uv": [0, 0, 1.1, 1.25], "texture": "#2"},
				"down": {"uv": [0, 0, 1.1, 1.25], "texture": "#2"}
			}
		},
		{
			"from": [7, 5.05, 12.15],
			"to": [9, 7.05, 14],
			"rotation": {"angle": 0, "axis": "y", "origin": [8, -4, 0]},
			"faces": {
				"north": {"uv": [0, 0, 16, 16], "texture": "#3"},
				"east": {"uv": [0, 0, 16, 16], "texture": "#3"},
				"south": {"uv": [0, 0, 16, 16], "texture": "#3"},
				"west": {"uv": [0, 0, 16, 16], "texture": "#3"},
				"up": {"uv": [0, 0, 16, 16], "texture": "#3"},
				"down": {"uv": [0, 0, 16, 16], "texture": "#3"}
			}
		}
	],
	"display": {
		"thirdperson_righthand": {
			"rotation": [0, -180, 0],
			"translation": [0, 4, 0],
			"scale": [0.75, 0.75, 0.75]
		},
		"thirdperson_lefthand": {
			"rotation": [0, -180, 0],
			"translation": [0, 4, 0],
			"scale": [0.75, 0.75, 0.75]
		},
		"firstperson_righthand": {
			"rotation": [0, -180, 0],
			"translation": [0, 4, 0],
			"scale": [0.75, 0.75, 0.75]
		},
		"firstperson_lefthand": {
			"rotation": [0, -180, 0],
			"translation": [0, 4, 0],
			"scale": [0.75, 0.75, 0.75]
		},
		"ground": {
			"rotation": [0, -180, 0],
			"translation": [0, 3, 0],
			"scale": [0.75, 0.75, 0.75]
		},
		"gui": {
			"rotation": [0, -94, 0],
			"translation": [0, 4.25, 0],
			"scale": [1.25, 1.25, 1.25]
		},
		"fixed": {
			"rotation": [0, -94, 0]
		}
	},
	"groups": [
		{
			"name": "group",
			"origin": [0.5, 11.75, 4.175],
			"color": 0,
			"children": [0, 1, 2, 3, 4, 5, 6, 7, 8, 9, 10, 11, 12]
		},
		{
			"name": "group",
			"origin": [0, 0, 0],
			"color": 0,
			"children": [13, 14, 15, 16, 17, 18, 19]
		},
		{
			"name": "group",
			"origin": [0, 0, 0],
			"color": 0,
			"children": [20, 21, 22, 23, 24, 25, 26, 27, 28, 29, 30]
		}
	]
}