{
  "_fv": 28,
  "_type": "tool",
  "definition": {
    "renderType": 1,
    "texture": "golemtexture",
    "customModelName": "iron_golem_item:default",
    "name": "Golem Item",
    "specialInfo": [],
    "creativeTab": {
      "value": "CUSTOM:Tab"
    },
    "toolType": "Axe",
    "harvestLevel": 1,
    "efficiency": 4.0,
    "attackSpeed": 1.0,
    "enchantability": 2,
    "damageVsEntity": 4.0,
    "usageCount": 1561,
    "blocksAffected": [],
    "hasGlow": false,
    "repairItems": [],
    "immuneToFire": false,
    "stayInGridWhenCrafting": false,
    "damageOnCrafting": false,
    "onEntityHitWith": {
      "name": "GolemItemmobugaturudeGongJisaretatoki"
    }
  }
}