{
	"credit": "Made with Blockbench",
	"texture_size": [64, 32],
	"textures": {
		"1": "textures/entity/cow/cow"
	},
	"elements": [
		{
			"name": "body",
			"from": [2, 11.75, -0.75],
			"to": [14, 21.75, 17.25],
			"rotation": {"angle": 0, "axis": "x", "origin": [8, 17, 4.25]},
			"faces": {
				"north": {"uv": [7, 2, 10, 7], "rotation": 180, "texture": "#1"},
				"east": {"uv": [4.5, 7, 7, 16], "rotation": 270, "texture": "#1"},
				"south": {"uv": [10, 2, 13, 7], "texture": "#1"},
				"west": {"uv": [10, 7, 13, 16], "rotation": 270, "texture": "#1"},
				"up": {"uv": [15.5, 16, 13, 7], "rotation": 180, "texture": "#1"},
				"down": {"uv": [10, 7, 7, 16], "rotation": 180, "texture": "#1"}
			}
		},
		{
			"name": "body",
			"from": [6, 10.75, 11.25],
			"to": [10, 11.75, 17.25],
			"rotation": {"angle": 0, "axis": "x", "origin": [8, 17, 4.25]},
			"faces": {
				"north": {"uv": [13.25, 0, 14.25, 0.5], "texture": "#1"},
				"east": {"uv": [13, 0.5, 13.25, 3.5], "texture": "#1"},
				"south": {"uv": [15, 0, 16, 0.5], "texture": "#1"},
				"west": {"uv": [14.25, 0.5, 14.25, 3.5], "texture": "#1"},
				"up": {"uv": [14.25, 3.5, 13.25, 0.5], "texture": "#1"},
				"down": {"uv": [14.25, 0.5, 13.25, 3.5], "texture": "#1"}
			}
		},
		{
			"name": "head",
			"from": [4, 16, -7],
			"to": [12, 24, -1],
			"faces": {
				"north": {"uv": [1.5, 3, 3.5, 7], "texture": "#1"},
				"east": {"uv": [0, 3, 1.5, 7], "texture": "#1"},
				"south": {"uv": [5, 3, 7, 7], "texture": "#1"},
				"west": {"uv": [3.5, 3, 5, 7], "texture": "#1"},
				"up": {"uv": [3.5, 3, 1.5, 0], "texture": "#1"},
				"down": {"uv": [5.5, 0, 3.5, 3], "texture": "#1"}
			}
		},
		{
			"name": "head",
			"from": [3, 22, -5],
			"to": [4, 25, -4],
			"faces": {
				"north": {"uv": [5.75, 0.5, 6, 2], "texture": "#1"},
				"east": {"uv": [5.5, 0.5, 5.75, 2], "texture": "#1"},
				"south": {"uv": [6.25, 0.5, 6.5, 2], "texture": "#1"},
				"west": {"uv": [6, 0.5, 6.25, 2], "texture": "#1"},
				"up": {"uv": [6, 0.5, 5.75, 0], "texture": "#1"},
				"down": {"uv": [6.25, 0, 6, 0.5], "texture": "#1"}
			}
		},
		{
			"name": "head",
			"from": [12, 22, -5],
			"to": [13, 25, -4],
			"faces": {
				"north": {"uv": [5.75, 0.5, 6, 2], "texture": "#1"},
				"east": {"uv": [5.5, 0.5, 5.75, 2], "texture": "#1"},
				"south": {"uv": [6.25, 0.5, 6.5, 2], "texture": "#1"},
				"west": {"uv": [6, 0.5, 6.25, 2], "texture": "#1"},
				"up": {"uv": [6, 0.5, 5.75, 0], "texture": "#1"},
				"down": {"uv": [6.25, 0, 6, 0.5], "texture": "#1"}
			}
		},
		{
			"name": "leg1",
			"from": [10, 0, 12],
			"to": [14, 12, 16],
			"faces": {
				"north": {"uv": [1, 10, 2, 16], "texture": "#1"},
				"east": {"uv": [0, 10, 1, 16], "texture": "#1"},
				"south": {"uv": [3, 10, 4, 16], "texture": "#1"},
				"west": {"uv": [2, 10, 3, 16], "texture": "#1"},
				"up": {"uv": [2, 10, 1, 8], "texture": "#1"},
				"down": {"uv": [3, 8, 2, 10], "texture": "#1"}
			}
		},
		{
			"name": "leg2",
			"from": [2, 0, 12],
			"to": [6, 12, 16],
			"faces": {
				"north": {"uv": [1, 10, 2, 16], "texture": "#1"},
				"east": {"uv": [0, 10, 1, 16], "texture": "#1"},
				"south": {"uv": [3, 10, 4, 16], "texture": "#1"},
				"west": {"uv": [2, 10, 3, 16], "texture": "#1"},
				"up": {"uv": [2, 10, 1, 8], "texture": "#1"},
				"down": {"uv": [3, 8, 2, 10], "texture": "#1"}
			}
		},
		{
			"name": "leg3",
			"from": [10, 0, 0],
			"to": [14, 12, 4],
			"faces": {
				"north": {"uv": [1, 10, 2, 16], "texture": "#1"},
				"east": {"uv": [0, 10, 1, 16], "texture": "#1"},
				"south": {"uv": [3, 10, 4, 16], "texture": "#1"},
				"west": {"uv": [2, 10, 3, 16], "texture": "#1"},
				"up": {"uv": [2, 10, 1, 8], "texture": "#1"},
				"down": {"uv": [3, 8, 2, 10], "texture": "#1"}
			}
		},
		{
			"name": "leg4",
			"from": [2, 0, 0],
			"to": [6, 12, 4],
			"faces": {
				"north": {"uv": [1, 10, 2, 16], "texture": "#1"},
				"east": {"uv": [0, 10, 1, 16], "texture": "#1"},
				"south": {"uv": [3, 10, 4, 16], "texture": "#1"},
				"west": {"uv": [2, 10, 3, 16], "texture": "#1"},
				"up": {"uv": [2, 10, 1, 8], "texture": "#1"},
				"down": {"uv": [3, 8, 2, 10], "texture": "#1"}
			}
		}
	],
	"display": {
		"thirdperson_righthand": {
			"scale": [0.5, 0.5, 0.5]
		},
		"thirdperson_lefthand": {
			"scale": [0.5, 0.5, 0.5]
		},
		"firstperson_righthand": {
			"scale": [0.5, 0.5, 0.5]
		},
		"firstperson_lefthand": {
			"scale": [0.5, 0.5, 0.5]
		},
		"ground": {
			"scale": [0.25, 0.25, 0.25]
		},
		"gui": {
			"rotation": [0, -180, 0],
			"translation": [0, -4, 0],
			"scale": [0.5, 0.5, 0.5]
		},
		"fixed": {
			"translation": [0, -3.75, 0],
			"scale": [0.5, 0.5, 0.5]
		}
	},
	"groups": [
		{
			"name": "body",
			"origin": [0, 19, 2],
			"color": 0,
			"children": [0, 1]
		},
		{
			"name": "head",
			"origin": [0, 20, -8],
			"color": 0,
			"children": [2, 3, 4]
		},
		{
			"name": "leg1",
			"origin": [-4, 12, 7],
			"color": 0,
			"children": [5]
		},
		{
			"name": "leg2",
			"origin": [4, 12, 7],
			"color": 0,
			"children": [6]
		},
		{
			"name": "leg3",
			"origin": [-4, 12, -6],
			"color": 0,
			"children": [7]
		},
		{
			"name": "leg4",
			"origin": [4, 12, -6],
			"color": 0,
			"children": [8]
		}
	]
}