{
  "credit": "Made with Blockbench",
  "texture_size": [
    64,
    32
  ],
  "elements": [
    {
      "name": "head",
      "from": [
        6,
        9,
        2
      ],
      "to": [
        10,
        15,
        5
      ],
      "faces": {
        "north": {
          "uv": [
            0.75,
            1.5,
            1.75,
            4.5
          ],
          "texture": "#0"
        },
        "east": {
          "uv": [
            0,
            1.5,
            0.75,
            4.5
          ],
          "texture": "#0"
        },
        "south": {
          "uv": [
            2.5,
            1.5,
            3.5,
            4.5
          ],
          "texture": "#0"
        },
        "west": {
          "uv": [
            1.75,
            1.5,
            2.5,
            4.5
          ],
          "texture": "#0"
        },
        "up": {
          "uv": [
            1.75,
            1.5,
            0.75,
            0
          ],
          "texture": "#0"
        },
        "down": {
          "uv": [
            2.75,
            0,
            1.75,
            1.5
          ],
          "texture": "#0"
        }
      }
    },
    {
      "name": "bill",
      "from": [
        6,
        11,
        0
      ],
      "to": [
        10,
        13,
        2
      ],
      "faces": {
        "north": {
          "uv": [
            4,
            1,
            5,
            2
          ],
          "texture": "#0"
        },
        "east": {
          "uv": [
            3.5,
            1,
            4,
            2
          ],
          "texture": "#0"
        },
        "south": {
          "uv": [
            5.5,
            1,
            6.5,
            2
          ],
          "texture": "#0"
        },
        "west": {
          "uv": [
            5,
            1,
            5.5,
            2
          ],
          "texture": "#0"
        },
        "up": {
          "uv": [
            5,
            1,
            4,
            0
          ],
          "texture": "#0"
        },
        "down": {
          "uv": [
            6,
            0,
            5,
            1
          ],
          "texture": "#0"
        }
      }
    },
    {
      "name": "chin",
      "from": [
        7,
        9,
        1
      ],
      "to": [
        9,
        11,
        3
      ],
      "faces": {
        "north": {
          "uv": [
            4,
            3,
            4.5,
            4
          ],
          "texture": "#0"
        },
        "east": {
          "uv": [
            3.5,
            3,
            4,
            4
          ],
          "texture": "#0"
        },
        "south": {
          "uv": [
            5,
            3,
            5.5,
            4
          ],
          "texture": "#0"
        },
        "west": {
          "uv": [
            4.5,
            3,
            5,
            4
          ],
          "texture": "#0"
        },
        "up": {
          "uv": [
            4.5,
            3,
            4,
            2
          ],
          "texture": "#0"
        },
        "down": {
          "uv": [
            5,
            2,
            4.5,
            3
          ],
          "texture": "#0"
        }
      }
    },
    {
      "name": "body",
      "from": [
        5,
        4,
        5
      ],
      "to": [
        11,
        12,
        11
      ],
      "faces": {
        "north": {
          "uv": [
            1.5,
            7.5,
            3,
            11.5
          ],
          "texture": "#0"
        },
        "east": {
          "uv": [
            0,
            7.5,
            1.5,
            11.5
          ],
          "texture": "#0"
        },
        "south": {
          "uv": [
            4.5,
            7.5,
            6,
            11.5
          ],
          "texture": "#0"
        },
        "west": {
          "uv": [
            3,
            7.5,
            4.5,
            11.5
          ],
          "texture": "#0"
        },
        "up": {
          "uv": [
            3,
            7.5,
            1.5,
            4.5
          ],
          "texture": "#0"
        },
        "down": {
          "uv": [
            4.5,
            4.5,
            3,
            7.5
          ],
          "texture": "#0"
        }
      }
    },
    {
      "name": "left_wing",
      "from": [
        4,
        7,
        5
      ],
      "to": [
        5,
        11,
        11
      ],
      "faces": {
        "north": {
          "uv": [
            7.5,
            9.5,
            7.75,
            11.5
          ],
          "texture": "#0"
        },
        "east": {
          "uv": [
            6,
            9.5,
            7.5,
            11.5
          ],
          "texture": "#0"
        },
        "south": {
          "uv": [
            9.25,
            9.5,
            9.5,
            11.5
          ],
          "texture": "#0"
        },
        "west": {
          "uv": [
            7.75,
            9.5,
            9.25,
            11.5
          ],
          "texture": "#0"
        },
        "up": {
          "uv": [
            7.75,
            9.5,
            7.5,
            6.5
          ],
          "texture": "#0"
        },
        "down": {
          "uv": [
            8,
            6.5,
            7.75,
            9.5
          ],
          "texture": "#0"
        }
      }
    },
    {
      "name": "right_wing",
      "from": [
        11,
        7,
        5
      ],
      "to": [
        12,
        11,
        11
      ],
      "faces": {
        "north": {
          "uv": [
            7.5,
            9.5,
            7.75,
            11.5
          ],
          "texture": "#0"
        },
        "east": {
          "uv": [
            6,
            9.5,
            7.5,
            11.5
          ],
          "texture": "#0"
        },
        "south": {
          "uv": [
            9.25,
            9.5,
            9.5,
            11.5
          ],
          "texture": "#0"
        },
        "west": {
          "uv": [
            7.75,
            9.5,
            9.25,
            11.5
          ],
          "texture": "#0"
        },
        "up": {
          "uv": [
            7.75,
            9.5,
            7.5,
            6.5
          ],
          "texture": "#0"
        },
        "down": {
          "uv": [
            8,
            6.5,
            7.75,
            9.5
          ],
          "texture": "#0"
        }
      }
    },
    {
      "name": "right_leg",
      "from": [
        6,
        0,
        7
      ],
      "to": [
        7,
        5,
        8
      ],
      "faces": {
        "north": {
          "uv": [
            7.25,
            1.5,
            8,
            4
          ],
          "texture": "#0"
        },
        "east": {
          "uv": [
            6.5,
            1.5,
            7.25,
            4
          ],
          "texture": "#0"
        },
        "south": {
          "uv": [
            8.75,
            1.5,
            9.5,
            4
          ],
          "texture": "#0"
        },
        "west": {
          "uv": [
            8,
            1.5,
            8.75,
            4
          ],
          "texture": "#0"
        },
        "up": {
          "uv": [
            8.75,
            1.5,
            8,
            0
          ],
          "texture": "#0"
        },
        "down": {
          "uv": [
            8.75,
            0,
            8,
            1.5
          ],
          "texture": "#0"
        }
      }
    },
    {
      "name": "right_leg",
      "from": [
        9,
        0,
        7
      ],
      "to": [
        10,
        5,
        8
      ],
      "faces": {
        "north": {
          "uv": [
            7.25,
            1.5,
            8,
            4
          ],
          "texture": "#0"
        },
        "east": {
          "uv": [
            6.5,
            1.5,
            7.25,
            4
          ],
          "texture": "#0"
        },
        "south": {
          "uv": [
            8.75,
            1.5,
            9.5,
            4
          ],
          "texture": "#0"
        },
        "west": {
          "uv": [
            8,
            1.5,
            8.75,
            4
          ],
          "texture": "#0"
        },
        "up": {
          "uv": [
            8.75,
            1.5,
            8,
            0
          ],
          "texture": "#0"
        },
        "down": {
          "uv": [
            8.75,
            0,
            8,
            1.5
          ],
          "texture": "#0"
        }
      }
    }
  ],
  "display": {
    "thirdperson_righthand": {
      "scale": [
        0.5,
        0.5,
        0.5
      ]
    },
    "thirdperson_lefthand": {
      "scale": [
        0.5,
        0.5,
        0.5
      ]
    },
    "firstperson_righthand": {
      "scale": [
        0.5,
        0.5,
        0.5
      ]
    },
    "firstperson_lefthand": {
      "scale": [
        0.5,
        0.5,
        0.5
      ]
    },
    "ground": {
      "scale": [
        0.5,
        0.5,
        0.5
      ]
    },
    "gui": {
      "rotation": [
        0,
        -180,
        0
      ],
      "translation": [
        0,
        0.25,
        0
      ]
    },
    "fixed": {
      "translation": [
        0,
        0.25,
        0
      ]
    }
  },
  "groups": [
    {
      "name": "head",
      "origin": [
        0,
        9,
        -4
      ],
      "color": 0,
      "children": [
        0
      ]
    },
    {
      "name": "bill",
      "origin": [
        0,
        9,
        -4
      ],
      "color": 0,
      "children": [
        1
      ]
    },
    {
      "name": "chin",
      "origin": [
        0,
        9,
        -4
      ],
      "color": 0,
      "children": [
        2
      ]
    },
    {
      "name": "body",
      "origin": [
        0,
        8,
        0
      ],
      "color": 0,
      "children": [
        3
      ]
    },
    {
      "name": "left_wing",
      "origin": [
        4,
        11,
        0
      ],
      "color": 0,
      "children": [
        4
      ]
    },
    {
      "name": "right_wing",
      "origin": [
        -4,
        11,
        0
      ],
      "color": 0,
      "children": [
        5
      ]
    },
    {
      "name": "left_leg",
      "origin": [
        1,
        5,
        1
      ],
      "color": 0,
      "children": [
        6
      ]
    },
    {
      "name": "right_leg",
      "origin": [
        -2,
        5,
        1
      ],
      "color": 0,
      "children": [
        7
      ]
    }
  ]
}