<?xml version="1.0" ?>
<robot name="movee" xmlns:xacro="http://www.ros.org/wiki/xacro">

<!-- In case you want to use the filename system instead of package (not compatible with IsaacSim) to load from package:
<xacro:property name="abs_path_pkg" value="file:$(find movee_description)/"  />
<mesh filename ="${abs_path_pkg}/meshes/chassis.dae" scale="0.001 0.001 0.001"/>
// -->

<xacro:include filename="$(find movee_description)/urdf/materials.xacro"/>
<xacro:include filename="$(find movee_description)/urdf/macros.xacro" /> 
<xacro:include filename="$(find movee_description)/urdf/movee.gz_sim" />
<!-- <xacro:include filename="$(find movee_description)/urdf/friction.xacro"/>-->

<!-- Geometrical variables-->
<xacro:property name="base_height" value="0.3" />
<xacro:property name="thigh_length" value="0.2717" />
<xacro:property name="thigh_conrod_length" value="0.5" />
<xacro:property name="calf_length" value="0.2685" /> 

<!--
  <xacro:arg name="training_wheels" default="true" />

  ${base_height}

  <xacro:property name="wheel_mass" value="0.5" />
  <xacro:property name="wheel_radius" value="0.1" />
  <xacro:property name="wheel_thickness" value="0.05" />
  <xacro:property name="wheelbase" value="0.5" />
  <xacro:property name="thigh_length" value="0.4" />
  <xacro:property name="thigh_conrod_length" value="0.5" />
  <xacro:property name="calf_length" value="0.4" />

  <xacro:property name="body_mass" value="10" />
 
  <xacro:property name="depth_camera_name" value="Creative"/>
  <xacro:property name="depth_camera_mass" value="0.1"/> -->

<!-- ============================================================================================= -->
<!-- ====================================== Link definition ====================================== -->
 <link name="base_link">
    <!-- Note that the robot was created with front in the Y axis. Thus a 90° rotation around Z between base_link and chassis -->
  </link>

  <link name="chassis">
    <inertial>
      <mass value="6"/>
      <origin rpy="0  0  0" xyz="0  -0.02  0"/>
      <!-- <inertia ixx="0.0004" ixy="0" ixz="0" iyy="0.0004" iyz="0" izz="0.0005"/> -->
      <xacro:box_inertia m="6" x="0.3" y="0.35" z="0.25"/>
    </inertial>
    <collision name="chassis__collision">
      <origin rpy="0  0 0" xyz="0   0.01  -0.03"/>
      <geometry>
        <box size="0.25 0.39 0.22" />
      </geometry>
    </collision>
    <visual name="chassis__visual">
      <origin rpy="-1.56  0  0" xyz="0   0   0"/>
      <geometry>
      <mesh filename ="package://movee_description/meshes/chassis.dae" scale="0.001 0.001 0.001"/>
      <!-- <box size="0.3 0.35 0.25"/>  -->
      </geometry>
      <material name="Ivory">
          <color rgba="${255/255} ${255/255} ${240/255} 1.0"/>
      </material>
    </visual>    
  </link>

  <link name="balancing_rail">  
    <inertial>
      <mass value="0.5"/>
      <origin rpy="0  0  0" xyz="0 0 0"/>
      <xacro:sphere_inertia m="0.01" r="0.155"/>
    </inertial>
    <!-- <collision> <cylinder length="0.45" radius="0.005"/> </geometry> -->
    <visual name="balancing_rail__visual">
      <origin rpy="0  3.1415  0" xyz="0.024  -0.15  0.01"/>
      <geometry>   
        <mesh filename ="package://movee_description/meshes/rail.stl" scale="0.001 0.001 0.001"/>
      </geometry>
      <material name="Blue">
          <color rgba="${0/255} ${191/255} ${255/255} 1.0"/>
     </material>
    </visual>   
  </link>


  <link name="counterweight">
    <inertial>
      <mass value="2.5"/>
      <origin rpy="0  0  0" xyz="0  0  -0.06"/>
      <xacro:sphere_inertia m="0.01" r="0.155"/>
    </inertial>
    <collision>      
      <origin rpy="0  0  0" xyz="0  0  0"/>
      <geometry>         
         <box size="0.1 0.25 0.1"/>     
      </geometry>
    </collision>
    <visual name="counterweight__visual">
      <origin rpy="1.5708  0  1.5708" xyz="-0.050  -0.135  -0.095"/>
      <geometry>   
        <mesh filename ="package://movee_description/meshes/F2FDualBattery.stl" scale="0.001 0.001 0.001"/>
      </geometry>
      <material name="Blue">
          <color rgba="${0/255} ${191/255} ${255/255} 1.0"/>
     </material>
    </visual> 
  </link>

  <link name="thigh_right">
    <inertial>
      <mass value="0.5"/>
      <origin rpy="0  0  0" xyz="0  0  -0"/>
      <!-- <inertia ixx="4.9e-06" ixy="0" ixz="0" iyy="4.9e-06" iyz="0" izz="3.5e-08"/> -->
      <xacro:cylinder_inertia m="0.5" r="0.015" h="0.4"/>
    </inertial>
    <collision name="thigh__collision">
      <origin rpy="0  0  0" xyz="0    0   -0.15"/>
      <geometry>
        <cylinder length="0.3" radius="0.015"/>
      </geometry>
    </collision>
    <visual name="thigh__visual">
      <origin rpy="0  0  0" xyz="0    0   0"/>
      <geometry>
        <!-- <cylinder length="0.41" radius="0.015"/> -->
        <mesh filename="package://movee_description/meshes/thigh_r.dae" scale="0.001 0.001 0.001"/>
      </geometry>
    </visual>
  </link>

  <link name="thigh_conrod_right">
    <inertial>
      <mass value="0.5"/>
      <origin rpy="0  0  0" xyz="0  0  0"/>
      <!-- <inertia ixx="4.9e-06" ixy="0" ixz="0" iyy="4.9e-06" iyz="0" izz="3.5e-08"/> -->
      <xacro:cylinder_inertia m="0.5" r="0.005" h="0.45"/>
    </inertial>
    <collision name="thigh_conrod_right__collision">
      <origin rpy="0  0  0" xyz="0    0   -0.175"/>
      <geometry>
        <cylinder length="0.35" radius="0.005"/>
      </geometry>
    </collision>
    <visual name="thigh_conrod_right__visual">
      <origin rpy="0  0  0" xyz="0    0   0"/>
      <geometry>
        <!-- <cylinder length="0.45" radius="0.005"/> -->
        <mesh filename ="package://movee_description/meshes/thigh_conrod_r.dae" scale="0.001 0.001 0.001"/>
      </geometry>
      <material name="Blue">
          <color rgba="${0/255} ${191/255} ${255/255} 1.0"/>
     </material>
    </visual>
  </link>
 
  <link name="thigh_left">
    <inertial>
      <mass value="0.5"/>
      <origin rpy="0  0  0" xyz="0  0  -0.2"/>
      <!-- <inertia ixx="4.9e-06" ixy="0" ixz="0" iyy="4.9e-06" iyz="0" izz="3.5e-08"/> -->
      <xacro:cylinder_inertia m="0.5" r="0.015" h="0.3"/>
    </inertial>
    <collision name="thigh__collision">
      <origin rpy="0  0  0" xyz="0    0   -0.15"/>
      <geometry>
        <cylinder length="0.3" radius="0.015"/>
      </geometry>
    </collision>
    <visual name="thigh__visual">
      <origin rpy="0  0  0" xyz="0    0   0"/>
      <geometry>
        <!-- <cylinder length="0.41" radius="0.015"/> -->
        <mesh filename ="package://movee_description/meshes/thigh_l.dae" scale="0.001 0.001 0.001"/>
      </geometry>
    </visual>
  </link>
    <link name="thigh_conrod_left">
    <inertial>
      <mass value="0.5"/>
      <origin rpy="0  0  0" xyz="0  0  0"/>
      <!-- <inertia ixx="4.9e-06" ixy="0" ixz="0" iyy="4.9e-06" iyz="0" izz="3.5e-08"/> -->
      <xacro:cylinder_inertia m="0.5" r="0.005" h="0.45"/>
    </inertial>
    <collision name="thigh_conrod_left__collision">
      <origin rpy="0  0  0" xyz="0    0   -0.175"/>
      <geometry>
        <cylinder length="0.35" radius="0.005"/>
      </geometry>
    </collision>
    <visual name="thigh_conrod_left__visual">
      <origin rpy="0  0  0" xyz="0    0   0"/>
      <geometry>
        <!-- <cylinder length="0.45" radius="0.005"/> -->
        <mesh filename ="package://movee_description/meshes/thigh_conrod_l.dae" scale="0.001 0.001 0.001"/>
      </geometry>
      <material name="Blue">
          <color rgba="${0/255} ${191/255} ${255/255} 1.0"/>
     </material>
    </visual>
  </link>

  <!-- =============================== Calves =============================== -->
   <link name="calf_right">
    <inertial>
      <mass value="0.5"/>
      <origin rpy="0  0  0" xyz="0  0  -0.15"/>
      <!-- <inertia ixx="4.9e-06" ixy="0" ixz="0" iyy="4.9e-06" iyz="0" izz="3.5e-08"/> -->
      <xacro:cylinder_inertia m="0.5" r="0.015" h="0.4"/>
    </inertial>
    <collision name="calf_right__collision">
      <origin rpy="0  0  0" xyz="0    0   -0.16"/>
      <geometry>
        <cylinder length="0.3" radius="0.06"/>
      </geometry>
    </collision>
    <visual name="calf_right__visual">
      <origin rpy="0  0  0" xyz="0    0   0"/>
      <geometry>        
        <mesh filename ="package://movee_description/meshes/tibia_r.dae" scale="0.001 0.001 0.001"/>
      </geometry>
    </visual>
  </link>

  <link name="calf_left">
    <inertial>
      <mass value="0.5"/>
      <origin rpy="0  0  0" xyz="0  0  -0.15"/>
      <!-- <inertia ixx="4.9e-06" ixy="0" ixz="0" iyy="4.9e-06" iyz="0" izz="3.5e-08"/> -->
      <xacro:cylinder_inertia m="0.5" r="0.015" h="0.4"/>
    </inertial>
    <collision name="calf_left__collision">
      <origin rpy="0  0  0" xyz="0    0   -0.16"/>
      <geometry>
        <cylinder length="0.3" radius="0.06"/>
      </geometry>
    </collision>
    <visual name="calf_left__visual">
      <origin rpy="0  0  0" xyz="0    0   0"/>
      <geometry>
        <mesh filename ="package://movee_description/meshes/tibia.dae" scale="0.001 0.001 0.001"/>
      </geometry>
    </visual>
  </link>

  <!-- =============================== Wheels =============================== -->
  <link name="wheel_right">
    <inertial>
      <mass value="0.8"/>
      <origin rpy="0  0  0" xyz="0  0  -0.045"/>
      <!-- <inertia ixx="5.89e-06" ixy="0" ixz="0" iyy="5.89e-06" iyz="0" izz="1.12e-05"/> -->
      <xacro:cylinder_inertia m="0.8" r="0.1" h="0.05"/>
    </inertial>
    <collision name="wheel_right__collision">
      <origin rpy="0  0  0" xyz="0    0    -0.045"/>
      <geometry>
        <cylinder length="0.06" radius="0.1"/>
      </geometry>
    </collision>
    <visual name="wheel_right__visual">
      <origin rpy="-1.56  0  0" xyz="0    0    -0.045"/>
      <geometry>
        <mesh filename ="package://movee_description/meshes/wheelp.dae" scale="0.001 0.001 0.001"/>
        <!-- <cylinder length="0.05" radius="0.1"/> -->
      </geometry>
      <material name="Black">
          <color rgba="${0/255} ${0/255} ${0/255} 1.0"/>
     </material>
    </visual>
  </link>
  <link name="wheel_left">
    <inertial>
      <mass value="0.8"/>
      <origin rpy="0  0  0" xyz="0  0  0.045"/>
      <!-- <inertia ixx="5.8e-06" ixy="0" ixz="0" iyy="5.8e-06" iyz="0" izz="1.1e-05"/> -->
      <xacro:cylinder_inertia m="0.8" r="0.1" h="0.05"/>
    </inertial>
    <collision name="wheel_left__collision">
      <origin rpy="0  0  0" xyz="0    0    0.045"/>
      <geometry>
        <cylinder length="0.06" radius="0.1"/>
      </geometry>
    </collision>
    <visual name="wheel_left__visual">
      <origin rpy="-1.56  0  0" xyz="0    0    0.045"/>
      <geometry>
        <mesh filename ="package://movee_description/meshes/wheelp.dae" scale="0.001 0.001 0.001"/>
        <!-- <cylinder length="0.05" radius="0.1"/> -->
      </geometry>
      <material name="Black">
          <color rgba="${0/255} ${0/255} ${0/255} 1.0"/>
     </material>
    </visual>
  </link>

  <!-- ========================= CASTER WHEEL ===============================  -->
  <!-- We add a caster wheel. It will be modeled as sphere.
       We define the wheel’s geometry, material and the joint to connect it to 
       base_link at the appropriate location. -->
  <link name="caster_knee_l">
    <visual>
      <origin xyz="0 0 0" rpy="0 0 0"/>
      <geometry>
        <sphere radius="0.016"/>
      </geometry>
      <material name="White">
        <color rgba="${255/255} ${255/255} ${255/255} 1.0"/>
      </material>
    </visual>
    <collision>
      <origin xyz="0 0 0" rpy="0 0 0"/>
      <geometry>
        <sphere radius="0.016"/>
      </geometry>
    </collision>
    <inertial>
      <mass value="0.01"/>
      <origin rpy="0  0  0" xyz="0  0  0.045"/>
      <xacro:sphere_inertia m="0.01" r="0.015"/>
    </inertial>
  </link>

 <link name="caster_knee_r">
    <visual>
      <origin xyz="0 0 0" rpy="0 0 0"/>
      <geometry>
        <sphere radius="0.016"/>
      </geometry>
      <material name="White">
        <color rgba="${255/255} ${255/255} ${255/255} 1.0"/>
      </material>
    </visual>
    <collision>
      <origin xyz="0 0 0" rpy="0 1.56 0"/>
      <geometry>
        <sphere radius="0.016"/>
      </geometry>
    </collision>
    <inertial>
      <mass value="0.01"/>
      <origin rpy="0  0  0" xyz="0  0  0.045"/>
      <xacro:sphere_inertia m="0.01" r="0.015"/>
    </inertial>
  </link>
  
  <link name="caster_f">
    <visual>
      <origin xyz="0 0 0" rpy="0 1.56 0"/>
      <geometry>
        <sphere radius="0.0155"/>        
        <!-- <cylinder length="0.15" radius="0.0155"/> -->
      </geometry>
      <material name="White">
        <color rgba="${255/255} ${255/255} ${255/255} 1.0"/>
      </material>
    </visual>
    <collision>
      <origin xyz="0 0 0" rpy="0 1.56 0"/>
      <geometry>
        <sphere radius="0.0155"/>
        <!-- <cylinder length="0.03" radius="0.0155"/> -->
      </geometry>
    </collision>
    <inertial>
      <mass value="0.01"/>
      <origin rpy="0  0  0" xyz="0  0  0"/>
      <xacro:sphere_inertia m="0.01" r="0.155"/>
    </inertial>
  </link>

  <link name="caster_b">
    <visual>
      <origin xyz="0 0 0" rpy="0 1.56 0"/>
      <geometry>
        <sphere radius="0.0155"/>
        <!-- <cylinder length="0.15" radius="0.0155"/> -->
      </geometry>
      <material name="White">
        <color rgba="${255/255} ${255/255} ${255/255} 1.0"/>
      </material>
    </visual>
    <collision>
      <origin xyz="0 0 0" rpy="0 1.56 0"/>
      <geometry>
        <sphere radius="0.0155"/>
        <!-- <cylinder length="0.03" radius="0.0155"/> -->
      </geometry>
    </collision>
    <inertial>
      <mass value="0.01"/>
      <origin rpy="0  0  0" xyz="0  0  0"/>
      <xacro:sphere_inertia m="0.01" r="0.155"/>
    </inertial>
  </link>

  
 

    <!-- *********************** IMU SETUP *********************************  -->
  <!-- Each sensor must be attached to a link.                              --> 


  <link name="imu_link"/>


  <!-- *********************** LIDAR SETUP **********************************  -->
  
  <link name="lidar_link">
  
    <collision>
     <origin xyz="0 0 0" rpy="0 0 0"/>
     <geometry>
      <cylinder radius="0.0508" length="0.08"/>
     </geometry>
    </collision> 
    
    <visual>
     <origin xyz="0 0 -0.04" rpy="0 0 0"/>
     <geometry>
      <mesh filename ="package://movee_description/meshes/hokuyo.dae" scale="1 1 1"/>
     </geometry>
     <material name="Black">
          <color rgba="${0/255} ${0/255} ${0/255} 1.0"/>
     </material>
    </visual>
    
    <inertial>
      <mass value="2" />
      <origin xyz="0 0 -0.04" rpy="0 0 0"/>
      <xacro:box_inertia m="0.2" x="0.08" y="0.08" z="0.08"/>
    </inertial>
  </link>


 <!-- *********************** Realsense CAMERA SETUP **********************************  -->
 
  <link name="front_camera_link">
  
    <collision>
     <origin xyz="0 0 0" rpy="0 0 0"/>
     <geometry>
      <cylinder radius="0.001" length="0.001"/>
     </geometry>
    </collision>
    
    <visual>
     <origin xyz="0 0 0.0" rpy="0 0 0"/>
     <geometry>
      <mesh filename ="package://movee_description/meshes/xtion_pro.dae"/>

     </geometry>
     <material name="yellow"/>
    </visual>
    
    <inertial>
      <mass value="0.15" />
      <origin xyz="0 0 0" rpy="0 0 0"/>
      <xacro:box_inertia m="0.15" x="0.04" y="0.2" z="0.04"/>
    </inertial>
  </link>


    
<!-- ============================================================================================= -->
<!-- ============================== Joint and Transmissions definition =========================== -->

<!-- Dummy joint for KDL -->
  <joint name="base_to_chassis" type="fixed">
    <parent link="base_link"/>
    <child link="chassis"/>
    <origin rpy="0  0  -1.5708" xyz="0 0 ${base_height}"/>
  </joint>

  <joint name="chassis_to_rail" type="fixed">
    <parent link="chassis"/>
    <child link="balancing_rail"/>
    <origin rpy="0  0  -0" xyz="0 0 -0.1"/>
  </joint>

  <joint name="counterweight_slide" type="prismatic">
    <parent link="balancing_rail"/>
    <child link="counterweight"/>
    <origin rpy="0  0  0" xyz="0 0 0"/>
    <axis xyz="0  1  0"/>
    <limit effort="1000.0" lower="-0.15" upper="0.15" velocity="10"/>
  </joint>

 <!-- <joint name="hip_pivot_right" type="prismatic">
    <parent link="balancing_rail"/>
    <child link="counterweight"/>
    <origin rpy="0  0  0" xyz="0 0 0"/>
    <axis xyz="0  1  0"/>
    <limit effort="100" lower="-0.2" upper="0.2" velocity="10"/>
  </joint> -->








  <!-- Hip -->

  <joint name="hip_pivot_right" type="revolute">
    <parent link="chassis"/>
    <child link="thigh_right"/>
    <origin rpy="-2.2  0  0" xyz="0.13  0  0"/>
    <axis xyz="1  0  0"/>
    <limit effort="100" lower="0.55" upper="1.65" velocity="3"/>
  </joint>
   <!-- <transmission name="hip_pivot_right_trans">
    <type>transmission_interface/SimpleTransmission</type>
    <joint name="hip_pivot_right">
      <hardwareInterface>hardware_interface/PositionJointInterface</hardwareInterface>
    </joint>
    <actuator name="hip_motor_right">
      <hardwareInterface>hardware_interface/PositionJointInterface</hardwareInterface>
      <mechanicalReduction>1</mechanicalReduction>
    </actuator>
  </transmission> -->


  <joint name="knee_pivot_conrod_right" type="revolute">
    <parent link="calf_right"/>
    <child link="thigh_conrod_right"/>
    <origin rpy="-0.4  0  0" xyz="0  0.007  0.046"/>
    <axis xyz="1  0  0"/>
    <limit effort="100" lower="1.1" upper="2.5"  velocity="3.0"/>
    <!-- <mimic joint ="knee_pivot_right" multiplier="-1" offset ="1.3"/>   -->
  </joint>
  

  <joint name="hip_pivot_left" type="revolute">
    <parent link="chassis"/>
    <child link="thigh_left"/>
    <origin rpy="-2.2 0  0" xyz="-0.13 0  0"/>
    <axis xyz="1  0  0"/>
   <limit effort="100" lower="0.5" upper="1.65" velocity="3"/>
  </joint>
   <!-- <transmission name="hip_pivot_left_trans">
    <type>transmission_interface/SimpleTransmission</type>
    <joint name="hip_pivot_left">
      <hardwareInterface>hardware_interface/PositionJointInterface</hardwareInterface>
    </joint>
    <actuator name="hip_motor_left">
      <hardwareInterface>hardware_interface/PositionJointInterface</hardwareInterface>
      <mechanicalReduction>1</mechanicalReduction>
    </actuator>
  </transmission> -->
  <joint name="knee_pivot_conrod_left" type="revolute">
    <parent link="calf_left"/>
    <child link="thigh_conrod_left"/>
    <origin rpy="-0.4  0  0" xyz="0  0.007  0.046"/>
    <axis xyz="1  0  0"/>
    <limit effort="100" lower="1.1" upper="2.5"  velocity="-1.0"/>
    <!-- <mimic joint ="knee_pivot_left" multiplier="-1" offset ="1.3"/> -->

  </joint>
 
<!-- Knees -->
  <joint name="knee_pivot_right" type="revolute">
    <parent link="thigh_right"/>
    <child link="calf_right"/>
    <origin rpy="2.35  0  0" xyz="0  0  ${-thigh_length}"/>
    <axis xyz="1  0  0"/>
    <limit effort="100.0" lower="-0.9" upper="0.5" velocity="3.0"/>
    <!-- <mimic joint ="hip_pivot_right" multiplier="-1" offset ="0.75"/>   -->
    <!-- <limit effort="-1.0" lower="-3.14" upper="3.14" velocity="-1.0"/> -->
  </joint>  
  <!-- <transmission name="knee_pivot_right_trans">
    <type>transmission_interface/SimpleTransmission</type>
    <joint name="knee_pivot_right">
      <hardwareInterface>hardware_interface/PositionJointInterface</hardwareInterface>
    </joint>
    <actuator name="knee_motor_right">
      <hardwareInterface>hardware_interface/PositionJointInterface</hardwareInterface>
      <mechanicalReduction>1</mechanicalReduction>
    </actuator>
  </transmission> -->


  <joint name="knee_pivot_left" type="revolute">
    <parent link="thigh_left"/>
    <child link="calf_left"/>
    <origin rpy="2.35  0  0" xyz="0 0 ${-thigh_length}"/>
    <axis xyz="1  0  0"/>
    <limit effort="100.0" lower="-0.9" upper="0.5" velocity="3.0"/>
    <!-- <mimic joint ="hip_pivot_left" multiplier="-1" offset ="0.75"/>   -->
  </joint>
  <!-- <transmission name="knee_pivot_left_trans">
    <type>transmission_interface/SimpleTransmission</type>
    <joint name="knee_pivot_left">
      <hardwareInterface>hardware_interface/PositionJointInterface</hardwareInterface>
    </joint>

    <actuator name="knee_motor_left">
      <hardwareInterface>hardware_interface/PositionJointInterface</hardwareInterface>
      <mechanicalReduction>1</mechanicalReduction>
    </actuator>
  </transmission> -->
    <!-- <joint name="knee_conrod_pivot_left" type="revolute">
    <parent link="thigh_conrod_left"/>
    <child link="calf_left"/>
    <origin rpy="1.8  0  0" xyz="0  0  -0.38"/>
    <axis xyz="1  0  0"/>
    <limit effort="-1.0" lower="0.1" upper="1" velocity="-1.0"/>   
  </joint>   -->


  
<!-- 4 bar linkage woraround with SDF injection. Not yet functionnal
Issue 25 : https://github.com/gazebosim/gz-physics/issues/25

<gazebo>
  <joint name="hip_pivot_conrod_left" type="revolute">
    <child link="chassis"/>
    <parent link="thigh_conrod_left"/>
    <origin rpy="1.3  0  0" xyz="0  0.0  ${thigh_conrod_length}"/>
    <axis xyz="1  0  0">
      <limit>
          <lower>-1e+16</lower>
          <upper>1e+16</upper>
      </limit>
      <dynamics>
        <spring_reference>0</spring_reference>
        <spring_stiffness>0</spring_stiffness>
      </dynamics>
      <use_parent_model_frame>1</use_parent_model_frame>
    </axis>
  </joint>
</gazebo> -->


 <!-- Wheels-->
  <joint name="right_wheel_joint" type="continuous">
    <parent link="calf_right"/>
    <child link="wheel_right"/>
    <origin rpy="0  1.56  3.14159" xyz="-0.0  0.0 ${-calf_length}"/>
    <axis xyz="0  0  1"/>
    <dynamics damping="0.2" />
 
    <!-- <limit effort="-1.0" lower="-3.14" upper="3.14" velocity="-1.0"/> -->
  </joint>
  <!-- <transmission name="left_wheel_joint_trans">
    <type>transmission_interface/SimpleTransmission</type>
    <joint name="left_wheel_joint">
      <hardwareInterface>hardware_interface/VelocityJointInterface</hardwareInterface>
    </joint>
    <actuator name="wheel_motor_right">
      <hardwareInterface>hardware_interface/VelocityJointInterface</hardwareInterface>
      <mechanicalReduction>1</mechanicalReduction>
    </actuator>
  </transmission> -->

  <joint name="left_wheel_joint" type="continuous">
    <parent link="calf_left"/>
    <child link="wheel_left"/>
    <origin rpy="0.0  1.56  3.14159" xyz="0.0 -0.0 ${-calf_length}"/>
    <axis xyz="0   0   1"/>
    <dynamics damping="0.2" />
    <!-- <limit effort="-1.0" lower="-3.14" upper="3.14" velocity="-1.0"/> -->
  </joint>
  <!-- <transmission name="right_wheel_joint_trans">
    <type>transmission_interface/SimpleTransmission</type>
    <joint name="right_wheel_joint">
      <hardwareInterface>hardware_interface/VelocityJointInterface</hardwareInterface>
    </joint>
    <actuator name="wheel_motor_left">
      <hardwareInterface>hardware_interface/VelocityJointInterface</hardwareInterface>
      <mechanicalReduction>1</mechanicalReduction>
    </actuator>
  </transmission> -->

 <!-- Caster Wheels-->

 <joint name="caster_knee_joint_l" type="fixed">
    <parent link="calf_left"/>
    <child link="caster_knee_l"/>
    <origin rpy="0 0 0"  xyz="0 -0.07 0.036"/>
  </joint>

  <joint name="caster_knee_joint_r" type="fixed">
    <parent link="calf_right"/>
    <child link="caster_knee_r"/>
    <origin rpy="0 0 0"  xyz="0 -0.07 0.036"/>
  </joint>

  <joint name="caster_joint_f" type="fixed">
    <parent link="chassis"/>
    <child link="caster_f"/>
    <origin rpy="0 0 0"  xyz="0 0.3 -0.43"/>
  </joint>
  <joint name="caster_joint_b" type="fixed">
    <parent link="chassis"/>
    <child link="caster_b"/>
    <origin rpy="0 0 0"  xyz="0 -0.3 -0.43"/>
  </joint>

  
    <!-- Sensors -->
  <joint name="imu_joint" type="fixed">
    <parent link="chassis"/>
    <child link="imu_link"/>
    <origin  rpy="0 0 1.56" xyz="0 0 0.03"/>
  </joint>

  <joint name="lidar_joint" type="fixed">
    <parent link="chassis"/>
    <child link="lidar_link"/>
    <origin  rpy="0 0 1.5708" xyz="0 0.14 0.05"/>
  </joint>

   <joint name="front_camera_joint" type="fixed">
    <parent link="chassis"/>
    <child link="front_camera_link"/>
    <origin rpy="0 0 1.56"  xyz="0 0.15 -0.05"/>
  </joint>


   
   <!-- END of Robot description -->

</robot>
 
  