<?xml version="1.0" encoding="utf-8"?>
<COLLADA xmlns="http://www.collada.org/2005/11/COLLADASchema" version="1.4.1" xmlns:xsi="http://www.w3.org/2001/XMLSchema-instance">
  <asset>
    <contributor>
      <author>Blender User</author>
      <authoring_tool>Blender 3.3.1 commit date:2022-10-04, commit time:18:35, hash:b292cfe5a936</authoring_tool>
    </contributor>
    <created>2022-11-16T04:44:08</created>
    <modified>2022-11-16T04:44:08</modified>
    <unit name="meter" meter="1"/>
    <up_axis>Z_UP</up_axis>
  </asset>
  <library_cameras>
    <camera id="Camera_001-camera" name="Camera.001">
      <optics>
        <technique_common>
          <perspective>
            <xfov sid="xfov">39.59775</xfov>
            <aspect_ratio>1.777778</aspect_ratio>
            <znear sid="znear">0.1</znear>
            <zfar sid="zfar">100</zfar>
          </perspective>
        </technique_common>
      </optics>
      <extra>
        <technique profile="blender">
          <shiftx sid="shiftx" type="float">0</shiftx>
          <shifty sid="shifty" type="float">0</shifty>
          <dof_distance sid="dof_distance" type="float">10</dof_distance>
        </technique>
      </extra>
    </camera>
    <camera id="Camera-camera" name="Camera">
      <optics>
        <technique_common>
          <perspective>
            <xfov sid="xfov">39.59775</xfov>
            <aspect_ratio>1.777778</aspect_ratio>
            <znear sid="znear">0.1</znear>
            <zfar sid="zfar">100</zfar>
          </perspective>
        </technique_common>
      </optics>
      <extra>
        <technique profile="blender">
          <shiftx sid="shiftx" type="float">0</shiftx>
          <shifty sid="shifty" type="float">0</shifty>
          <dof_distance sid="dof_distance" type="float">10</dof_distance>
        </technique>
      </extra>
    </camera>
  </library_cameras>
  <library_lights>
    <light id="Light_001-light" name="Light.001">
      <technique_common>
        <point>
          <color sid="color">1000 1000 1000</color>
          <constant_attenuation>1</constant_attenuation>
          <linear_attenuation>0</linear_attenuation>
          <quadratic_attenuation>0.00111109</quadratic_attenuation>
        </point>
      </technique_common>
      <extra>
        <technique profile="blender">
          <type sid="type" type="int">0</type>
          <flag sid="flag" type="int">0</flag>
          <mode sid="mode" type="int">1</mode>
          <gamma sid="blender_gamma" type="float">1</gamma>
          <red sid="red" type="float">1</red>
          <green sid="green" type="float">1</green>
          <blue sid="blue" type="float">1</blue>
          <shadow_r sid="blender_shadow_r" type="float">0</shadow_r>
          <shadow_g sid="blender_shadow_g" type="float">0</shadow_g>
          <shadow_b sid="blender_shadow_b" type="float">0</shadow_b>
          <energy sid="blender_energy" type="float">1000</energy>
          <dist sid="blender_dist" type="float">29.99998</dist>
          <spotsize sid="spotsize" type="float">75</spotsize>
          <spotblend sid="spotblend" type="float">0.15</spotblend>
          <att1 sid="att1" type="float">0</att1>
          <att2 sid="att2" type="float">1</att2>
          <falloff_type sid="falloff_type" type="int">2</falloff_type>
          <clipsta sid="clipsta" type="float">0.04999995</clipsta>
          <clipend sid="clipend" type="float">30.002</clipend>
          <bias sid="bias" type="float">1</bias>
          <soft sid="soft" type="float">3</soft>
          <bufsize sid="bufsize" type="int">2880</bufsize>
          <samp sid="samp" type="int">3</samp>
          <buffers sid="buffers" type="int">1</buffers>
          <area_shape sid="area_shape" type="int">1</area_shape>
          <area_size sid="area_size" type="float">0.1</area_size>
          <area_sizey sid="area_sizey" type="float">0.1</area_sizey>
          <area_sizez sid="area_sizez" type="float">1</area_sizez>
        </technique>
      </extra>
    </light>
    <light id="Light-light" name="Light">
      <technique_common>
        <point>
          <color sid="color">1000 1000 1000</color>
          <constant_attenuation>1</constant_attenuation>
          <linear_attenuation>0</linear_attenuation>
          <quadratic_attenuation>0.00111109</quadratic_attenuation>
        </point>
      </technique_common>
      <extra>
        <technique profile="blender">
          <type sid="type" type="int">0</type>
          <flag sid="flag" type="int">0</flag>
          <mode sid="mode" type="int">1</mode>
          <gamma sid="blender_gamma" type="float">1</gamma>
          <red sid="red" type="float">1</red>
          <green sid="green" type="float">1</green>
          <blue sid="blue" type="float">1</blue>
          <shadow_r sid="blender_shadow_r" type="float">0</shadow_r>
          <shadow_g sid="blender_shadow_g" type="float">0</shadow_g>
          <shadow_b sid="blender_shadow_b" type="float">0</shadow_b>
          <energy sid="blender_energy" type="float">1000</energy>
          <dist sid="blender_dist" type="float">29.99998</dist>
          <spotsize sid="spotsize" type="float">75</spotsize>
          <spotblend sid="spotblend" type="float">0.15</spotblend>
          <att1 sid="att1" type="float">0</att1>
          <att2 sid="att2" type="float">1</att2>
          <falloff_type sid="falloff_type" type="int">2</falloff_type>
          <clipsta sid="clipsta" type="float">0.04999995</clipsta>
          <clipend sid="clipend" type="float">30.002</clipend>
          <bias sid="bias" type="float">1</bias>
          <soft sid="soft" type="float">3</soft>
          <bufsize sid="bufsize" type="int">2880</bufsize>
          <samp sid="samp" type="int">3</samp>
          <buffers sid="buffers" type="int">1</buffers>
          <area_shape sid="area_shape" type="int">1</area_shape>
          <area_size sid="area_size" type="float">0.1</area_size>
          <area_sizey sid="area_sizey" type="float">0.1</area_sizey>
          <area_sizez sid="area_sizez" type="float">1</area_sizez>
        </technique>
      </extra>
    </light>
  </library_lights>
  <library_effects>
    <effect id="Material_004-effect">
      <profile_COMMON>
        <technique sid="common">
          <lambert>
            <emission>
              <color sid="emission">0 0 0 1</color>
            </emission>
            <diffuse>
              <color sid="diffuse">0.1620291 0.2158603 0.2788943 1</color>
            </diffuse>
            <index_of_refraction>
              <float sid="ior">1.45</float>
            </index_of_refraction>
          </lambert>
        </technique>
      </profile_COMMON>
    </effect>
  </library_effects>
  <library_images/>
  <library_materials>
    <material id="Material_004-material" name="Material.004">
      <instance_effect url="#Material_004-effect"/>
    </material>
  </library_materials>
  <library_geometries>
    <geometry id="shape0_003-mesh" name="shape0.003">
      <mesh>
        <source id="shape0_003-mesh-positions">
          <float_array id="shape0_003-mesh-positions-array" count="702">24.4241 42.8208 -58.9382 -25.5759 -1.00887 -59.346 -25.5759 42.8208 -58.9382 -39.8109 -1.50316 -6.22236 -30.1511 92.2489 -41.4026 28.9993 92.2489 -41.4026 38.6592 105.034 -5.23106 38.6592 -1.50316 -6.22236 24.4241 -1.00887 -59.346 -130.615 -131.003 -60.5555 -139.711 -1.00887 -59.346 -139.711 -121.724 -60.4692 -115.781 -1.21298 -37.4095 -111.389 -1.19237 -39.6239 -96.8924 -1.17509 -41.4801 -158.16 -1.10843 -48.6457 -123.139 -1.27322 -30.9338 -119.735 -1.24019 -34.4848 -106.686 -1.17897 -41.0641 -101.807 -1.17316 -41.6889 -144.683 -116.677 -57.5379 129.464 -131.003 -60.5555 -92.08401 -1.18474 -40.4439 -87.52 -1.20181 -38.61 -83.3315 -1.2258 -36.0312 -79.6392 -1.25604 -32.7816 -76.5491 -1.29164 -28.9548 -74.1503 -1.3316 -24.6609 -72.5116 -1.37476 -20.0233 138.559 -1.00887 -59.346 138.559 -121.724 -60.4692 84.2192 -1.21298 -37.4095 88.6113 -1.19237 -39.6239 70.8413 -1.39714 -17.6171 72.0807 -1.35284 -22.3769 74.1067 -1.31114 -26.8588 76.8611 -1.27322 -30.9338 80.2645 -1.24019 -34.4848 93.3144 -1.17897 -41.0641 98.1933 -1.17316 -41.6889 157.008 -1.10843 -48.6457 157.008 -91.5491 -49.4872 143.532 -116.677 -57.5379 107.916 -1.18474 -40.4439 112.48 -1.20181 -38.61 103.108 -1.17509 -41.4801 116.668 -1.2258 -36.0312 120.361 -1.25604 -32.7816 -91.4113 -171.374 -20.9294 -91.4113 -172.705 122.201 143.532 -118.079 93.1948 90.2595 -172.705 122.201 90.2595 -171.374 -20.9294 -158.16 -91.5491 -49.4872 -144.683 -118.079 93.1948 -147.423 -112.958 93.4118 -165.473 -78.5784 26.3672 164.321 -78.5784 26.3672 -165.473 -1.81303 27.0815 -129.576 -1.44273 -12.7162 -129.159 -1.39714 -17.6171 -127.919 -1.35284 -22.3769 -125.893 -1.31114 -26.8588 164.321 -1.81303 27.0815 125.85 -1.3316 -24.6609 127.488 -1.37476 -20.0233 128.32 -1.41986 -15.1755 123.451 -1.29164 -28.9548 -39.8109 105.034 -5.23106 -101.807 -21.1723 -41.8749 -106.686 -21.1781 -41.2502 98.1933 -21.1723 -41.8749 93.3144 -21.1781 -41.2502 -96.8924 -21.1742 -41.6662 -100.576 -21.4419 -12.9023 103.108 -21.1742 -41.6662 99.4241 -21.4419 -12.9023 -92.08401 -21.1839 -40.63 107.916 -21.1839 -40.63 -111.389 -21.1915 -39.8099 88.6113 -21.1915 -39.8099 -87.52 -21.201 -38.7961 112.48 -21.201 -38.7961 -115.781 -21.2121 -37.5956 84.2192 -21.2121 -37.5956 -83.3315 -21.2249 -36.2172 116.668 -21.2249 -36.2172 -119.735 -21.2393 -34.6709 80.2645 -21.2393 -34.6709 -79.6392 -21.2552 -32.9677 120.361 -21.2552 -32.9677 -123.139 -21.2724 -31.1199 76.8611 -21.2724 -31.1199 -76.5491 -21.2908 -29.1409 123.451 -21.2908 -29.1409 -125.893 -21.3103 -27.0449 74.1067 -21.3103 -27.0449 -74.1503 -21.3307 -24.8469 125.85 -21.3307 -24.8469 -127.919 -21.352 -22.563 72.0807 -21.352 -22.563 -72.5116 -21.3739 -20.2094 127.488 -21.3739 -20.2094 -129.159 -21.3963 -17.8031 70.8413 -21.3963 -17.8031 -71.6804 -1.41986 -15.1755 -71.6804 -21.419 -15.3616 128.32 -21.419 -15.3616 -129.576 -21.4419 -12.9023 70.4241 -1.44273 -12.7162 70.4241 -21.4419 -12.9023 -71.5759 -1.44273 -12.7162 128.32 -1.46562 -10.257 -71.5759 -21.4419 -12.9023 128.32 -21.4648 -10.4431 -129.159 -1.48834 -7.81543 -129.159 -21.4875 -8.00151 -71.6804 -1.46562 -10.257 70.8413 -1.48834 -7.81543 70.8413 -21.4875 -8.00151 -71.6804 -21.4648 -10.4431 -76.5491 -21.593 3.33624 -74.1503 -21.553 -0.957703 -72.5116 -21.5099 -5.59529 -87.52 -21.6828 12.9914 -83.3315 -21.6588 10.4126 -79.6392 -21.6286 7.16302 -101.807 -21.7115 16.0703 -96.8924 -21.7095 15.8616 -92.08401 -21.6999 14.8253 -115.781 -21.6716 11.791 -111.389 -21.6922 14.0053 -106.686 -21.7056 15.4456 -125.893 -21.5735 1.24022 -123.139 -21.6114 5.31526 -119.735 -21.6444 8.86623 -127.919 -21.5318 -3.24168 125.85 -21.553 -0.957703 127.488 -21.5099 -5.59529 116.668 -21.6588 10.4126 120.361 -21.6286 7.16302 123.451 -21.593 3.33624 103.108 -21.7095 15.8616 107.916 -21.6999 14.8253 112.48 -21.6828 12.9914 88.6113 -21.6922 14.0053 93.3144 -21.7056 15.4456 98.1933 -21.7115 16.0703 76.8611 -21.6114 5.31526 80.2645 -21.6444 8.86623 84.2192 -21.6716 11.791 72.0807 -21.5318 -3.24168 74.1067 -21.5735 1.24022 -72.5116 -1.51073 -5.40921 127.488 -1.51073 -5.40921 -127.919 -1.53262 -3.0556 72.0807 -1.53262 -3.0556 13.2949 138.606 89.7461 -14.4467 138.606 89.7461 13.2949 -2.3839 88.4343 -14.4467 -2.3839 88.4343 -76.5491 -1.59383 3.52232 -74.1503 -1.55388 -0.771622 74.1067 -1.57433 1.4263 125.85 -1.55388 -0.771622 -125.893 -1.57433 1.4263 123.451 -1.59383 3.52232 -123.139 -1.61224 5.50134 76.8611 -1.61224 5.50134 -79.6392 -1.62944 7.34911 120.361 -1.62944 7.34911 -119.735 -1.64528 9.05231 80.2645 -1.64528 9.05231 -83.3315 -1.65967 10.5987 139.644 -2.66992 119.174 116.668 -1.65967 10.5987 -115.781 -1.6725 11.977 84.2192 -1.6725 11.977 -87.52 -1.68367 13.1775 112.48 -1.68367 13.1775 -140.796 -2.66992 119.174 -111.389 -1.6931 14.1914 88.6113 -1.6931 14.1914 -106.124 -2.61246 112.998 -92.08401 -1.70073 15.0114 107.916 -1.70073 15.0114 -106.686 -1.7065 15.6316 93.3144 -1.7065 15.6316 -96.8924 -1.71037 16.0476 104.972 -2.61246 112.998 103.108 -1.71037 16.0476 -101.807 -1.71231 16.2564 98.1933 -1.71231 16.2564 -140.796 -90.8852 118.353 139.644 -90.8852 118.353 146.271 -112.958 93.4118 -79.7589 152.241 128.322 -106.124 147.318 114.393 104.972 147.318 114.393 -68.2215 -172.985 152.193 -86.6665 -103.238 179.713 85.5147 -103.238 179.713 -185.576 152.337 128.593 -185.576 157.123 142.134 -79.7589 157.123 142.134 78.6071 157.123 142.134 184.424 152.337 128.593 78.6071 152.241 128.322 184.424 -0.03234857 127.176 -185.576 -0.03234857 127.176 67.0697 -172.985 152.193 -79.7589 139.154 128.2 78.6071 139.154 128.2 -79.7589 138.844 161.532 78.6071 138.844 161.532 184.424 157.123 142.134 184.424 28.8341 148.507 -185.576 28.8341 148.507 -158.02 24.1087 180.898 156.869 24.1087 180.898 -154.784 157.117 142.796 -185.576 157.117 142.796 -79.7589 156.941 161.7 153.632 157.117 142.796 78.6071 156.941 161.7 184.424 157.117 142.796 184.424 152.396 149.656 -185.576 152.396 149.656 -81.8445 156.751 182.132 -149.787 130.219 181.885 80.6928 156.751 182.132 148.635 130.219 181.885 156.869 130.219 181.885 -158.02 130.219 181.885</float_array>
          <technique_common>
            <accessor source="#shape0_003-mesh-positions-array" count="234" stride="3">
              <param name="X" type="float"/>
              <param name="Y" type="float"/>
              <param name="Z" type="float"/>
            </accessor>
          </technique_common>
        </source>
        <source id="shape0_003-mesh-normals">
          <float_array id="shape0_003-mesh-normals-array" count="1353">0 0.009303927 -0.9999568 -0.9659262 0.002407968 -0.2588069 -0.9659262 0.002408027 -0.258807 0 0.3343521 -0.9424482 0.9659253 0.00240916 -0.2588096 0.9659258 0.002408146 -0.2588086 0.9659257 0.002408027 -0.2588087 0 0.009303927 -0.9999568 0 0.3343523 -0.9424481 0 0.009303808 -0.9999567 2.66803e-6 0.009304046 -0.9999567 -8.8125e-7 0.9999568 0.009305119 0 0.9999568 0.009303331 -1.35942e-7 0.9999567 0.009303748 1.61837e-6 0.9999567 0.009302675 4.38102e-7 0.9999568 0.009303689 0 0.9999567 0.009303867 5.55692e-7 0.9999567 0.009302794 -2.87795e-6 0.9999567 0.009310126 -0.5017305 0.008045494 -0.8649867 -0.5017774 0.008047997 -0.8649594 0 0.009303808 -0.9999567 0 0.009303808 -0.9999568 1.06221e-6 0.9999567 0.009307563 6.31975e-7 0.9999568 0.009306073 -4.0219e-7 0.9999567 0.009302973 3.90137e-7 0.9999568 0.00930494 -6.27008e-7 0.9999568 0.009302914 8.49776e-7 0.9999568 0.009305298 1.12229e-6 0.9999567 0.009305715 -3.038e-7 0.9999568 0.009303987 0 0.009304106 -0.9999568 -1.35819e-6 0.009302139 -0.9999567 -5.75288e-7 0.9999567 0.009305715 0 0.9999567 0.009304106 -1.84672e-6 0.9999567 0.009306132 0 0.9999567 0.009303689 -5.68378e-7 0.9999567 0.009304702 8.89918e-7 0.9999567 0.009302079 2.62433e-7 0.9999567 0.00930345 0 0.9999567 0.009303748 4.61534e-7 0.9999567 0.009302198 0 0.9999568 0.009304046 0.5017301 0.008048236 -0.8649868 0.5017383 0.008050441 -0.8649821 0.5017014 0.008048355 -0.8650035 9.23743e-7 0.9999567 0.009305298 -2.38388e-6 0.9999569 0.009298622 1.38418e-6 0.9999567 0.009306073 -6.43614e-7 0.9999568 0.009303331 6.79268e-7 0.9999568 0.009304583 0 0.9999568 0.009304106 -0.714128 -0.6999838 -0.006628632 -0.7141757 -0.6999363 -0.006508767 -0.7142413 -0.6998698 -0.006472706 0.7141807 -0.6999312 -0.006510198 0.7141757 -0.6999363 -0.00650978 0.7141667 -0.6999455 -0.00651431 0 -0.7004922 -0.7136601 0 -0.7004921 -0.7136602 0.7141795 -0.6999325 -0.006508827 -0.5017138 0.008048236 -0.8649963 -0.8817934 -0.4716155 -0.004386603 -0.8818335 -0.4715407 -0.004389286 -0.8818275 -0.4715517 -0.004382729 -0.7141807 -0.6999312 -0.006510078 0.8818399 -0.4715285 -0.004385828 0.8818421 -0.4715245 -0.004389166 -1.34362e-7 0.9999568 0.009304046 2.21389e-6 0.9999567 0.009302079 -2.07459e-6 0.9999567 0.009306192 0 0.9999567 0.009303629 -6.07572e-7 0.9999567 0.009304702 -0.9953699 8.94355e-4 -0.09611493 0.9953699 8.94905e-4 -0.09611499 0.9953699 8.94172e-4 -0.09611487 1.15191e-6 0.9999568 0.009305596 -1.45113e-6 0.9999567 0.009303033 -2.55251e-7 0.9999568 0.009304046 -6.04646e-7 0.9999567 0.009302794 8.57296e-7 0.9999568 0.009305357 -0.9953699 8.94507e-4 -0.09611499 0 0.9428374 -0.3332535 0 0.9428375 -0.333253 -0.9659261 0.002408146 -0.2588068 -0.04245001 -0.009291648 0.9990554 0.1270056 -0.009224653 0.9918591 0.1270276 -0.0092296 0.9918563 -0.04244923 -0.009291648 0.9990555 0.1270081 -0.009224712 0.9918588 0.1270301 -0.0092296 0.9918559 -0.04242771 -0.009296536 0.9990563 2.99926e-6 0.9999567 0.009304881 -8.62924e-6 0.9999568 0.009305357 -0.04242694 -0.009296596 0.9990563 2.99932e-6 0.9999567 0.009304702 -8.62909e-6 0.9999567 0.009305298 -0.2106717 -0.009096264 0.9775146 -0.2106877 -0.009096145 0.9775112 -0.2106704 -0.009096086 0.9775149 1.11605e-5 0.9999567 0.00930792 -0.2106863 -0.009096145 0.9775114 1.11614e-5 0.9999567 0.009307801 0.2928397 -0.008897185 0.9561203 0.2928192 -0.008892297 0.9561265 0.2928339 -0.008897244 0.9561219 0.2928135 -0.008892297 0.9561283 4.36153e-7 0.9999567 0.009305357 4.36144e-7 0.9999568 0.009305357 -0.3728588 -0.008633971 0.9278479 -0.3728604 -0.008633732 0.9278473 -0.3728581 -0.008633971 0.9278482 7.26603e-6 0.9999568 0.009306073 -0.3728597 -0.00863403 0.9278476 7.26605e-6 0.9999567 0.00930655 0.4502028 -0.008304297 0.8928877 0.4502197 -0.008308291 0.8928791 0.4501946 -0.008304357 0.8928918 0.4502116 -0.008308768 0.8928832 1.2749e-6 0.9999567 0.009305059 1.27487e-6 0.9999567 0.009304881 -0.5242991 -0.007923483 0.8514973 -0.5243434 -0.007923543 0.8514701 -0.5243142 -0.007919073 0.8514881 -1.70277e-5 0.9999569 0.009294986 -0.5243585 -0.007918536 0.8514608 -1.70292e-5 0.9999569 0.009294629 0.5946937 -0.00748074 0.8039177 0.5946938 -0.00748074 0.8039175 0.5946254 -0.007481276 0.8039681 0.5946257 -0.007481157 0.803968 2.99296e-6 0.9999567 0.009303867 2.9926e-6 0.9999567 0.009303629 -0.6606884 -0.00698173 0.7506279 -0.6606177 -0.006981611 0.7506901 -0.6606752 -0.006984949 0.7506395 9.14907e-6 0.9999567 0.009313344 -0.6606044 -0.006985425 0.7507018 9.14812e-6 0.9999567 0.009312987 0.7219064 -0.00643891 0.6919608 0.7219057 -0.00643891 0.6919615 0.7219675 -0.006438851 0.691897 0.7219669 -0.006437599 0.6918976 -7.80972e-6 0.9999567 0.009314119 -7.81034e-6 0.9999567 0.009314417 -0.7780308 -0.005845665 0.6281991 -0.7780414 -0.005845725 0.6281859 -0.7780315 -0.005845665 0.6281982 -8.85692e-7 0.9999567 0.009303689 -0.7780421 -0.005845725 0.628185 -8.85706e-7 0.9999567 0.009304046 0.8285416 -0.005210578 0.5599033 0.8285419 -0.005209386 0.5599029 0.8285035 -0.005210757 0.5599597 0.8285039 -0.005210399 0.5599594 2.00973e-6 0.9999569 0.009300708 2.00963e-6 0.9999569 0.009300708 -0.8730165 -0.00453788 0.4876697 -0.8729994 -0.004537761 0.4877004 -0.8730211 -0.004535317 0.4876615 -6.37771e-6 0.9999569 0.009294211 -0.873004 -0.004536509 0.4876922 -6.37755e-6 0.9999569 0.009294629 0.9112311 -0.003832221 0.4118779 0.911231 -0.003833055 0.4118782 0.9112311 -0.00383234 0.4118779 0.911231 -0.003832399 0.4118782 3.18725e-7 0.9999567 0.009304225 3.18721e-7 0.9999567 0.009304106 -0.9428733 -0.003097772 0.3331371 -0.9429177 -0.003097295 0.3330116 -0.9428713 -0.003100335 0.3331429 2.17989e-6 0.9999566 0.009315133 -0.9429156 -0.003098607 0.3330175 2.18e-6 0.9999566 0.009314656 0.9677048 -0.002346277 0.2520755 0.9677035 -0.002343893 0.2520805 0.967735 -0.00234431 0.2519593 0.9677337 -0.002343356 0.2519643 -2.86836e-7 0.9999567 0.009306252 -2.86844e-7 0.9999567 0.00930655 2.31834e-7 0.9999567 0.009302675 -0.9856185 -0.001572787 0.1689786 -0.9855919 -0.001573324 0.1691338 -0.9856185 -0.001572132 0.1689786 -6.72663e-7 0.9999568 0.009302377 -0.9855918 -0.001574575 0.1691338 -6.72647e-7 0.9999567 0.009302616 0 -0.9999568 -0.009298801 0 -0.9999569 -0.009298682 0.9964 -7.89235e-4 0.08477294 0.9964002 -7.87938e-4 0.08477121 -6.99013e-7 0.9999568 0.009301841 0.9963964 -7.88844e-4 0.08481603 0.9963966 -7.89176e-4 0.08481431 0 0.9999568 0.00930494 1.31455e-6 0.9999568 0.00929898 -0.9990985 -3.94856e-4 0.04244977 7.27059e-7 0.9999568 0.009303152 -1 0 0 -0.9990985 -3.94854e-4 0.04244965 0 0.9999567 0.009311258 0 0.9999567 0.009311735 2.182e-6 0.9999567 0.009306132 0.9964 7.89623e-4 -0.084773 0.9964001 7.8796e-4 -0.08477342 -4.34184e-7 0.9999567 0.009307444 -0.9990984 3.9487e-4 -0.04245144 1.93428e-7 0.9999567 0.009306252 0.9963964 7.89232e-4 -0.08481615 0.9963963 7.89197e-4 -0.08481651 0 0.9999567 0.009303271 0 0.9999567 0.009312689 -4.99554e-6 0.9999567 0.00931096 2.82902e-6 0.9999569 0.009295344 7.38502e-7 0.9999567 0.009302258 -1.54829e-6 0.9999568 0.009303987 4.93264e-6 0.9999569 0.00929898 1.09203e-6 0.9999568 0.009303152 -1.19835e-5 0.9999567 0.009304344 8.36376e-6 0.9999567 0.00930202 -6.89359e-6 0.9999568 0.009306252 2.92513e-7 0.9999567 0.009301841 2.25206e-7 0.9999567 0.009301483 1.79976e-5 0.9999567 0.009305536 -2.00804e-6 0.9999569 0.009300708 -4.83456e-6 0.9999569 0.00929743 -1.02043e-6 0.9999567 0.009301662 4.36131e-7 0.9999567 0.009307265 -4.73056e-7 0.9999567 0.009304225 -0.9990985 3.9487e-4 -0.04245138 0 0.9999567 0.009303271 2.82917e-6 0.9999569 0.00929588 7.38485e-7 0.9999569 0.009301185 4.93213e-6 0.9999569 0.009298861 1.09204e-6 0.9999567 0.009303212 -4.99542e-6 0.9999567 0.009311616 8.36439e-6 0.9999567 0.009301841 -6.89366e-6 0.9999567 0.009306371 -1.54843e-6 0.9999567 0.009303569 2.25202e-7 0.9999567 0.009301781 1.7998e-5 0.9999568 0.009305655 -1.19833e-5 0.9999568 0.009304404 -4.83493e-6 0.9999569 0.009297251 -1.02031e-6 0.9999568 0.009301364 2.92507e-7 0.9999568 0.009301841 4.36144e-7 0.9999568 0.009307503 -4.7305e-7 0.9999567 0.009303271 -2.00793e-6 0.9999567 0.0093019 0 0.9999568 0.009304821 -0.9856185 0.001572132 -0.168979 -8.14053e-7 0.9999567 0.009304702 -0.9855918 0.001574575 -0.1691341 -0.9856185 0.001572132 -0.1689783 -0.985592 0.001573324 -0.1691335 -1.09017e-6 0.9999567 0.009302675 0.9677038 0.0023458 -0.2520793 0.9677038 0.002345144 -0.2520793 0 0.9999568 0.009302437 0.967734 0.002344846 -0.251963 0.967734 0.002343952 -0.251963 0 0.9428324 -0.3332672 0 0.9428324 -0.3332672 -0.965926 -0.002408087 0.2588073 0.9659258 -0.002407968 0.2588083 0.9659259 -0.002408146 0.2588081 -0.9659261 -0.002407968 0.2588072 0 0.9999568 0.009304165 -2.3508e-7 0.9999567 0.009303271 -1.23907e-7 0.9999567 0.009303987 0 0.9999567 0.009304165 -3.41917e-7 0.9999567 0.009306013 -0.9428732 0.00309962 -0.3331376 -1.46853e-7 0.9999568 0.009303927 -0.9429175 0.003098547 -0.3330121 -0.9428731 0.00309962 -0.3331376 -0.9429175 0.003098547 -0.3330122 1.08832e-6 0.9999567 0.009305417 0.9112311 0.003833115 -0.4118779 0.9112312 0.003831803 -0.4118778 0.9112311 0.003832519 -0.4118779 -0.8730183 0.004537224 -0.4876666 1.82907e-7 0.9999567 0.00930345 -0.8730011 0.004537761 -0.4876973 -0.8730183 0.004537224 -0.4876664 -0.8730011 0.004537761 -0.4876971 -5.34875e-7 0.9999568 0.009302914 0.8285444 0.005209803 -0.5598993 0.8285444 0.005209386 -0.5598992 -1.15832e-6 0.9999568 0.009303331 0.8285063 0.005210161 -0.5599557 0.8285062 0.005209743 -0.5599557 -5.79762e-7 0.9999568 0.009304523 -0.7780306 0.00584501 -0.6281993 -4.72241e-7 0.9999568 0.009304642 -0.7780413 0.005845129 -0.6281862 -0.7780299 0.005845665 -0.6282002 -0.7780405 0.005845129 -0.6281871 0 0.9999568 0.009304046 0.7219029 0.006437897 -0.6919645 0.7219032 0.006438374 -0.6919642 0 0.9999568 0.009304106 0.7219641 0.00643754 -0.6919007 0.7219644 0.006437659 -0.6919003 9.55053e-7 0.9999567 0.00930339 -0.660686 0.006984233 -0.7506299 -2.68407e-7 0.9999567 0.009304165 1.37944e-6 0.9999568 0.009303927 -0.6606152 0.006985366 -0.7506922 -0.660685 0.006984889 -0.7506308 -0.6606143 0.006985366 -0.7506932 6.72881e-7 0.9999567 0.009305596 0.5947031 0.007479786 -0.8039106 0.5946924 0.007477045 -0.8039186 1.06286e-6 0.9999567 0.009305119 0.5946349 0.007480323 -0.803961 0.5946242 0.007477402 -0.8039691 -8.1796e-7 0.9999568 0.009304821 -0.5243 0.007923483 -0.8514968 -1.09843e-6 0.9999568 0.009304463 -0.5243443 0.007922947 -0.8514695 -0.5243 0.007923483 -0.8514969 -0.5243442 0.007923543 -0.8514696 -8.22438e-7 0.9999567 0.009303867 2.31231e-7 0.9999568 0.009304165 0.4502032 0.008304417 -0.8928875 0.4502191 0.008308589 -0.8928796 -6.14931e-7 0.9999567 0.00930351 0.4501951 0.008304238 -0.8928916 0.450211 0.008308768 -0.8928836 0 0.9999568 0.009304165 8.86972e-7 0.9999567 0.009304404 -0.3728585 0.008633673 -0.9278481 7.43487e-7 0.9999567 0.009303927 -0.3728601 0.00863403 -0.9278474 -0.3728579 0.008634269 -0.9278484 -0.3728595 0.008633732 -0.9278478 0 0.9999567 0.009304165 0.2928389 0.008896946 -0.9561204 0.2928196 0.008892297 -0.9561264 0 0.9999568 0.009304046 0.2928333 0.008896887 -0.9561221 0.292814 0.008892595 -0.9561281 3.00744e-7 0.9999568 0.009304225 -0.2106712 0.009096086 -0.9775147 -1.56353e-7 0.9999567 0.009304225 2.93383e-7 0.9999567 0.009304225 -0.2106872 0.009096145 -0.9775113 -0.2106909 0.009091258 -0.9775105 -0.2107068 0.009091138 -0.9775071 -6.91288e-7 0.9999568 0.009303927 0.1270077 0.009224653 -0.9918589 0.127026 0.009229481 -0.9918565 -7.45476e-7 0.9999568 0.009304285 0 0.9999567 0.009304225 0.1270102 0.009224593 -0.9918586 0.1270285 0.0092296 -0.9918561 5.78757e-7 0.9999567 0.009304285 -0.04244863 0.009291589 -0.9990555 5.75932e-7 0.9999568 0.009304165 -0.0424478 0.009291529 -0.9990556 -0.04242819 0.009296536 -0.9990563 -0.04242742 0.009296596 -0.9990563 1.62781e-7 0.9999567 0.009304285 -0.9659264 -0.002408385 0.2588061 -0.9659263 -0.002408206 0.2588065 0.9659262 -0.002408027 0.2588065 0.9659263 -0.002408623 0.2588061 -0.965927 -0.002431929 0.2588036 0.965927 -0.002431094 0.2588035 0.8818618 -0.471488 -0.004352629 0 0.9428372 -0.3332536 6.33169e-6 0.9428402 -0.3332455 -0.2588183 0.00898683 -0.9658843 -2.09258e-6 0.9428357 -0.3332582 0.2588188 0.00898683 -0.9658842 0.2588189 0.00898683 -0.9658841 -0.2588182 0.00898683 -0.9658842 -0.7232569 -0.4104158 0.5553904 -0.7232565 -0.410411 0.5553944 -0.7232186 -0.4104904 0.5553851 0.7232506 -0.4104161 0.5553981 0.7232497 -0.4104182 0.5553978 0.7232868 -0.410388 0.5553719 -0.7232469 -0.4104266 0.5553954 1.06978e-6 0.9428414 -0.3332417 1.201e-5 0.9428366 -0.3332555 0 0.9428405 -0.3332444 -0.1753681 0.009159684 -0.9844604 -4.01726e-7 0.9428403 -0.333245 0 0.9428437 -0.3332354 -1.20101e-5 0.9428369 -0.3332545 0.1753741 0.009159684 -0.9844593 0.175368 0.009158492 -0.9844604 -0.175374 0.009156942 -0.9844594 0.1753787 0.009162127 -0.9844585 0.1753795 0.009155213 -0.9844583 -0.1753787 0.009162127 -0.9844585 -0.1753795 0.009155213 -0.9844583 -0.7232495 -0.4104154 0.5554003 0.7232504 -0.4104158 0.5553987 0 -0.9999565 -0.009334385 0 -0.9999564 -0.00933665 0.7232586 -0.4104106 0.555392 1 0 0 0 -0.009322524 0.9999566 1 0 0 0 0.9999568 0.009299993 -1 4.04701e-7 0 0 0.9999568 0.009299993 0 0.9428421 -0.3332402 1 0 0 -0.7232477 -0.4104103 0.5554063 -0.7232404 -0.4104211 0.555408 0.723253 -0.4104132 0.5553973 0.723251 -0.4104166 0.5553975 0 0.9999592 0.009033203 0 0.9999595 0.009006202 -1 -2.51652e-6 0 2.14641e-6 0.9999569 0.009301245 0 0.9999592 0.009033203 -2.14625e-6 0.9999569 0.009299933 0 0.9999591 0.009054124 1 7.91578e-5 0 0 0.8237736 0.5669189 2.62011e-6 0.9999568 0.009298503 -1.23478e-5 0.8238025 0.566877 -0.3015801 0.7670073 0.5663473 -2.62011e-6 0.9999568 0.009298503 0 0.8238021 0.5668777 1.30233e-5 0.8238036 0.5668754 0 0.8237754 0.5669163 0.3015814 0.7670069 0.5663473 -0.7620873 -0.006022155 0.6474463 -0.7620841 -0.006020486 0.6474501 0 0.8238069 0.5668707 0.7620986 -0.006020426 0.6474331 0.7620958 -0.006022095 0.6474364 0 -0.3670314 0.9302086 0 -0.3670315 0.9302085 0 0.9999569 0.009298801 0 0.009281992 -0.999957 0 0.009281992 -0.999957 0 0.9999568 0.009298861 0 -0.009303748 0.9999567 -2.22742e-6 -0.009303748 0.9999568 2.39448e-6 -0.009303748 0.9999568 0 -0.009301185 0.9999569 5.43783e-6 -0.009301662 0.9999567 0 -0.009303212 0.9999568 -6.70667e-6 -0.009301185 0.9999568</float_array>
          <technique_common>
            <accessor source="#shape0_003-mesh-normals-array" count="451" stride="3">
              <param name="X" type="float"/>
              <param name="Y" type="float"/>
              <param name="Z" type="float"/>
            </accessor>
          </technique_common>
        </source>
        <vertices id="shape0_003-mesh-vertices">
          <input semantic="POSITION" source="#shape0_003-mesh-positions"/>
        </vertices>
        <triangles material="Material_004-material" count="464">
          <input semantic="VERTEX" source="#shape0_003-mesh-vertices" offset="0"/>
          <input semantic="NORMAL" source="#shape0_003-mesh-normals" offset="1"/>
          <p>0 0 1 0 2 0 3 1 4 1 2 1 1 2 3 2 2 2 4 3 0 3 2 3 5 4 6 4 0 4 6 5 7 5 0 5 7 6 8 6 0 6 8 7 1 7 0 7 4 8 5 8 0 8 1 9 9 9 10 9 9 10 11 10 10 10 12 11 13 11 10 11 14 12 1 12 10 12 15 13 16 13 10 13 16 14 17 14 10 14 17 15 12 15 10 15 13 16 18 16 10 16 18 17 19 17 10 17 19 18 14 18 10 18 20 19 15 19 10 19 11 20 20 20 10 20 8 21 21 21 1 21 21 22 9 22 1 22 14 23 22 23 1 23 22 24 23 24 1 24 23 25 24 25 1 25 24 26 25 26 1 26 25 27 26 27 1 27 26 28 27 28 1 28 27 29 28 29 1 29 28 30 3 30 1 30 29 31 30 31 8 31 30 32 21 32 8 32 31 33 32 33 8 33 7 34 33 34 8 34 33 35 34 35 8 35 34 36 35 36 8 36 35 37 36 37 8 37 36 38 37 38 8 38 37 39 31 39 8 39 32 40 38 40 8 40 38 41 39 41 8 41 39 42 29 42 8 42 40 43 41 43 29 43 41 44 42 44 29 44 42 45 30 45 29 45 43 46 44 46 29 46 39 47 45 47 29 47 45 48 43 48 29 48 44 49 46 49 29 49 46 50 47 50 29 50 47 51 40 51 29 51 9 52 48 52 11 52 48 53 49 53 11 53 49 54 20 54 11 54 42 55 50 55 30 55 50 56 51 56 30 56 51 57 21 57 30 57 21 58 52 58 9 58 52 59 48 59 9 59 51 60 52 60 21 60 53 61 15 61 20 61 54 62 55 62 20 62 55 63 56 63 20 63 56 64 53 64 20 64 49 65 54 65 20 65 57 66 50 66 42 66 41 67 57 67 42 67 58 68 59 68 15 68 59 69 60 69 15 69 60 70 61 70 15 70 61 71 62 71 15 71 62 72 16 72 15 72 53 73 58 73 15 73 57 74 41 74 40 74 63 75 57 75 40 75 64 76 65 76 40 76 65 77 66 77 40 77 66 78 63 78 40 78 47 79 67 79 40 79 67 80 64 80 40 80 56 81 58 81 53 81 6 82 5 82 4 82 68 83 6 83 4 83 3 84 68 84 4 84 69 85 14 85 19 85 70 86 69 86 19 86 18 87 70 87 19 87 71 88 45 88 39 88 72 89 71 89 39 89 38 90 72 90 39 90 73 91 14 91 69 91 70 92 74 92 69 92 74 93 73 93 69 93 75 94 45 94 71 94 72 95 76 95 71 95 76 96 75 96 71 96 73 97 22 97 14 97 75 98 43 98 45 98 77 99 22 99 73 99 74 100 77 100 73 100 78 101 43 101 75 101 76 102 78 102 75 102 79 103 70 103 18 103 13 104 79 104 18 104 80 105 72 105 38 105 32 106 80 106 38 106 79 107 74 107 70 107 80 108 76 108 72 108 77 109 23 109 22 109 78 110 44 110 43 110 81 111 23 111 77 111 74 112 81 112 77 112 82 113 44 113 78 113 76 114 82 114 78 114 83 115 79 115 13 115 12 116 83 116 13 116 84 117 80 117 32 117 31 118 84 118 32 118 83 119 74 119 79 119 84 120 76 120 80 120 81 121 24 121 23 121 82 122 46 122 44 122 85 123 24 123 81 123 74 124 85 124 81 124 86 125 46 125 82 125 76 126 86 126 82 126 87 127 83 127 12 127 17 128 87 128 12 128 88 129 84 129 31 129 37 130 88 130 31 130 87 131 74 131 83 131 88 132 76 132 84 132 85 133 25 133 24 133 86 134 47 134 46 134 89 135 25 135 85 135 74 136 89 136 85 136 90 137 47 137 86 137 76 138 90 138 86 138 91 139 87 139 17 139 16 140 91 140 17 140 92 141 88 141 37 141 36 142 92 142 37 142 91 143 74 143 87 143 92 144 76 144 88 144 89 145 26 145 25 145 90 146 67 146 47 146 93 147 26 147 89 147 74 148 93 148 89 148 94 149 67 149 90 149 76 150 94 150 90 150 95 151 91 151 16 151 62 152 95 152 16 152 96 153 92 153 36 153 35 154 96 154 36 154 95 155 74 155 91 155 96 156 76 156 92 156 93 157 27 157 26 157 94 158 64 158 67 158 97 159 27 159 93 159 74 160 97 160 93 160 98 161 64 161 94 161 76 162 98 162 94 162 99 163 95 163 62 163 61 164 99 164 62 164 100 165 96 165 35 165 34 166 100 166 35 166 99 167 74 167 95 167 100 168 76 168 96 168 97 169 28 169 27 169 98 170 65 170 64 170 101 171 28 171 97 171 74 172 101 172 97 172 102 173 65 173 98 173 76 174 102 174 98 174 103 175 99 175 61 175 60 176 103 176 61 176 104 177 100 177 34 177 33 178 104 178 34 178 103 179 74 179 99 179 104 180 76 180 100 180 105 181 3 181 28 181 101 182 105 182 28 182 102 183 66 183 65 183 106 184 105 184 101 184 74 185 106 185 101 185 107 186 66 186 102 186 76 187 107 187 102 187 52 188 49 188 48 188 51 189 49 189 52 189 108 190 103 190 60 190 59 191 108 191 60 191 7 192 109 192 33 192 110 193 104 193 33 193 109 194 110 194 33 194 108 195 74 195 103 195 110 195 76 195 104 195 111 196 3 196 105 196 106 197 111 197 105 197 112 198 63 198 66 198 107 199 112 199 66 199 113 200 111 200 106 200 74 201 113 201 106 201 114 199 112 199 107 199 76 202 114 202 107 202 58 203 115 203 59 203 116 204 108 204 59 204 115 205 116 205 59 205 117 206 3 206 111 206 113 207 117 207 111 207 7 208 118 208 109 208 119 209 110 209 109 209 118 210 119 210 109 210 116 211 74 211 108 211 120 212 113 212 74 212 121 213 122 213 74 213 122 214 123 214 74 214 123 215 120 215 74 215 124 216 125 216 74 216 125 217 126 217 74 217 126 218 121 218 74 218 127 219 128 219 74 219 128 220 129 220 74 220 129 221 124 221 74 221 130 222 131 222 74 222 131 223 132 223 74 223 132 224 127 224 74 224 133 225 134 225 74 225 134 226 135 226 74 226 135 227 130 227 74 227 116 228 136 228 74 228 136 229 133 229 74 229 120 230 117 230 113 230 119 231 76 231 110 231 137 232 138 232 76 232 138 233 114 233 76 233 139 234 140 234 76 234 140 235 141 235 76 235 141 236 137 236 76 236 142 237 143 237 76 237 143 238 144 238 76 238 144 239 139 239 76 239 145 240 146 240 76 240 146 241 147 241 76 241 147 242 142 242 76 242 148 243 149 243 76 243 149 244 150 244 76 244 150 245 145 245 76 245 119 246 151 246 76 246 151 247 152 247 76 247 152 248 148 248 76 248 153 249 3 249 117 249 120 250 153 250 117 250 154 251 63 251 112 251 114 252 154 252 112 252 123 253 153 253 120 253 138 254 154 254 114 254 58 255 155 255 115 255 136 256 116 256 115 256 155 257 136 257 115 257 7 258 156 258 118 258 151 259 119 259 118 259 156 260 151 260 118 260 157 261 6 261 68 261 158 262 157 262 68 262 3 263 158 263 68 263 157 264 159 264 6 264 159 265 7 265 6 265 160 266 158 266 3 266 161 267 160 267 3 267 162 268 161 268 3 268 153 269 162 269 3 269 159 270 163 270 7 270 163 271 156 271 7 271 123 272 162 272 153 272 164 273 63 273 154 273 138 274 164 274 154 274 122 275 162 275 123 275 137 276 164 276 138 276 58 277 165 277 155 277 133 278 136 278 155 278 165 279 133 279 155 279 152 280 151 280 156 280 163 279 152 279 156 279 122 281 161 281 162 281 166 282 63 282 164 282 137 283 166 283 164 283 121 284 161 284 122 284 141 285 166 285 137 285 58 286 167 286 165 286 134 287 133 287 165 287 167 288 134 288 165 288 159 289 168 289 163 289 148 290 152 290 163 290 168 291 148 291 163 291 169 292 160 292 161 292 121 293 169 293 161 293 170 294 63 294 166 294 141 295 170 295 166 295 126 296 169 296 121 296 140 297 170 297 141 297 58 298 171 298 167 298 135 299 134 299 167 299 171 300 135 300 167 300 159 301 172 301 168 301 149 302 148 302 168 302 172 303 149 303 168 303 173 304 160 304 169 304 126 305 173 305 169 305 174 306 63 306 170 306 175 307 174 307 170 307 140 308 175 308 170 308 125 309 173 309 126 309 139 310 175 310 140 310 58 311 176 311 171 311 130 312 135 312 171 312 176 313 130 313 171 313 159 314 177 314 172 314 150 315 149 315 172 315 177 316 150 316 172 316 178 317 160 317 173 317 125 318 178 318 173 318 179 319 174 319 175 319 139 320 179 320 175 320 124 321 178 321 125 321 144 322 179 322 139 322 180 323 181 323 176 323 58 324 180 324 176 324 131 325 130 325 176 325 181 326 131 326 176 326 159 327 182 327 177 327 145 328 150 328 177 328 182 329 145 329 177 329 183 330 160 330 178 330 184 331 183 331 178 331 124 332 184 332 178 332 185 333 174 333 179 333 144 334 185 334 179 334 129 335 184 335 124 335 143 336 185 336 144 336 180 337 186 337 181 337 132 338 131 338 181 338 186 339 132 339 181 339 159 340 187 340 182 340 146 341 145 341 182 341 187 342 146 342 182 342 188 343 183 343 184 343 129 344 188 344 184 344 189 345 174 345 185 345 190 346 189 346 185 346 143 347 190 347 185 347 128 348 188 348 129 348 142 349 190 349 143 349 180 350 191 350 186 350 127 351 132 351 186 351 191 352 127 352 186 352 189 353 192 353 187 353 159 354 189 354 187 354 147 355 146 355 187 355 192 356 147 356 187 356 191 357 183 357 188 357 128 358 191 358 188 358 192 359 189 359 190 359 142 360 192 360 190 360 127 361 191 361 128 361 147 362 192 362 142 362 180 363 183 363 191 363 193 364 180 364 58 364 56 365 193 365 58 365 194 366 57 366 63 366 174 367 194 367 63 367 55 368 193 368 56 368 194 369 195 369 57 369 195 370 50 370 57 370 196 371 157 371 158 371 197 372 196 372 158 372 160 373 197 373 158 373 196 374 198 374 157 374 198 375 189 375 157 375 189 376 159 376 157 376 183 377 197 377 160 377 49 378 199 378 54 378 199 379 200 379 54 379 200 380 55 380 54 380 201 381 51 381 50 381 194 382 201 382 50 382 195 383 194 383 50 383 200 384 193 384 55 384 202 385 203 385 197 385 204 386 196 386 197 386 203 387 204 387 197 387 183 388 202 388 197 388 205 389 206 389 198 389 196 390 207 390 198 390 207 391 205 391 198 391 174 392 189 392 198 392 206 393 174 393 198 393 180 394 202 394 183 394 208 395 194 395 174 395 206 396 208 396 174 396 193 397 209 397 180 397 209 398 202 398 180 398 200 399 209 399 193 399 208 400 201 400 194 400 51 401 199 401 49 401 210 402 199 402 51 402 201 403 210 403 51 403 204 404 211 404 196 404 211 405 207 405 196 405 212 199 205 199 207 199 211 405 212 405 207 405 204 406 213 406 211 406 213 407 212 407 211 407 214 408 205 408 212 408 213 409 214 409 212 409 209 199 203 199 202 199 205 410 215 410 206 410 215 406 216 406 206 406 216 411 208 411 206 411 217 199 203 199 209 199 200 412 218 412 209 412 218 413 217 413 209 413 216 414 219 414 208 414 219 415 201 415 208 415 220 416 204 416 203 416 221 417 220 417 203 417 217 418 221 418 203 418 220 419 222 419 204 419 222 406 213 406 204 406 223 420 215 420 205 420 224 421 223 421 205 421 214 199 224 199 205 199 223 422 225 422 215 422 225 423 226 423 215 423 226 406 216 406 215 406 217 199 227 199 221 199 227 424 220 424 221 424 228 425 222 425 220 425 227 426 229 426 220 426 229 427 228 427 220 427 224 428 230 428 223 428 231 429 232 429 223 429 232 430 226 430 223 430 226 431 225 431 223 431 230 432 231 432 223 432 218 433 233 433 227 433 217 434 218 434 227 434 233 435 229 435 227 435 232 436 216 436 226 436 232 437 219 437 216 437 201 438 200 438 199 438 210 439 201 439 199 439 228 440 224 440 222 440 214 441 213 441 222 441 224 442 214 442 222 442 228 443 230 443 224 443 200 444 230 444 228 444 229 445 200 445 228 445 201 446 231 446 230 446 200 444 201 444 230 444 218 447 229 447 233 447 218 448 200 448 229 448 201 449 232 449 231 449 201 450 219 450 232 450</p>
        </triangles>
      </mesh>
    </geometry>
  </library_geometries>
  <library_visual_scenes>
    <visual_scene id="Scene" name="Scene">
      <node id="Light_001" name="Light.001" type="NODE">
        <matrix sid="transform">-0.2908646 -0.7711008 0.5663932 4.076245 0.9551712 -0.1998834 0.2183912 1.005454 -0.055189 0.6045247 0.7946723 5.903862 0 0 0 1</matrix>
        <instance_light url="#Light_001-light"/>
      </node>
      <node id="Camera_001" name="Camera.001" type="NODE">
        <matrix sid="transform">0.6859207 -0.3240135 0.6515582 7.358891 0.7276763 0.3054209 -0.6141704 -6.925791 -4.01133e-9 0.8953956 0.4452714 4.958309 0 0 0 1</matrix>
        <instance_camera url="#Camera_001-camera"/>
      </node>
      <node id="node" name="node" type="NODE">
        <matrix sid="transform">1 0 0 0 0 -1.62921e-7 -1 0 0 1 -1.62921e-7 0 0 0 0 1</matrix>
        <instance_geometry url="#shape0_003-mesh" name="node">
          <bind_material>
            <technique_common>
              <instance_material symbol="Material_004-material" target="#Material_004-material"/>
            </technique_common>
          </bind_material>
        </instance_geometry>
      </node>
      <node id="Camera" name="Camera" type="NODE">
        <matrix sid="transform">0.6859207 -0.3240135 0.6515582 7.358891 0.7276763 0.3054208 -0.6141704 -6.925791 0 0.8953956 0.4452714 4.958309 0 0 0 1</matrix>
        <instance_camera url="#Camera-camera"/>
      </node>
      <node id="Light" name="Light" type="NODE">
        <matrix sid="transform">-0.2908646 -0.7711008 0.5663932 4.076245 0.9551712 -0.1998834 0.2183912 1.005454 -0.05518906 0.6045247 0.7946723 5.903862 0 0 0 1</matrix>
        <instance_light url="#Light-light"/>
      </node>
    </visual_scene>
  </library_visual_scenes>
  <scene>
    <instance_visual_scene url="#Scene"/>
  </scene>
</COLLADA>