{
	"Version": 3,
	"Meta": {
		"Duration": 9.458,
		"Fps": 24.0,
		"Loop": true,
		"AreBeziersRestricted": false,
		"CurveCount": 14,
		"TotalSegmentCount": 100,
		"TotalPointCount": 114,
		"UserDataCount": 0,
		"TotalUserDataSize": 0
	},
	"Curves": [
		{
			"Target": "Parameter",
			"Id": "ParamAngleX",
			"Segments": [
				0,
				30,
				0,
				9.458,
				30
			]
		},
		{
			"Target": "Parameter",
			"Id": "ParamAngleY",
			"Segments": [
				0,
				2,
				0,
				9.458,
				2
			]
		},
		{
			"Target": "Parameter",
			"Id": "ParamEyeBallX",
			"Segments": [
				0,
				0.3,
				0,
				9.458,
				0.3
			]
		},
		{
			"Target": "Parameter",
			"Id": "ParamEyeBallY",
			"Segments": [
				0,
				0.1,
				0,
				9.458,
				0.1
			]
		},
		{
			"Target": "Parameter",
			"Id": "ParamBrowLY",
			"Segments": [
				0,
				0,
				0,
				9.458,
				0
			]
		},
		{
			"Target": "Parameter",
			"Id": "ParamBrowRY",
			"Segments": [
				0,
				0,
				0,
				9.458,
				0
			]
		},
		{
			"Target": "Parameter",
			"Id": "ParamMouthForm",
			"Segments": [
				0,
				-0.7,
				2,
				3.167,
				-1,
				0,
				9.458,
				-1
			]
		},
		{
			"Target": "Parameter",
			"Id": "ParamMouthOpenY",
			"Segments": [
				0,
				0,
				2,
				3.167,
				1,
				2,
				3.292,
				0.3,
				2,
				3.417,
				1,
				2,
				3.542,
				0,
				2,
				3.958,
				1,
				2,
				4.083,
				0.3,
				2,
				4.208,
				0,
				2,
				4.333,
				0.3,
				2,
				4.458,
				0,
				2,
				4.583,
				1,
				2,
				4.708,
				0,
				2,
				5,
				1,
				2,
				5.125,
				0.3,
				2,
				5.25,
				1,
				2,
				5.375,
				0.3,
				2,
				5.5,
				0,
				2,
				5.625,
				1,
				2,
				5.75,
				0,
				2,
				5.875,
				0.3,
				2,
				6,
				1,
				2,
				6.125,
				0,
				2,
				6.25,
				1,
				2,
				6.375,
				0.3,
				2,
				6.5,
				1,
				2,
				6.625,
				0.3,
				2,
				6.75,
				0,
				2,
				6.875,
				1,
				2,
				7.125,
				0,
				0,
				9.458,
				0
			]
		},
		{
			"Target": "Parameter",
			"Id": "ParamMouthSizeChange",
			"Segments": [
				0,
				-1,
				2,
				3.167,
				0,
				0,
				9.458,
				0
			]
		},
		{
			"Target": "Parameter",
			"Id": "ParamBodyAngleX",
			"Segments": [
				0,
				10,
				0,
				9.458,
				10
			]
		},
		{
			"Target": "Parameter",
			"Id": "ParamBodyPosition",
			"Segments": [
				0,
				0,
				2,
				3.167,
				3,
				2,
				3.292,
				2,
				2,
				3.417,
				3,
				2,
				3.542,
				0,
				2,
				3.958,
				3,
				2,
				4.083,
				2,
				2,
				4.208,
				0,
				2,
				4.333,
				2,
				2,
				4.458,
				0,
				2,
				4.583,
				3,
				2,
				4.708,
				0,
				2,
				5,
				3,
				2,
				5.125,
				2,
				2,
				5.25,
				3,
				2,
				5.375,
				2,
				2,
				5.5,
				0,
				2,
				5.625,
				3,
				2,
				5.75,
				0,
				2,
				5.875,
				2,
				2,
				6,
				3,
				2,
				6.125,
				0,
				2,
				6.25,
				3,
				2,
				6.375,
				2,
				2,
				6.5,
				3,
				2,
				6.625,
				2,
				2,
				6.75,
				0,
				2,
				6.875,
				3,
				2,
				7.125,
				0,
				0,
				9.458,
				0
			]
		},
		{
			"Target": "Parameter",
			"Id": "ParamBreath",
			"Segments": [
				0,
				0,
				2,
				3.167,
				0.5,
				2,
				3.292,
				0.3,
				2,
				3.417,
				0.5,
				2,
				3.542,
				0,
				2,
				3.958,
				0.5,
				2,
				4.083,
				0.3,
				2,
				4.208,
				0,
				2,
				4.333,
				0.3,
				2,
				4.458,
				0,
				2,
				4.583,
				0.5,
				2,
				4.708,
				0,
				2,
				5,
				0.5,
				2,
				5.125,
				0.3,
				2,
				5.25,
				0.5,
				2,
				5.375,
				0.3,
				2,
				5.5,
				0,
				2,
				5.625,
				0.5,
				2,
				5.75,
				0,
				2,
				5.875,
				0.3,
				2,
				6,
				0.5,
				2,
				6.125,
				0,
				2,
				6.25,
				0.5,
				2,
				6.375,
				0.3,
				2,
				6.5,
				0.5,
				2,
				6.625,
				0.3,
				2,
				6.75,
				0,
				2,
				6.875,
				0.5,
				2,
				7.125,
				0,
				0,
				9.458,
				0
			]
		},
		{
			"Target": "Parameter",
			"Id": "ParamUpperarmLRollA",
			"Segments": [
				0,
				-7,
				0,
				9.458,
				-7
			]
		},
		{
			"Target": "Parameter",
			"Id": "ParamUpperarmRRollA",
			"Segments": [
				0,
				-7,
				0,
				9.458,
				-7
			]
		}
	]
}