{
	"Version": 3,
	"Parameters": [
		{
			"Id": "ParamAngleX",
			"GroupId": "ParamGroup",
			"Name": "角度 X"
		},
		{
			"Id": "ParamAngleY",
			"GroupId": "ParamGroup",
			"Name": "角度 Y"
		},
		{
			"Id": "ParamAngleZ",
			"GroupId": "ParamGroup",
			"Name": "角度 Z"
		},
		{
			"Id": "ParamEyeLOpen",
			"GroupId": "ParamGroup2",
			"Name": "左目　開閉"
		},
		{
			"Id": "ParamEyeLSmile",
			"GroupId": "ParamGroup2",
			"Name": "左目　笑顔"
		},
		{
			"Id": "ParamEyeLForm",
			"GroupId": "ParamGroup2",
			"Name": "左目　変形"
		},
		{
			"Id": "ParamEyeROpen",
			"GroupId": "ParamGroup2",
			"Name": "右目　開閉"
		},
		{
			"Id": "ParamEyeRSmile",
			"GroupId": "ParamGroup2",
			"Name": "右目　笑顔"
		},
		{
			"Id": "ParamEyeRForm",
			"GroupId": "ParamGroup2",
			"Name": "右目　変形"
		},
		{
			"Id": "ParamEyeBallX",
			"GroupId": "ParamGroup2",
			"Name": "目玉 X"
		},
		{
			"Id": "ParamEyeBallY",
			"GroupId": "ParamGroup2",
			"Name": "目玉 Y"
		},
		{
			"Id": "ParamChangeEye",
			"GroupId": "ParamGroup2",
			"Name": "> <目"
		},
		{
			"Id": "ParamBrowLY",
			"GroupId": "ParamGroup7",
			"Name": "左眉　上下"
		},
		{
			"Id": "ParamBrowRY",
			"GroupId": "ParamGroup7",
			"Name": "右眉　上下"
		},
		{
			"Id": "ParamBrowLX",
			"GroupId": "ParamGroup7",
			"Name": "左眉　左右"
		},
		{
			"Id": "ParamBrowRX",
			"GroupId": "ParamGroup7",
			"Name": "右眉　左右"
		},
		{
			"Id": "ParamBrowLAngle",
			"GroupId": "ParamGroup7",
			"Name": "左眉　角度"
		},
		{
			"Id": "ParamBrowRAngle",
			"GroupId": "ParamGroup7",
			"Name": "右眉　角度"
		},
		{
			"Id": "ParamBrowLForm",
			"GroupId": "ParamGroup7",
			"Name": "左眉 変形"
		},
		{
			"Id": "ParamBrowLForm02",
			"GroupId": "ParamGroup7",
			"Name": "左眉　変形02"
		},
		{
			"Id": "ParamBrowRForm",
			"GroupId": "ParamGroup7",
			"Name": "右眉 変形"
		},
		{
			"Id": "ParamBrowRForm02",
			"GroupId": "ParamGroup7",
			"Name": "右眉　変形02"
		},
		{
			"Id": "ParamMouthForm",
			"GroupId": "ParamGroup4",
			"Name": "口　変形"
		},
		{
			"Id": "ParamMouthOpenY",
			"GroupId": "ParamGroup4",
			"Name": "口　開閉"
		},
		{
			"Id": "ParamMouthSizeChange",
			"GroupId": "ParamGroup4",
			"Name": "口　縮小"
		},
		{
			"Id": "ParamBodyAngleX",
			"GroupId": "ParamGroup5",
			"Name": "体の回転　X"
		},
		{
			"Id": "ParamBodyAngleY",
			"GroupId": "ParamGroup5",
			"Name": "体の回転　Y"
		},
		{
			"Id": "ParamBodyAngleZ",
			"GroupId": "ParamGroup5",
			"Name": "体の回転　Z"
		},
		{
			"Id": "ParamShoulderR",
			"GroupId": "ParamGroup5",
			"Name": "右肩　上下"
		},
		{
			"Id": "ParamShoulderL",
			"GroupId": "ParamGroup5",
			"Name": "左肩　上下"
		},
		{
			"Id": "ParamBodyPosition",
			"GroupId": "ParamGroup5",
			"Name": "体の前後"
		},
		{
			"Id": "ParamBreath",
			"GroupId": "ParamGroup5",
			"Name": "呼吸"
		},
		{
			"Id": "ParamUpperarmLRollA",
			"GroupId": "ParamGroup10",
			"Name": "L_上腕A"
		},
		{
			"Id": "ParamForearmLRollA",
			"GroupId": "ParamGroup10",
			"Name": "L_前腕A"
		},
		{
			"Id": "ParamForearmLChange",
			"GroupId": "ParamGroup10",
			"Name": "左前腕　前後"
		},
		{
			"Id": "ParamHandLRoll",
			"GroupId": "ParamGroup10",
			"Name": "左手"
		},
		{
			"Id": "ParamHandLChangeA",
			"GroupId": "ParamGroup10",
			"Name": "左手A"
		},
		{
			"Id": "ParamHandLChangeB",
			"GroupId": "ParamGroup10",
			"Name": "左手B"
		},
		{
			"Id": "ParamHandLChangeC",
			"GroupId": "ParamGroup10",
			"Name": "左手C"
		},
		{
			"Id": "ParamUpperarmRRollA",
			"GroupId": "ParamGroup8",
			"Name": "R_上腕A"
		},
		{
			"Id": "ParamForearmRRollA",
			"GroupId": "ParamGroup8",
			"Name": "R_前腕A"
		},
		{
			"Id": "ParamForearmRChange",
			"GroupId": "ParamGroup8",
			"Name": "右前腕　前後"
		},
		{
			"Id": "ParamHandRRoll",
			"GroupId": "ParamGroup8",
			"Name": "右手"
		},
		{
			"Id": "ParamHandRChangeA",
			"GroupId": "ParamGroup8",
			"Name": "右手A"
		},
		{
			"Id": "ParamHandRChangeB",
			"GroupId": "ParamGroup8",
			"Name": "右手B"
		},
		{
			"Id": "ParamHandRChangeC",
			"GroupId": "ParamGroup8",
			"Name": "右手C"
		},
		{
			"Id": "ParamHairFront",
			"GroupId": "ParamGroup6",
			"Name": "髪揺れ　前"
		},
		{
			"Id": "ParamHairSide",
			"GroupId": "ParamGroup6",
			"Name": "髪揺れ　横"
		},
		{
			"Id": "ParamHairBack",
			"GroupId": "ParamGroup6",
			"Name": "髪揺れ　後"
		},
		{
			"Id": "ParamHairBack2",
			"GroupId": "ParamGroup6",
			"Name": "髪揺れ　後ハネ"
		},
		{
			"Id": "ParamHairCowlick",
			"GroupId": "ParamGroup6",
			"Name": "髪揺れ　触覚"
		},
		{
			"Id": "ParamSkirt",
			"GroupId": "ParamGroup6",
			"Name": "スカート　揺れ"
		},
		{
			"Id": "ParamWhite",
			"GroupId": "",
			"Name": "白　表示"
		}
	],
	"ParameterGroups": [
		{
			"Id": "ParamGroup",
			"GroupId": "",
			"Name": "顔"
		},
		{
			"Id": "ParamGroup2",
			"GroupId": "",
			"Name": "目"
		},
		{
			"Id": "ParamGroup7",
			"GroupId": "",
			"Name": "眉"
		},
		{
			"Id": "ParamGroup4",
			"GroupId": "",
			"Name": "口"
		},
		{
			"Id": "ParamGroup5",
			"GroupId": "",
			"Name": "体"
		},
		{
			"Id": "ParamGroup10",
			"GroupId": "",
			"Name": "左腕A"
		},
		{
			"Id": "ParamGroup8",
			"GroupId": "",
			"Name": "右腕A"
		},
		{
			"Id": "ParamGroup6",
			"GroupId": "",
			"Name": "揺れもの"
		}
	],
	"Parts": [
		{
			"Id": "Part18",
			"Name": "コアパーツ"
		},
		{
			"Id": "Part14",
			"Name": "前髪"
		},
		{
			"Id": "Part3",
			"Name": "眉毛"
		},
		{
			"Id": "Part4",
			"Name": "左目"
		},
		{
			"Id": "Part5",
			"Name": "右目"
		},
		{
			"Id": "Part2",
			"Name": "鼻"
		},
		{
			"Id": "Part6",
			"Name": "口"
		},
		{
			"Id": "Part7",
			"Name": "髪影"
		},
		{
			"Id": "Part15",
			"Name": "顔"
		},
		{
			"Id": "Part16",
			"Name": "耳"
		},
		{
			"Id": "Part8",
			"Name": "上半身"
		},
		{
			"Id": "Part22",
			"Name": "右腕"
		},
		{
			"Id": "Part9",
			"Name": "左腕"
		},
		{
			"Id": "Part17",
			"Name": "下半身"
		},
		{
			"Id": "Part13",
			"Name": "後ろ髪"
		},
		{
			"Id": "Part19",
			"Name": "下絵"
		},
		{
			"Id": "Part20",
			"Name": "口内"
		},
		{
			"Id": "Part23",
			"Name": "右前腕"
		},
		{
			"Id": "Part24",
			"Name": "右手A"
		},
		{
			"Id": "Part25",
			"Name": "右手B"
		},
		{
			"Id": "Part26",
			"Name": "右手C"
		},
		{
			"Id": "Part21",
			"Name": "左前腕"
		},
		{
			"Id": "Part10",
			"Name": "左手A"
		},
		{
			"Id": "Part11",
			"Name": "左手B"
		},
		{
			"Id": "Part12",
			"Name": "左手C"
		},
		{
			"Id": "Part",
			"Name": "表情下絵"
		}
	],
	"CombinedParameters": [
		[
			"ParamAngleX",
			"ParamAngleY"
		],
		[
			"ParamEyeBallX",
			"ParamEyeBallY"
		]
	]
}