{
	"Version": 3,
	"FileReferences": {
		"Moc": "akane.moc3",
		"Textures": [
			"akane.4096/texture_00.png",
			"akane.4096/texture_01.png"
		],
		"DisplayInfo": "akane.cdi3.json"
	},
	"Groups": [
		{
			"Target": "Parameter",
			"Name": "LipSync",
			"Ids": []
		},
		{
			"Target": "Parameter",
			"Name": "EyeBlink",
			"Ids": []
		}
	]
}