{
	"Version": 3,
	"Meta": {
		"Duration": 13.125,
		"Fps": 24.0,
		"Loop": true,
		"AreBeziersRestricted": false,
		"CurveCount": 18,
		"TotalSegmentCount": 119,
		"TotalPointCount": 137,
		"UserDataCount": 0,
		"TotalUserDataSize": 0
	},
	"Curves": [
		{
			"Target": "Parameter",
			"Id": "ParamAngleX",
			"Segments": [
				0,
				0,
				0,
				6.5,
				0,
				2,
				6.625,
				2.084,
				2,
				6.75,
				8.9,
				2,
				6.875,
				15.01,
				2,
				7,
				18.83,
				2,
				7.125,
				20,
				0,
				13.125,
				20
			]
		},
		{
			"Target": "Parameter",
			"Id": "ParamEyeBallX",
			"Segments": [
				0,
				0,
				0,
				6.5,
				0,
				2,
				6.625,
				-0.04,
				2,
				6.75,
				-0.18,
				2,
				6.875,
				-0.3,
				2,
				7,
				-0.38,
				2,
				7.125,
				-0.4,
				0,
				13.125,
				-0.4
			]
		},
		{
			"Target": "Parameter",
			"Id": "ParamEyeBallY",
			"Segments": [
				0,
				0,
				0,
				13.125,
				0
			]
		},
		{
			"Target": "Parameter",
			"Id": "ParamBrowLY",
			"Segments": [
				0,
				-0.3,
				0,
				13.125,
				-0.3
			]
		},
		{
			"Target": "Parameter",
			"Id": "ParamBrowRY",
			"Segments": [
				0,
				-0.3,
				0,
				13.125,
				-0.3
			]
		},
		{
			"Target": "Parameter",
			"Id": "ParamBrowLAngle",
			"Segments": [
				0,
				-0.6,
				0,
				13.125,
				-0.6
			]
		},
		{
			"Target": "Parameter",
			"Id": "ParamBrowRAngle",
			"Segments": [
				0,
				-0.4,
				0,
				13.125,
				-0.4
			]
		},
		{
			"Target": "Parameter",
			"Id": "ParamBrowLForm",
			"Segments": [
				0,
				1,
				0,
				13.125,
				1
			]
		},
		{
			"Target": "Parameter",
			"Id": "ParamBrowRForm",
			"Segments": [
				0,
				1,
				0,
				13.125,
				1
			]
		},
		{
			"Target": "Parameter",
			"Id": "ParamMouthOpenY",
			"Segments": [
				0,
				0,
				2,
				0.458,
				0.6,
				2,
				0.583,
				1,
				2,
				0.708,
				0,
				2,
				1.667,
				1,
				2,
				1.792,
				0,
				2,
				1.917,
				1,
				2,
				2.042,
				0.6,
				2,
				2.167,
				0,
				2,
				2.292,
				1,
				2,
				2.417,
				0,
				2,
				2.542,
				1,
				2,
				2.667,
				0.6,
				2,
				2.792,
				0,
				2,
				3.708,
				1,
				2,
				3.833,
				0,
				2,
				3.958,
				0.6,
				2,
				4.083,
				0,
				2,
				4.208,
				0.6,
				2,
				4.333,
				1,
				2,
				4.458,
				0.6,
				2,
				4.583,
				1,
				2,
				4.708,
				0.6,
				2,
				4.833,
				0,
				2,
				4.958,
				1,
				2,
				5.083,
				0.6,
				2,
				5.208,
				1,
				2,
				5.333,
				0.6,
				2,
				5.458,
				0,
				2,
				5.583,
				0.6,
				2,
				5.708,
				0,
				2,
				7.125,
				1,
				2,
				7.25,
				0.6,
				2,
				7.375,
				1,
				2,
				7.5,
				0,
				2,
				7.625,
				0.6,
				2,
				7.75,
				0.9,
				2,
				7.875,
				0.6,
				2,
				8,
				1,
				2,
				8.125,
				0.6,
				2,
				8.25,
				0,
				2,
				8.375,
				1,
				2,
				8.5,
				0.6,
				2,
				8.625,
				0,
				2,
				9.333,
				1,
				2,
				9.458,
				0,
				2,
				9.583,
				0.6,
				2,
				9.708,
				1,
				2,
				9.833,
				0.6,
				2,
				9.958,
				1,
				2,
				10.083,
				0,
				2,
				10.208,
				0.6,
				2,
				10.333,
				0,
				2,
				10.458,
				1,
				2,
				10.583,
				0.6,
				2,
				10.708,
				0,
				2,
				11.208,
				0.6,
				2,
				11.333,
				1,
				2,
				11.458,
				0,
				2,
				11.583,
				1,
				2,
				11.708,
				0.6,
				2,
				11.833,
				1,
				2,
				11.958,
				0,
				2,
				12.083,
				1,
				2,
				12.208,
				0,
				0,
				13.125,
				0
			]
		},
		{
			"Target": "Parameter",
			"Id": "ParamBodyAngleX",
			"Segments": [
				0,
				0,
				0,
				6.5,
				0,
				2,
				6.625,
				1.04,
				2,
				6.75,
				4.45,
				2,
				6.875,
				7.5,
				2,
				7,
				9.41,
				2,
				7.125,
				10,
				0,
				13.125,
				10
			]
		},
		{
			"Target": "Parameter",
			"Id": "ParamUpperarmLRollA",
			"Segments": [
				0,
				-13,
				0,
				6.5,
				-13,
				2,
				6.75,
				-13,
				2,
				6.875,
				-9.609,
				2,
				7,
				-2.248,
				2,
				7.125,
				0,
				0,
				13.125,
				0
			]
		},
		{
			"Target": "Parameter",
			"Id": "ParamForearmLRollA",
			"Segments": [
				0,
				0,
				0,
				6.5,
				0,
				2,
				6.625,
				3.8,
				2,
				6.75,
				9.816,
				2,
				6.875,
				15.99,
				2,
				7,
				18.71,
				2,
				7.125,
				-50,
				0,
				13.125,
				-50
			]
		},
		{
			"Target": "Parameter",
			"Id": "ParamHandLRoll",
			"Segments": [
				0,
				2,
				2,
				6.875,
				6,
				2,
				7,
				23.767,
				2,
				7.125,
				30,
				2,
				7.458,
				-4,
				2,
				7.583,
				6,
				2,
				7.708,
				24,
				2,
				7.833,
				30,
				2,
				7.958,
				-4,
				0,
				13.125,
				-4
			]
		},
		{
			"Target": "Parameter",
			"Id": "ParamHandLChangeA",
			"Segments": [
				0,
				0,
				0,
				13.125,
				0
			]
		},
		{
			"Target": "Parameter",
			"Id": "ParamHandLChangeC",
			"Segments": [
				0,
				1,
				0,
				13.125,
				1
			]
		},
		{
			"Target": "Parameter",
			"Id": "ParamUpperarmRRollA",
			"Segments": [
				0,
				-13,
				0,
				13.125,
				-13
			]
		},
		{
			"Target": "Parameter",
			"Id": "ParamForearmRRollA",
			"Segments": [
				0,
				0,
				0,
				13.125,
				0
			]
		}
	]
}