
MEC PC-9700 ｼﾘｰｽﾞ ﾊﾟｰｿﾅﾙ ｺﾝﾋﾟｭｰﾀ

ﾏｯｸﾛｿﾌﾄ MC-DOS ﾊﾞｰｼﾞｮﾝ 6.20
Copyright (C) 1981,1994 Maccrosoft Corp. / MEC Corporation

Lt. Commender's TCP/IP Driver version 2.12
Copyright (C) Kyoki Railway 1982-2013.

Network Line Speed is 1.0 Gbps / Full_Duplex Mode

A:\>KYOTRAS.EXE
*******************************************************************
* 列車運行管理システム KYOTRAS  線区CTCサーバー ver.23.2.1.13652  *
* Copyright (C) Kyoki Railway 1982-2013.                          *
*******************************************************************

ようこそ！

【運用中】 京姫本線 CTCサーバー 1号機

現在は、昭和90年06月09日 14時15分 です。
