﻿

■akane001 akane002でキーボードカタカタ


■表情(akane001,002共用)

@akane_kao001　フォルダ内

001
↓
002で電話に気付く


■電話を取る動作

akane003→004→005→004→006→007


■akane008 akane009でキーボードカタカタ


■口パク(akane008,009共用)

@akane_kao002　フォルダ内

002、003(はい)

004、003繰り返し(システム)

002(課)