%YAML 1.1
%TAG !u! tag:unity3d.com,2011:
--- !u!114 &11400000
MonoBehaviour:
  m_ObjectHideFlags: 0
  m_CorrespondingSourceObject: {fileID: 0}
  m_PrefabInstance: {fileID: 0}
  m_PrefabAsset: {fileID: 0}
  m_GameObject: {fileID: 0}
  m_Enabled: 1
  m_EditorHideFlags: 0
  m_Script: {fileID: 11500000, guid: 76936f4c5f1c7af47bd720ccd1dd037d, type: 3}
  m_Name: VengfulSpirit
  m_EditorClassIdentifier: 
  primaryAtt: 1
  heroSkills:
  - {fileID: 11400000, guid: 0c2941601c7ecd8478b96999c1dd66f7, type: 2}
  - {fileID: 11400000, guid: 9d8d172d805046f4bb00492216fa1754, type: 2}
  - {fileID: 11400000, guid: e0f34c29880f87e4487e315046beec46, type: 2}
  - {fileID: 11400000, guid: 79d7a3d3290d11748842d52da4956885, type: 2}
  baseStr: 19
  strGrowth: 2.4
  baseAgi: 20
  agiGrowth: 3.8
  baseInt: 17
  intGrowth: 1.5
  health: 200
  hpRegen: 0.25
  mana: 75
  mpRegen: 0
  moveSpeed: 290
  magicResistance: 0.25
  damage: 25
  armor: 0
  attackSpeed: 100
  attackRange: 400
  projectileSpeed: 1500
  baseAttackTime: 1.7
