%YAML 1.1
%TAG !u! tag:unity3d.com,2011:
--- !u!1001 &3814260319173536718
PrefabInstance:
  m_ObjectHideFlags: 0
  serializedVersion: 2
  m_Modification:
    m_TransformParent: {fileID: 0}
    m_Modifications:
    - target: {fileID: 706281327, guid: 5d63222202711bd449fbddebf1ec8d9e, type: 3}
      propertyPath: m_AngularSpeed
      value: 300
      objectReference: {fileID: 0}
    - target: {fileID: 706281327, guid: 5d63222202711bd449fbddebf1ec8d9e, type: 3}
      propertyPath: m_Acceleration
      value: 140
      objectReference: {fileID: 0}
    - target: {fileID: 236272649226337949, guid: 5d63222202711bd449fbddebf1ec8d9e,
        type: 3}
      propertyPath: m_Layer
      value: 10
      objectReference: {fileID: 0}
    - target: {fileID: 259860375492350448, guid: 5d63222202711bd449fbddebf1ec8d9e,
        type: 3}
      propertyPath: m_Layer
      value: 10
      objectReference: {fileID: 0}
    - target: {fileID: 533692544368854470, guid: 5d63222202711bd449fbddebf1ec8d9e,
        type: 3}
      propertyPath: m_Layer
      value: 10
      objectReference: {fileID: 0}
    - target: {fileID: 680374841077135138, guid: 5d63222202711bd449fbddebf1ec8d9e,
        type: 3}
      propertyPath: m_Layer
      value: 10
      objectReference: {fileID: 0}
    - target: {fileID: 794953872758729490, guid: 5d63222202711bd449fbddebf1ec8d9e,
        type: 3}
      propertyPath: m_Layer
      value: 10
      objectReference: {fileID: 0}
    - target: {fileID: 874860497553944644, guid: 5d63222202711bd449fbddebf1ec8d9e,
        type: 3}
      propertyPath: m_Layer
      value: 10
      objectReference: {fileID: 0}
    - target: {fileID: 1032908932152470173, guid: 5d63222202711bd449fbddebf1ec8d9e,
        type: 3}
      propertyPath: m_Layer
      value: 10
      objectReference: {fileID: 0}
    - target: {fileID: 1215759979646168796, guid: 5d63222202711bd449fbddebf1ec8d9e,
        type: 3}
      propertyPath: m_Layer
      value: 10
      objectReference: {fileID: 0}
    - target: {fileID: 1275733824627988899, guid: 5d63222202711bd449fbddebf1ec8d9e,
        type: 3}
      propertyPath: m_Layer
      value: 10
      objectReference: {fileID: 0}
    - target: {fileID: 1328623921624726264, guid: 5d63222202711bd449fbddebf1ec8d9e,
        type: 3}
      propertyPath: m_Layer
      value: 10
      objectReference: {fileID: 0}
    - target: {fileID: 1626529735093255959, guid: 5d63222202711bd449fbddebf1ec8d9e,
        type: 3}
      propertyPath: m_Layer
      value: 10
      objectReference: {fileID: 0}
    - target: {fileID: 1626529736160897760, guid: 5d63222202711bd449fbddebf1ec8d9e,
        type: 3}
      propertyPath: m_Name
      value: pf_SuperRadiantSiege
      objectReference: {fileID: 0}
    - target: {fileID: 1626529736160897760, guid: 5d63222202711bd449fbddebf1ec8d9e,
        type: 3}
      propertyPath: m_Layer
      value: 10
      objectReference: {fileID: 0}
    - target: {fileID: 1626529736160897789, guid: 5d63222202711bd449fbddebf1ec8d9e,
        type: 3}
      propertyPath: powerType
      value: 1
      objectReference: {fileID: 0}
    - target: {fileID: 1626529736160897789, guid: 5d63222202711bd449fbddebf1ec8d9e,
        type: 3}
      propertyPath: health
      value: 875
      objectReference: {fileID: 0}
    - target: {fileID: 1626529736160897789, guid: 5d63222202711bd449fbddebf1ec8d9e,
        type: 3}
      propertyPath: damage
      value: 57
      objectReference: {fileID: 0}
    - target: {fileID: 1626529736160897789, guid: 5d63222202711bd449fbddebf1ec8d9e,
        type: 3}
      propertyPath: types
      value: 2
      objectReference: {fileID: 0}
    - target: {fileID: 1626529736160897789, guid: 5d63222202711bd449fbddebf1ec8d9e,
        type: 3}
      propertyPath: armor
      value: 0
      objectReference: {fileID: 0}
    - target: {fileID: 1626529736160897789, guid: 5d63222202711bd449fbddebf1ec8d9e,
        type: 3}
      propertyPath: statGain
      value: 0.022
      objectReference: {fileID: 0}
    - target: {fileID: 1626529736160897789, guid: 5d63222202711bd449fbddebf1ec8d9e,
        type: 3}
      propertyPath: expReward
      value: 88
      objectReference: {fileID: 0}
    - target: {fileID: 1626529736160897789, guid: 5d63222202711bd449fbddebf1ec8d9e,
        type: 3}
      propertyPath: bountyReward
      value: 73
      objectReference: {fileID: 0}
    - target: {fileID: 1626529736160897790, guid: 5d63222202711bd449fbddebf1ec8d9e,
        type: 3}
      propertyPath: m_Constraints
      value: 112
      objectReference: {fileID: 0}
    - target: {fileID: 1626529736160897790, guid: 5d63222202711bd449fbddebf1ec8d9e,
        type: 3}
      propertyPath: m_UseGravity
      value: 0
      objectReference: {fileID: 0}
    - target: {fileID: 1626529736160897790, guid: 5d63222202711bd449fbddebf1ec8d9e,
        type: 3}
      propertyPath: m_IsKinematic
      value: 1
      objectReference: {fileID: 0}
    - target: {fileID: 1626529736160897791, guid: 5d63222202711bd449fbddebf1ec8d9e,
        type: 3}
      propertyPath: m_LocalPosition.x
      value: 113.39593
      objectReference: {fileID: 0}
    - target: {fileID: 1626529736160897791, guid: 5d63222202711bd449fbddebf1ec8d9e,
        type: 3}
      propertyPath: m_LocalPosition.y
      value: 4.76
      objectReference: {fileID: 0}
    - target: {fileID: 1626529736160897791, guid: 5d63222202711bd449fbddebf1ec8d9e,
        type: 3}
      propertyPath: m_LocalPosition.z
      value: 120.86506
      objectReference: {fileID: 0}
    - target: {fileID: 1626529736160897791, guid: 5d63222202711bd449fbddebf1ec8d9e,
        type: 3}
      propertyPath: m_LocalRotation.x
      value: 0
      objectReference: {fileID: 0}
    - target: {fileID: 1626529736160897791, guid: 5d63222202711bd449fbddebf1ec8d9e,
        type: 3}
      propertyPath: m_LocalRotation.y
      value: 0
      objectReference: {fileID: 0}
    - target: {fileID: 1626529736160897791, guid: 5d63222202711bd449fbddebf1ec8d9e,
        type: 3}
      propertyPath: m_LocalRotation.z
      value: 0
      objectReference: {fileID: 0}
    - target: {fileID: 1626529736160897791, guid: 5d63222202711bd449fbddebf1ec8d9e,
        type: 3}
      propertyPath: m_LocalRotation.w
      value: 1
      objectReference: {fileID: 0}
    - target: {fileID: 1626529736160897791, guid: 5d63222202711bd449fbddebf1ec8d9e,
        type: 3}
      propertyPath: m_RootOrder
      value: 0
      objectReference: {fileID: 0}
    - target: {fileID: 1626529736160897791, guid: 5d63222202711bd449fbddebf1ec8d9e,
        type: 3}
      propertyPath: m_LocalEulerAnglesHint.x
      value: 0
      objectReference: {fileID: 0}
    - target: {fileID: 1626529736160897791, guid: 5d63222202711bd449fbddebf1ec8d9e,
        type: 3}
      propertyPath: m_LocalEulerAnglesHint.y
      value: 0
      objectReference: {fileID: 0}
    - target: {fileID: 1626529736160897791, guid: 5d63222202711bd449fbddebf1ec8d9e,
        type: 3}
      propertyPath: m_LocalEulerAnglesHint.z
      value: 0
      objectReference: {fileID: 0}
    - target: {fileID: 1949614542808002441, guid: 5d63222202711bd449fbddebf1ec8d9e,
        type: 3}
      propertyPath: m_Layer
      value: 10
      objectReference: {fileID: 0}
    - target: {fileID: 2066716550099060207, guid: 5d63222202711bd449fbddebf1ec8d9e,
        type: 3}
      propertyPath: m_Layer
      value: 10
      objectReference: {fileID: 0}
    - target: {fileID: 2202757927223413072, guid: 5d63222202711bd449fbddebf1ec8d9e,
        type: 3}
      propertyPath: m_Layer
      value: 10
      objectReference: {fileID: 0}
    - target: {fileID: 2306208117360412923, guid: 5d63222202711bd449fbddebf1ec8d9e,
        type: 3}
      propertyPath: m_Layer
      value: 10
      objectReference: {fileID: 0}
    - target: {fileID: 2364408010315435621, guid: 5d63222202711bd449fbddebf1ec8d9e,
        type: 3}
      propertyPath: m_Layer
      value: 10
      objectReference: {fileID: 0}
    - target: {fileID: 2418679963021072500, guid: 5d63222202711bd449fbddebf1ec8d9e,
        type: 3}
      propertyPath: m_Layer
      value: 10
      objectReference: {fileID: 0}
    - target: {fileID: 2528151320315933956, guid: 5d63222202711bd449fbddebf1ec8d9e,
        type: 3}
      propertyPath: m_Layer
      value: 10
      objectReference: {fileID: 0}
    - target: {fileID: 2607296659411267043, guid: 5d63222202711bd449fbddebf1ec8d9e,
        type: 3}
      propertyPath: m_Layer
      value: 10
      objectReference: {fileID: 0}
    - target: {fileID: 2629120388539925760, guid: 5d63222202711bd449fbddebf1ec8d9e,
        type: 3}
      propertyPath: m_Layer
      value: 10
      objectReference: {fileID: 0}
    - target: {fileID: 2857156517750270616, guid: 5d63222202711bd449fbddebf1ec8d9e,
        type: 3}
      propertyPath: m_Layer
      value: 10
      objectReference: {fileID: 0}
    - target: {fileID: 2917273071609729762, guid: 5d63222202711bd449fbddebf1ec8d9e,
        type: 3}
      propertyPath: m_Layer
      value: 10
      objectReference: {fileID: 0}
    - target: {fileID: 2978615670576394961, guid: 5d63222202711bd449fbddebf1ec8d9e,
        type: 3}
      propertyPath: m_Layer
      value: 10
      objectReference: {fileID: 0}
    - target: {fileID: 2997104466955664565, guid: 5d63222202711bd449fbddebf1ec8d9e,
        type: 3}
      propertyPath: m_Layer
      value: 10
      objectReference: {fileID: 0}
    - target: {fileID: 3122074559504170138, guid: 5d63222202711bd449fbddebf1ec8d9e,
        type: 3}
      propertyPath: m_Layer
      value: 10
      objectReference: {fileID: 0}
    - target: {fileID: 3197616137136891710, guid: 5d63222202711bd449fbddebf1ec8d9e,
        type: 3}
      propertyPath: m_Layer
      value: 10
      objectReference: {fileID: 0}
    - target: {fileID: 3213461633537062304, guid: 5d63222202711bd449fbddebf1ec8d9e,
        type: 3}
      propertyPath: m_Layer
      value: 10
      objectReference: {fileID: 0}
    - target: {fileID: 3422584062149834161, guid: 5d63222202711bd449fbddebf1ec8d9e,
        type: 3}
      propertyPath: m_Layer
      value: 10
      objectReference: {fileID: 0}
    - target: {fileID: 3459914621198230063, guid: 5d63222202711bd449fbddebf1ec8d9e,
        type: 3}
      propertyPath: m_Layer
      value: 10
      objectReference: {fileID: 0}
    - target: {fileID: 3813661044304414121, guid: 5d63222202711bd449fbddebf1ec8d9e,
        type: 3}
      propertyPath: m_Layer
      value: 10
      objectReference: {fileID: 0}
    - target: {fileID: 3817769747609530971, guid: 5d63222202711bd449fbddebf1ec8d9e,
        type: 3}
      propertyPath: m_Layer
      value: 10
      objectReference: {fileID: 0}
    - target: {fileID: 3833784034393722244, guid: 5d63222202711bd449fbddebf1ec8d9e,
        type: 3}
      propertyPath: m_Layer
      value: 10
      objectReference: {fileID: 0}
    - target: {fileID: 3838058661854128365, guid: 5d63222202711bd449fbddebf1ec8d9e,
        type: 3}
      propertyPath: m_Layer
      value: 10
      objectReference: {fileID: 0}
    - target: {fileID: 3929486410499027565, guid: 5d63222202711bd449fbddebf1ec8d9e,
        type: 3}
      propertyPath: m_Layer
      value: 10
      objectReference: {fileID: 0}
    - target: {fileID: 4020335150244826480, guid: 5d63222202711bd449fbddebf1ec8d9e,
        type: 3}
      propertyPath: m_Layer
      value: 10
      objectReference: {fileID: 0}
    - target: {fileID: 4119026632069481892, guid: 5d63222202711bd449fbddebf1ec8d9e,
        type: 3}
      propertyPath: m_Layer
      value: 10
      objectReference: {fileID: 0}
    - target: {fileID: 4152674910358724260, guid: 5d63222202711bd449fbddebf1ec8d9e,
        type: 3}
      propertyPath: m_Radius
      value: 0.7
      objectReference: {fileID: 0}
    - target: {fileID: 4152674910358724260, guid: 5d63222202711bd449fbddebf1ec8d9e,
        type: 3}
      propertyPath: m_Height
      value: 2.45
      objectReference: {fileID: 0}
    - target: {fileID: 4227559358467985776, guid: 5d63222202711bd449fbddebf1ec8d9e,
        type: 3}
      propertyPath: m_Layer
      value: 10
      objectReference: {fileID: 0}
    - target: {fileID: 4260107258114615976, guid: 5d63222202711bd449fbddebf1ec8d9e,
        type: 3}
      propertyPath: m_Layer
      value: 10
      objectReference: {fileID: 0}
    - target: {fileID: 4418837081057922135, guid: 5d63222202711bd449fbddebf1ec8d9e,
        type: 3}
      propertyPath: m_Layer
      value: 10
      objectReference: {fileID: 0}
    - target: {fileID: 4527424682257907108, guid: 5d63222202711bd449fbddebf1ec8d9e,
        type: 3}
      propertyPath: m_Layer
      value: 10
      objectReference: {fileID: 0}
    - target: {fileID: 4960237953068008933, guid: 5d63222202711bd449fbddebf1ec8d9e,
        type: 3}
      propertyPath: m_Layer
      value: 10
      objectReference: {fileID: 0}
    - target: {fileID: 5200206655914796536, guid: 5d63222202711bd449fbddebf1ec8d9e,
        type: 3}
      propertyPath: m_Layer
      value: 10
      objectReference: {fileID: 0}
    - target: {fileID: 5448114729052877602, guid: 5d63222202711bd449fbddebf1ec8d9e,
        type: 3}
      propertyPath: m_Layer
      value: 10
      objectReference: {fileID: 0}
    - target: {fileID: 5452253497902340203, guid: 5d63222202711bd449fbddebf1ec8d9e,
        type: 3}
      propertyPath: m_Layer
      value: 10
      objectReference: {fileID: 0}
    - target: {fileID: 5608653423704482142, guid: 5d63222202711bd449fbddebf1ec8d9e,
        type: 3}
      propertyPath: m_Layer
      value: 10
      objectReference: {fileID: 0}
    - target: {fileID: 5792883898768488820, guid: 5d63222202711bd449fbddebf1ec8d9e,
        type: 3}
      propertyPath: m_Layer
      value: 10
      objectReference: {fileID: 0}
    - target: {fileID: 5839705644458745899, guid: 5d63222202711bd449fbddebf1ec8d9e,
        type: 3}
      propertyPath: m_Layer
      value: 10
      objectReference: {fileID: 0}
    - target: {fileID: 6049351212300827471, guid: 5d63222202711bd449fbddebf1ec8d9e,
        type: 3}
      propertyPath: m_Layer
      value: 10
      objectReference: {fileID: 0}
    - target: {fileID: 6193720544946623807, guid: 5d63222202711bd449fbddebf1ec8d9e,
        type: 3}
      propertyPath: m_Layer
      value: 10
      objectReference: {fileID: 0}
    - target: {fileID: 6458485596702421909, guid: 5d63222202711bd449fbddebf1ec8d9e,
        type: 3}
      propertyPath: m_Layer
      value: 10
      objectReference: {fileID: 0}
    - target: {fileID: 6489702903814053109, guid: 5d63222202711bd449fbddebf1ec8d9e,
        type: 3}
      propertyPath: m_Layer
      value: 10
      objectReference: {fileID: 0}
    - target: {fileID: 6685648784210424053, guid: 5d63222202711bd449fbddebf1ec8d9e,
        type: 3}
      propertyPath: m_Layer
      value: 10
      objectReference: {fileID: 0}
    - target: {fileID: 6732445739789216481, guid: 5d63222202711bd449fbddebf1ec8d9e,
        type: 3}
      propertyPath: m_Layer
      value: 10
      objectReference: {fileID: 0}
    - target: {fileID: 6860679968436722198, guid: 5d63222202711bd449fbddebf1ec8d9e,
        type: 3}
      propertyPath: m_Layer
      value: 10
      objectReference: {fileID: 0}
    - target: {fileID: 6935927466377774101, guid: 5d63222202711bd449fbddebf1ec8d9e,
        type: 3}
      propertyPath: m_Layer
      value: 10
      objectReference: {fileID: 0}
    - target: {fileID: 7130244392925468973, guid: 5d63222202711bd449fbddebf1ec8d9e,
        type: 3}
      propertyPath: m_Layer
      value: 10
      objectReference: {fileID: 0}
    - target: {fileID: 7177208187269737390, guid: 5d63222202711bd449fbddebf1ec8d9e,
        type: 3}
      propertyPath: m_Layer
      value: 10
      objectReference: {fileID: 0}
    - target: {fileID: 7195947425421135255, guid: 5d63222202711bd449fbddebf1ec8d9e,
        type: 3}
      propertyPath: m_Layer
      value: 10
      objectReference: {fileID: 0}
    - target: {fileID: 7272796537266303530, guid: 5d63222202711bd449fbddebf1ec8d9e,
        type: 3}
      propertyPath: m_Layer
      value: 10
      objectReference: {fileID: 0}
    - target: {fileID: 7297623298008447062, guid: 5d63222202711bd449fbddebf1ec8d9e,
        type: 3}
      propertyPath: m_Layer
      value: 10
      objectReference: {fileID: 0}
    - target: {fileID: 7413668047968397958, guid: 5d63222202711bd449fbddebf1ec8d9e,
        type: 3}
      propertyPath: m_Layer
      value: 10
      objectReference: {fileID: 0}
    - target: {fileID: 7720130602838658874, guid: 5d63222202711bd449fbddebf1ec8d9e,
        type: 3}
      propertyPath: m_Layer
      value: 10
      objectReference: {fileID: 0}
    - target: {fileID: 8131196082632725080, guid: 5d63222202711bd449fbddebf1ec8d9e,
        type: 3}
      propertyPath: m_Layer
      value: 10
      objectReference: {fileID: 0}
    - target: {fileID: 8206933430701484682, guid: 5d63222202711bd449fbddebf1ec8d9e,
        type: 3}
      propertyPath: m_Layer
      value: 10
      objectReference: {fileID: 0}
    - target: {fileID: 8252779996282284067, guid: 5d63222202711bd449fbddebf1ec8d9e,
        type: 3}
      propertyPath: m_Layer
      value: 10
      objectReference: {fileID: 0}
    - target: {fileID: 8456605644495307332, guid: 5d63222202711bd449fbddebf1ec8d9e,
        type: 3}
      propertyPath: m_Layer
      value: 10
      objectReference: {fileID: 0}
    - target: {fileID: 8502279640801047126, guid: 5d63222202711bd449fbddebf1ec8d9e,
        type: 3}
      propertyPath: m_Layer
      value: 10
      objectReference: {fileID: 0}
    - target: {fileID: 8510219777080692800, guid: 5d63222202711bd449fbddebf1ec8d9e,
        type: 3}
      propertyPath: m_Layer
      value: 10
      objectReference: {fileID: 0}
    - target: {fileID: 8569605007187578856, guid: 5d63222202711bd449fbddebf1ec8d9e,
        type: 3}
      propertyPath: m_Layer
      value: 10
      objectReference: {fileID: 0}
    - target: {fileID: 8683226919843717641, guid: 5d63222202711bd449fbddebf1ec8d9e,
        type: 3}
      propertyPath: m_Layer
      value: 10
      objectReference: {fileID: 0}
    - target: {fileID: 8788220686905984205, guid: 5d63222202711bd449fbddebf1ec8d9e,
        type: 3}
      propertyPath: m_Layer
      value: 10
      objectReference: {fileID: 0}
    - target: {fileID: 9052256595606897437, guid: 5d63222202711bd449fbddebf1ec8d9e,
        type: 3}
      propertyPath: m_Layer
      value: 10
      objectReference: {fileID: 0}
    m_RemovedComponents: []
  m_SourcePrefab: {fileID: 100100000, guid: 5d63222202711bd449fbddebf1ec8d9e, type: 3}
