{
    "name": "MouseControls",
    "maps": [
        {
            "name": "Mouse",
            "id": "80b81f00-a6d4-4386-af12-7c1782c9929d",
            "actions": [
                {
                    "name": "Pan",
                    "type": "PassThrough",
                    "id": "5858e141-6501-4bb2-ab03-34251c652a08",
                    "expectedControlType": "Vector2",
                    "processors": "",
                    "interactions": ""
                },
                {
                    "name": "Zoom",
                    "type": "PassThrough",
                    "id": "d9ac97b7-507b-49e4-b268-a4f4c8995e95",
                    "expectedControlType": "Axis",
                    "processors": "Normalize(min=-1,max=1)",
                    "interactions": ""
                }
            ],
            "bindings": [
                {
                    "name": "",
                    "id": "3bc40c93-2642-491b-9e0d-d51611be8647",
                    "path": "<Mouse>/position",
                    "interactions": "",
                    "processors": "",
                    "groups": "",
                    "action": "Pan",
                    "isComposite": false,
                    "isPartOfComposite": false
                },
                {
                    "name": "",
                    "id": "c64cb83e-4caa-4b60-a70c-fae9766575bd",
                    "path": "<Mouse>/scroll/y",
                    "interactions": "",
                    "processors": "",
                    "groups": "",
                    "action": "Zoom",
                    "isComposite": false,
                    "isPartOfComposite": false
                }
            ]
        },
        {
            "name": "UnitControl",
            "id": "6e696d75-b9a6-4533-b8d8-51d513c733b2",
            "actions": [
                {
                    "name": "MovePlayer",
                    "type": "Button",
                    "id": "e8845b5b-04ad-46a9-8202-97b396ce1d57",
                    "expectedControlType": "Button",
                    "processors": "Normalize(min=-1,max=1)",
                    "interactions": ""
                },
                {
                    "name": "ControlUnit",
                    "type": "Button",
                    "id": "982d9444-4c5e-4d39-b8c1-b0412803f763",
                    "expectedControlType": "Button",
                    "processors": "Normalize(min=-1,max=1)",
                    "interactions": ""
                },
                {
                    "name": "MousePosition",
                    "type": "PassThrough",
                    "id": "935def3f-9004-416c-98ac-738e097334db",
                    "expectedControlType": "Vector2",
                    "processors": "Normalize(min=-1,max=1)",
                    "interactions": ""
                },
                {
                    "name": "StopUnit",
                    "type": "Button",
                    "id": "369bdc2f-54c5-49bf-9643-9d67d500c640",
                    "expectedControlType": "Button",
                    "processors": "Normalize(min=-1,max=1)",
                    "interactions": ""
                },
                {
                    "name": "1stSkill",
                    "type": "Button",
                    "id": "6374e9fd-ebfd-43a4-b69c-7b7e0a51fe98",
                    "expectedControlType": "Button",
                    "processors": "Normalize(min=-1,max=1)",
                    "interactions": ""
                },
                {
                    "name": "2ndSkill",
                    "type": "Button",
                    "id": "5c24f408-d559-47a7-88c9-a3fb4baeebad",
                    "expectedControlType": "Button",
                    "processors": "Normalize(min=-1,max=1)",
                    "interactions": ""
                },
                {
                    "name": "3rdSkill",
                    "type": "Button",
                    "id": "8d6e7fdc-8194-4652-ae02-63cc0e0038ff",
                    "expectedControlType": "Button",
                    "processors": "Normalize(min=-1,max=1)",
                    "interactions": ""
                },
                {
                    "name": "4thSkill",
                    "type": "Button",
                    "id": "53c76742-6971-491f-aa59-76d9f61f9fb5",
                    "expectedControlType": "Button",
                    "processors": "Normalize(min=-1,max=1)",
                    "interactions": ""
                }
            ],
            "bindings": [
                {
                    "name": "",
                    "id": "a79f6e93-6d87-49af-9ab5-40975def9b0a",
                    "path": "<Mouse>/rightButton",
                    "interactions": "",
                    "processors": "",
                    "groups": "",
                    "action": "MovePlayer",
                    "isComposite": false,
                    "isPartOfComposite": false
                },
                {
                    "name": "",
                    "id": "de6f31ed-886c-4603-827c-a49f098b8563",
                    "path": "<Mouse>/leftButton",
                    "interactions": "",
                    "processors": "",
                    "groups": "",
                    "action": "ControlUnit",
                    "isComposite": false,
                    "isPartOfComposite": false
                },
                {
                    "name": "",
                    "id": "5437d63d-309d-4284-84d6-b4aa089831cf",
                    "path": "<Mouse>/position",
                    "interactions": "",
                    "processors": "",
                    "groups": "",
                    "action": "MousePosition",
                    "isComposite": false,
                    "isPartOfComposite": false
                },
                {
                    "name": "",
                    "id": "3d73be5b-3341-4883-afa4-173993a052fa",
                    "path": "<Keyboard>/s",
                    "interactions": "",
                    "processors": "",
                    "groups": "",
                    "action": "StopUnit",
                    "isComposite": false,
                    "isPartOfComposite": false
                },
                {
                    "name": "",
                    "id": "706c5362-3bfa-4f75-9de0-7009c5d1e87d",
                    "path": "<Keyboard>/q",
                    "interactions": "Press",
                    "processors": "",
                    "groups": "",
                    "action": "1stSkill",
                    "isComposite": false,
                    "isPartOfComposite": false
                },
                {
                    "name": "",
                    "id": "e3264084-84bb-4539-b88f-2c27848462da",
                    "path": "<Keyboard>/w",
                    "interactions": "Press",
                    "processors": "",
                    "groups": "",
                    "action": "2ndSkill",
                    "isComposite": false,
                    "isPartOfComposite": false
                },
                {
                    "name": "",
                    "id": "35b1f09f-43f3-48bf-893f-f2bdc6c61f9c",
                    "path": "<Keyboard>/e",
                    "interactions": "Press",
                    "processors": "",
                    "groups": "",
                    "action": "3rdSkill",
                    "isComposite": false,
                    "isPartOfComposite": false
                },
                {
                    "name": "",
                    "id": "df299804-c2ba-4292-a1fb-384892f9eeb4",
                    "path": "<Keyboard>/r",
                    "interactions": "Press",
                    "processors": "",
                    "groups": "",
                    "action": "4thSkill",
                    "isComposite": false,
                    "isPartOfComposite": false
                }
            ]
        }
    ],
    "controlSchemes": []
}