_id,timestamp,device_id,city,temperature,temperature_max,temperature_min,unit,humidity,pressure,wind_speed,wind_degrees,cloudiness,rain,snow,sunrise,sunset,weather_icon_id,weather_description
1,1562553855089.00,d8e061cb-282b-43f2-854e-9ae3c927f220,Hacienda Heights,20.38,23,23,metric,56,1014,4.1,210,1,0,0,1562503621,1562555184,1,clear sky
2,1562555628575.00,d8e061cb-282b-43f2-854e-9ae3c927f220,Hacienda Heights,19.56,22.22,22.22,metric,77,1014,4.1,250,75,0,0,1562503621,1562555184,4,broken clouds
3,1562555655003.00,d8e061cb-282b-43f2-854e-9ae3c927f220,Hacienda Heights,19.56,22.22,22.22,metric,77,1014,4.1,250,75,0,0,1562503621,1562555184,4,broken clouds
4,1562557433611.00,d8e061cb-282b-43f2-854e-9ae3c927f220,Hacienda Heights,18.93,21,21,metric,72,1015,2.6,230,40,0,0,1562503621,1562555184,3,scattered clouds
5,1562557454990.00,d8e061cb-282b-43f2-854e-9ae3c927f220,Hacienda Heights,18.93,21,21,metric,72,1015,2.6,230,40,0,0,1562503621,1562555184,3,scattered clouds
6,1562558351563.00,d8e061cb-282b-43f2-854e-9ae3c927f220,Hacienda Heights,18.72,21,21,metric,82,1015,3.1,190,75,0,0,1562503621,1562555184,4,broken clouds
7,1562558387383.00,d8e061cb-282b-43f2-854e-9ae3c927f220,Hacienda Heights,18.72,21,21,metric,82,1015,3.1,190,75,0,0,1562503621,1562555184,4,broken clouds
8,1562558448591.00,d8e061cb-282b-43f2-854e-9ae3c927f220,Hacienda Heights,18.65,20.56,20.56,metric,82,1015,3.1,190,75,0,0,1562503621,1562555184,4,broken clouds
9,1562558455504.00,d8e061cb-282b-43f2-854e-9ae3c927f220,Hacienda Heights,18.72,21,21,metric,82,1015,3.1,190,75,0,0,1562503621,1562555184,4,broken clouds
10,1562558505625.00,d8e061cb-282b-43f2-854e-9ae3c927f220,Hacienda Heights,18.61,20.56,20.56,metric,82,1015,3.1,190,75,0,0,1562503621,1562555184,4,broken clouds
11,1562560305897.00,d8e061cb-282b-43f2-854e-9ae3c927f220,Hacienda Heights,18.24,20,20,metric,72,1015,3.6,180,75,0,0,1562503621,1562555184,4,broken clouds
12,1562562105907.00,d8e061cb-282b-43f2-854e-9ae3c927f220,Hacienda Heights,18.16,20,20,metric,82,1015,3.6,240,29,0,0,1562503621,1562555184,3,scattered clouds
13,1562563905922.00,d8e061cb-282b-43f2-854e-9ae3c927f220,Hacienda Heights,18.07,19.44,19.44,metric,72,1015,2.6,160,90,0,0,1562503621,1562555184,4,overcast clouds
14,1562565705780.00,d8e061cb-282b-43f2-854e-9ae3c927f220,Hacienda Heights,18.04,19.44,19.44,metric,82,1016,4.1,250,75,0,0,1562503621,1562555184,4,broken clouds
15,1562567505929.00,d8e061cb-282b-43f2-854e-9ae3c927f220,Hacienda Heights,18.03,19.44,19.44,metric,68,1016,2.6,190,90,0,0,1562503621,1562555184,4,overcast clouds
16,1562569305606.00,d8e061cb-282b-43f2-854e-9ae3c927f220,Hacienda Heights,18,19.44,19.44,metric,82,1016,5.1,260,29,0,0,1562590052,1562641571,3,scattered clouds
17,1562571105758.00,d8e061cb-282b-43f2-854e-9ae3c927f220,Hacienda Heights,17.93,19.44,19.44,metric,68,1015,2.6,190,90,0,0,1562590052,1562641571,4,overcast clouds
18,1562572905703.00,d8e061cb-282b-43f2-854e-9ae3c927f220,Hacienda Heights,17.83,19,19,metric,87,1016,3.6,250,55,0,0,1562590052,1562641571,4,broken clouds
19,1562574705740.00,d8e061cb-282b-43f2-854e-9ae3c927f220,Hacienda Heights,17.63,19,19,metric,82,1015,1.5,310,75,0,0,1562590052,1562641571,4,broken clouds
20,1562576505588.00,d8e061cb-282b-43f2-854e-9ae3c927f220,Hacienda Heights,17.59,19,19,metric,87,1015,3.6,270,55,0,0,1562590052,1562641571,4,broken clouds
21,1562578305891.00,d8e061cb-282b-43f2-854e-9ae3c927f220,Hacienda Heights,17.51,19,19,metric,72,1015,3.1,200,90,0,0,1562590052,1562641571,4,overcast clouds
22,1562580105516.00,d8e061cb-282b-43f2-854e-9ae3c927f220,Hacienda Heights,17.55,19,19,metric,87,1015,2.1,290,55,0,0,1562590052,1562641571,4,broken clouds
23,1562581905836.00,d8e061cb-282b-43f2-854e-9ae3c927f220,Hacienda Heights,17.51,19,19,metric,72,1015,2.1,170,90,0,0,1562590052,1562641571,4,overcast clouds
24,1562583705646.00,d8e061cb-282b-43f2-854e-9ae3c927f220,Hacienda Heights,17.52,19.44,19.44,metric,82,1015,2.6,230,65,0,0,1562590052,1562641571,4,broken clouds
25,1562585505796.00,d8e061cb-282b-43f2-854e-9ae3c927f220,Hacienda Heights,17.29,19.44,19.44,metric,72,1015,2.1,190,90,0,0,1562590052,1562641571,4,overcast clouds
26,1562587305607.00,d8e061cb-282b-43f2-854e-9ae3c927f220,Hacienda Heights,17.35,19.44,19.44,metric,82,1015,3.1,270,96,0,0,1562590052,1562641571,4,overcast clouds
27,1562589105956.00,d8e061cb-282b-43f2-854e-9ae3c927f220,Hacienda Heights,17.38,19,19,metric,72,1015,2.45,130.728,90,0,0,1562590052,1562641571,4,overcast clouds
28,1562593598562.00,baf0ca22-ca12-4ebd-8378-20189109324f,Hacienda Heights,17.34,19,19,metric,82,1016,1.5,200,90,0,0,1562590052,1562641571,50,mist
29,1562590905576.00,d8e061cb-282b-43f2-854e-9ae3c927f220,Hacienda Heights,17.35,19,19,metric,82,1016,1.5,190,96,0,0,1562590052,1562641571,4,overcast clouds
30,1562592705879.00,d8e061cb-282b-43f2-854e-9ae3c927f220,Hacienda Heights,17.33,19,19,metric,72,1015,2.1,127.889,90,0,0,1562590052,1562641571,4,overcast clouds
31,1562594505737.00,d8e061cb-282b-43f2-854e-9ae3c927f220,Hacienda Heights,17.37,19,19,metric,82,1016,1.5,200,90,0,0,1562590052,1562641571,50,mist
32,1562598105567.00,d8e061cb-282b-43f2-854e-9ae3c927f220,Hacienda Heights,17.39,19,19,metric,82,1017,2.1,270,90,0,0,1562590052,1562641571,50,haze
33,1562599905839.00,d8e061cb-282b-43f2-854e-9ae3c927f220,Hacienda Heights,17.56,19.44,19.44,metric,72,1016,2.1,127.889,90,0,0,1562590052,1562641571,50,haze
34,1562604211001.00,99a86843-82f2-43af-844a-978669900d19,Hacienda Heights,18.65,20,20,metric,68,1016,1.5,160,90,0,0,1562590052,1562641571,50,haze
35,1562601705670.00,d8e061cb-282b-43f2-854e-9ae3c927f220,Hacienda Heights,17.9,19.44,19.44,metric,68,1016,1.5,0,90,0,0,1562590052,1562641571,50,haze
36,1562603505742.00,d8e061cb-282b-43f2-854e-9ae3c927f220,Hacienda Heights,18.09,20,20,metric,68,1016,1.5,160,90,0,0,1562590052,1562641571,50,haze
37,1562605305718.00,d8e061cb-282b-43f2-854e-9ae3c927f220,Hacienda Heights,18.85,20.56,20.56,metric,63,1016,2.6,180,90,0,0,1562590052,1562641571,50,haze
38,1562607105678.00,d8e061cb-282b-43f2-854e-9ae3c927f220,Hacienda Heights,19.22,20.56,20.56,metric,68,1016,1.5,170,90,0,0,1562590052,1562641571,50,haze
39,1562611995856.00,51397770-d216-4391-ab33-243fb24bb81e,Hacienda Heights,20.43,22.22,22.22,metric,64,1016,1.5,170,90,0,0,1562590052,1562641571,50,haze
40,1562608905587.00,d8e061cb-282b-43f2-854e-9ae3c927f220,Hacienda Heights,19.65,21.11,21.11,metric,68,1016,1.5,170,90,0,0,1562590052,1562641571,50,haze
41,1562610705696.00,d8e061cb-282b-43f2-854e-9ae3c927f220,Hacienda Heights,20.16,21.67,21.67,metric,64,1016,1.5,170,90,0,0,1562590052,1562641571,50,haze
42,1562618780022.00,5b2c4ac8-eea6-4f17-850f-0a7f10acee2f,Hacienda Heights,23,25,25,metric,60,1016,3.6,260,1,0,0,1562590052,1562641571,1,clear sky
43,1562618627982.00,51397770-d216-4391-ab33-243fb24bb81e,Hacienda Heights,22.95,25,25,metric,53,1016,4.59,218.332,75,0,0,1562590052,1562641571,4,broken clouds
44,1562620427756.00,51397770-d216-4391-ab33-243fb24bb81e,Hacienda Heights,23.31,25.56,25.56,metric,60,1016,3.6,260,1,0,0,1562590052,1562641571,1,clear sky
45,1562605439027.00,99a86843-82f2-43af-844a-978669900d19,Hacienda Heights,18.89,20.56,20.56,metric,63,1016,2.6,180,90,0,0,1562590052,1562641571,50,haze
46,1562607239097.00,99a86843-82f2-43af-844a-978669900d19,Hacienda Heights,19.38,20.56,20.56,metric,68,1016,1.5,170,90,0,0,1562590052,1562641571,50,haze
47,1562609039020.00,99a86843-82f2-43af-844a-978669900d19,Hacienda Heights,19.65,21.11,21.11,metric,68,1016,1.5,170,90,0,0,1562590052,1562641571,50,haze
48,1562610838898.00,99a86843-82f2-43af-844a-978669900d19,Hacienda Heights,20.07,21.67,21.67,metric,64,1016,1.5,170,90,0,0,1562590052,1562641571,50,haze
49,1562612638949.00,99a86843-82f2-43af-844a-978669900d19,Hacienda Heights,20.55,22.22,22.22,metric,64,1016,1.5,170,90,0,0,1562590052,1562641571,50,haze
50,1562614439001.00,99a86843-82f2-43af-844a-978669900d19,Hacienda Heights,21.42,23.33,23.33,metric,60,1016,2.6,210,75,0,0,1562590052,1562641571,50,haze
51,1562616239382.00,99a86843-82f2-43af-844a-978669900d19,Hacienda Heights,22.16,24,24,metric,56,1016,4.59,218.332,90,0,0,1562590052,1562641571,4,overcast clouds
52,1562621639083.00,99a86843-82f2-43af-844a-978669900d19,Hacienda Heights,23.74,26.11,26.11,metric,50,1015,3.1,0,20,0,0,1562590052,1562641571,2,few clouds
53,1562623439093.00,99a86843-82f2-43af-844a-978669900d19,Hacienda Heights,23.83,26.11,26.11,metric,53,1016,4.6,260,1,0,0,1562590052,1562641571,1,clear sky
54,1562629694932.00,4d6a0382-238d-4bd4-84ee-d88cc35a5f3d,Hacienda Heights,23.62,26.11,26.11,metric,50,1015,4.1,270,1,0,0,1562590052,1562641571,1,clear sky
55,1562632350358.00,6489598a-b088-46f7-ae6e-d2dfb0c67ea5,Hacienda Heights,23.3,25.56,25.56,metric,50,1015,2.6,0,1,0,0,1562590052,1562641571,1,clear sky
56,1562632351427.00,6489598a-b088-46f7-ae6e-d2dfb0c67ea5,Hacienda Heights,23.29,25.56,25.56,metric,50,1015,2.6,0,1,0,0,1562590052,1562641571,1,clear sky
57,1562639497106.00,acc0b042-1b33-4857-bceb-7ddbdc9394ce,Hacienda Heights,20.91,23,23,metric,60,1015,3.6,200,1,0,0,1562590052,1562641571,1,clear sky
58,1562643012337.00,f4ca68e5-2413-445d-ba0c-9457f4a1b362,Tainan,28.25,31.11,31.11,metric,100,1007,2.1,120,75,0,0,1562620834,1562669355,9,shower rain
59,1562643117722.00,f4ca68e5-2413-445d-ba0c-9457f4a1b362,Tainan,28.25,31.11,31.11,metric,100,1007,2.1,120,75,0,0,1562620834,1562669355,9,shower rain
60,1562643130509.00,f4ca68e5-2413-445d-ba0c-9457f4a1b362,Tainan,28.25,31.11,31.11,metric,100,1007,2.1,120,75,0,0,1562620834,1562669355,9,shower rain
61,1562643131013.00,f4ca68e5-2413-445d-ba0c-9457f4a1b362,Tainan,28.25,31.11,31.11,metric,100,1007,2.1,120,75,0,0,1562620834,1562669355,9,shower rain
62,1562646823935.00,0ad5831b-e34a-42bc-b649-a8f8d60aa096,Hacienda Heights,18.48,20.56,20.56,metric,72,1016,2.6,230,75,0,0,1562590052,1562641571,4,broken clouds
63,1562646824264.00,0ad5831b-e34a-42bc-b649-a8f8d60aa096,Hacienda Heights,18.46,20.56,20.56,metric,72,1016,2.6,230,75,0,0,1562590052,1562641571,4,broken clouds
64,1562646834889.00,0ad5831b-e34a-42bc-b649-a8f8d60aa096,Hacienda Heights,18.46,20.56,20.56,metric,72,1016,2.6,230,75,0,0,1562590052,1562641571,4,broken clouds
65,1562646835922.00,0ad5831b-e34a-42bc-b649-a8f8d60aa096,Hacienda Heights,18.46,20.56,20.56,metric,72,1016,2.6,230,75,0,0,1562590052,1562641571,4,broken clouds
66,1562647139963.00,903be8ed-91d3-455a-a64b-1964e2d66e1b,Hacienda Heights,18.34,20,20,metric,72,1016,2.6,230,75,0,0,1562590052,1562641571,4,broken clouds
67,1562652955070.00,a65e4b1a-6f58-40d4-ac2f-bb2723954ab7,Avalon,18.24,19,19,metric,82,1017,1.5,250,90,0,0,1562590205,1562641418,4,overcast clouds
68,1562612505470.00,d8e061cb-282b-43f2-854e-9ae3c927f220,Hacienda Heights,20.51,22.22,22.22,metric,64,1016,1.5,170,90,0,0,1562590052,1562641571,50,haze
69,1562614305800.00,d8e061cb-282b-43f2-854e-9ae3c927f220,Hacienda Heights,21.21,22.78,22.78,metric,60,1016,2.6,210,75,0,0,1562590052,1562641571,50,haze
70,1562616105740.00,d8e061cb-282b-43f2-854e-9ae3c927f220,Hacienda Heights,21.96,23.89,23.89,metric,64,1016,4.1,230,1,0,0,1562590052,1562641571,50,haze
71,1562617905764.00,d8e061cb-282b-43f2-854e-9ae3c927f220,Hacienda Heights,22.77,24.44,24.44,metric,53,1016,4.59,218.332,75,0,0,1562590052,1562641571,4,broken clouds
72,1562619705733.00,d8e061cb-282b-43f2-854e-9ae3c927f220,Hacienda Heights,23.11,25,25,metric,60,1016,3.6,260,1,0,0,1562590052,1562641571,1,clear sky
73,1562621505631.00,d8e061cb-282b-43f2-854e-9ae3c927f220,Hacienda Heights,23.61,26.11,26.11,metric,50,1015,3.1,0,20,0,0,1562590052,1562641571,2,few clouds
74,1562623305676.00,d8e061cb-282b-43f2-854e-9ae3c927f220,Hacienda Heights,23.87,26.11,26.11,metric,53,1016,4.6,260,1,0,0,1562590052,1562641571,1,clear sky
75,1562625105962.00,d8e061cb-282b-43f2-854e-9ae3c927f220,Hacienda Heights,23.83,26.11,26.11,metric,50,1015,3.1,190,1,0,0,1562590052,1562641571,1,clear sky
76,1562626905956.00,d8e061cb-282b-43f2-854e-9ae3c927f220,Hacienda Heights,23.8,26.67,26.67,metric,53,1016,4.6,240,1,0,0,1562590052,1562641571,1,clear sky
77,1562628705888.00,d8e061cb-282b-43f2-854e-9ae3c927f220,Hacienda Heights,23.68,26.67,26.67,metric,50,1015,3.1,0,1,0,0,1562590052,1562641571,1,clear sky
78,1562630505592.00,d8e061cb-282b-43f2-854e-9ae3c927f220,Hacienda Heights,23.61,26.67,26.67,metric,50,1015,4.1,270,1,0,0,1562590052,1562641571,1,clear sky
79,1562632305969.00,d8e061cb-282b-43f2-854e-9ae3c927f220,Hacienda Heights,23.3,25.56,25.56,metric,50,1015,2.6,0,1,0,0,1562590052,1562641571,1,clear sky
80,1562634105628.00,d8e061cb-282b-43f2-854e-9ae3c927f220,Hacienda Heights,22.99,26.11,26.11,metric,50,1015,5.7,240,1,0,0,1562590052,1562641571,1,clear sky
81,1562635905909.00,d8e061cb-282b-43f2-854e-9ae3c927f220,Hacienda Heights,22.3,25.56,25.56,metric,53,1015,3.1,0,1,0,0,1562590052,1562641571,1,clear sky
82,1562637705756.00,d8e061cb-282b-43f2-854e-9ae3c927f220,Hacienda Heights,21.53,24.44,24.44,metric,56,1015,5.1,240,1,0,0,1562590052,1562641571,1,clear sky
83,1562639505766.00,d8e061cb-282b-43f2-854e-9ae3c927f220,Hacienda Heights,20.88,23,23,metric,60,1015,3.6,200,1,0,0,1562590052,1562641571,1,clear sky
84,1562641305812.00,d8e061cb-282b-43f2-854e-9ae3c927f220,Hacienda Heights,20.02,23,23,metric,60,1015,7.2,240,1,0,0,1562590052,1562641571,1,clear sky
85,1562643105847.00,d8e061cb-282b-43f2-854e-9ae3c927f220,Hacienda Heights,19.37,21.67,21.67,metric,60,1015,3.6,190,1,0,0,1562590052,1562641571,1,clear sky
86,1562644905600.00,d8e061cb-282b-43f2-854e-9ae3c927f220,Hacienda Heights,18.93,21.11,21.11,metric,72,1016,3.6,260,1,0,0,1562590052,1562641571,1,clear sky
87,1562646705886.00,d8e061cb-282b-43f2-854e-9ae3c927f220,Hacienda Heights,18.48,20.56,20.56,metric,72,1016,2.6,230,75,0,0,1562590052,1562641571,4,broken clouds
88,1562648505647.00,d8e061cb-282b-43f2-854e-9ae3c927f220,Hacienda Heights,18.23,20,20,metric,77,1016,2.58,218.878,75,0,0,1562590052,1562641571,4,broken clouds
89,1562650305825.00,d8e061cb-282b-43f2-854e-9ae3c927f220,Hacienda Heights,18,20,20,metric,72,1016,2.1,310,40,0,0,1562590052,1562641571,3,scattered clouds
90,1562652105730.00,d8e061cb-282b-43f2-854e-9ae3c927f220,Hacienda Heights,17.89,20,20,metric,72,1016,3.1,320,75,0,0,1562590052,1562641571,4,broken clouds
91,1562653905681.00,d8e061cb-282b-43f2-854e-9ae3c927f220,Hacienda Heights,17.64,19.44,19.44,metric,77,1017,2.58,218.878,75,0,0,1562590052,1562641571,4,broken clouds
92,1562622228114.00,51397770-d216-4391-ab33-243fb24bb81e,Hacienda Heights,23.7,26.11,26.11,metric,50,1015,3.1,0,20,0,0,1562590052,1562641571,2,few clouds
93,1562624027760.00,51397770-d216-4391-ab33-243fb24bb81e,Hacienda Heights,23.83,26.11,26.11,metric,53,1016,4.6,260,1,0,0,1562590052,1562641571,1,clear sky
94,1562625827793.00,51397770-d216-4391-ab33-243fb24bb81e,Hacienda Heights,23.9,26.67,26.67,metric,50,1015,3.1,190,1,0,0,1562590052,1562641571,1,clear sky
95,1562627627788.00,51397770-d216-4391-ab33-243fb24bb81e,Hacienda Heights,23.79,26.67,26.67,metric,53,1016,4.6,240,1,0,0,1562590052,1562641571,1,clear sky
96,1562629427997.00,51397770-d216-4391-ab33-243fb24bb81e,Hacienda Heights,23.86,27,27,metric,50,1015,3.1,0,1,0,0,1562590052,1562641571,1,clear sky
97,1562631228194.00,51397770-d216-4391-ab33-243fb24bb81e,Hacienda Heights,23.51,26.11,26.11,metric,50,1015,4.1,270,1,0,0,1562590052,1562641571,1,clear sky
98,1562633028038.00,51397770-d216-4391-ab33-243fb24bb81e,Hacienda Heights,23.11,26.11,26.11,metric,50,1015,2.6,0,1,0,0,1562590052,1562641571,1,clear sky
99,1562634827775.00,51397770-d216-4391-ab33-243fb24bb81e,Hacienda Heights,22.73,26.11,26.11,metric,50,1015,5.7,240,1,0,0,1562590052,1562641571,1,clear sky
100,1562641000069.00,51397770-d216-4391-ab33-243fb24bb81e,Hacienda Heights,20.19,23,23,metric,60,1015,7.2,240,1,0,0,1562590052,1562641571,1,clear sky
101,1562642800096.00,51397770-d216-4391-ab33-243fb24bb81e,Hacienda Heights,19.46,21.67,21.67,metric,60,1015,3.6,190,1,0,0,1562590052,1562641571,1,clear sky
102,1562644600046.00,51397770-d216-4391-ab33-243fb24bb81e,Hacienda Heights,18.98,21.11,21.11,metric,72,1016,3.6,260,1,0,0,1562590052,1562641571,1,clear sky
103,1562646399745.00,51397770-d216-4391-ab33-243fb24bb81e,Hacienda Heights,18.58,20.56,20.56,metric,72,1016,2.6,230,75,0,0,1562590052,1562641571,4,broken clouds
104,1562648199612.00,51397770-d216-4391-ab33-243fb24bb81e,Hacienda Heights,18.24,20,20,metric,77,1016,2.58,218.878,75,0,0,1562590052,1562641571,4,broken clouds
105,1562649999485.00,51397770-d216-4391-ab33-243fb24bb81e,Hacienda Heights,18.1,20,20,metric,72,1016,2.1,310,40,0,0,1562590052,1562641571,3,scattered clouds
106,1562651799587.00,51397770-d216-4391-ab33-243fb24bb81e,Hacienda Heights,17.93,20,20,metric,72,1016,3.1,320,75,0,0,1562590052,1562641571,4,broken clouds
107,1562653599510.00,51397770-d216-4391-ab33-243fb24bb81e,Hacienda Heights,17.62,19.44,19.44,metric,77,1017,2.58,218.878,75,0,0,1562590052,1562641571,4,broken clouds
108,1562655705672.00,d8e061cb-282b-43f2-854e-9ae3c927f220,Hacienda Heights,17.7,19.44,19.44,metric,82,1017,3.1,260,20,0,0,1562676484,1562727956,2,few clouds
109,1562657505758.00,d8e061cb-282b-43f2-854e-9ae3c927f220,Hacienda Heights,17.69,19.44,19.44,metric,72,1016,1.5,280,90,0,0,1562676484,1562727956,4,overcast clouds
110,1562659305697.00,d8e061cb-282b-43f2-854e-9ae3c927f220,Hacienda Heights,17.79,19.44,19.44,metric,87,1017,3.6,260,86,0,0,1562676484,1562727956,4,overcast clouds
111,1562657199545.00,51397770-d216-4391-ab33-243fb24bb81e,Hacienda Heights,17.59,19.44,19.44,metric,72,1016,1.5,280,90,0,0,1562676484,1562727956,4,overcast clouds
112,1562658999582.00,51397770-d216-4391-ab33-243fb24bb81e,Hacienda Heights,17.78,19.44,19.44,metric,87,1017,3.6,260,86,0,0,1562676484,1562727956,4,overcast clouds
113,1562661105754.00,d8e061cb-282b-43f2-854e-9ae3c927f220,Hacienda Heights,17.84,20,20,metric,72,1016,1.5,300,90,0,0,1562676484,1562727956,50,haze
114,1562660800365.00,51397770-d216-4391-ab33-243fb24bb81e,Hacienda Heights,17.81,20,20,metric,72,1016,1.5,300,90,0,0,1562676484,1562727956,50,haze
115,1562662599520.00,51397770-d216-4391-ab33-243fb24bb81e,Hacienda Heights,17.86,20,20,metric,87,1016,3.1,270,86,0,0,1562676484,1562727956,50,haze
116,1562662905676.00,d8e061cb-282b-43f2-854e-9ae3c927f220,Hacienda Heights,17.88,20,20,metric,87,1016,3.1,270,86,0,0,1562676484,1562727956,50,haze
117,1562664705724.00,d8e061cb-282b-43f2-854e-9ae3c927f220,Hacienda Heights,17.71,20,20,metric,72,1016,1.5,310,90,0,0,1562676484,1562727956,50,haze
118,1562664399608.00,51397770-d216-4391-ab33-243fb24bb81e,Hacienda Heights,17.73,20,20,metric,72,1016,1.5,310,90,0,0,1562676484,1562727956,50,haze
119,1562666199545.00,51397770-d216-4391-ab33-243fb24bb81e,Hacienda Heights,17.68,20,20,metric,82,1016,2.6,280,1,0,0,1562676484,1562727956,50,mist
120,1562666505633.00,d8e061cb-282b-43f2-854e-9ae3c927f220,Hacienda Heights,17.69,20,20,metric,82,1016,2.6,280,1,0,0,1562676484,1562727956,50,mist
121,1562668305706.00,d8e061cb-282b-43f2-854e-9ae3c927f220,Hacienda Heights,17.84,20,20,metric,72,1016,1.18,190.959,90,0,0,1562676484,1562727956,50,mist
122,1562667999519.00,51397770-d216-4391-ab33-243fb24bb81e,Hacienda Heights,17.76,20,20,metric,72,1016,1.28,226.266,90,0,0,1562676484,1562727956,50,mist
123,1562669799479.00,51397770-d216-4391-ab33-243fb24bb81e,Hacienda Heights,17.86,20,20,metric,82,1016,2.1,310,75,0,0,1562676484,1562727956,50,haze
124,1562670105696.00,d8e061cb-282b-43f2-854e-9ae3c927f220,Hacienda Heights,17.86,20,20,metric,82,1016,2.1,310,75,0,0,1562676484,1562727956,50,haze
125,1562671905784.00,d8e061cb-282b-43f2-854e-9ae3c927f220,Hacienda Heights,17.89,20,20,metric,72,1015,1.18,190.959,90,0,0,1562676484,1562727956,50,mist
126,1562671599668.00,51397770-d216-4391-ab33-243fb24bb81e,Hacienda Heights,17.89,20,20,metric,72,1015,1.18,190.959,90,0,0,1562676484,1562727956,50,mist
127,1562673399625.00,51397770-d216-4391-ab33-243fb24bb81e,Hacienda Heights,17.94,20,20,metric,87,1017,1.63,207.227,90,0,0,1562676484,1562727956,50,mist
128,1562673705720.00,d8e061cb-282b-43f2-854e-9ae3c927f220,Hacienda Heights,17.94,20,20,metric,87,1017,1.63,207.227,90,0,0,1562676484,1562727956,50,mist
129,1562675505717.00,d8e061cb-282b-43f2-854e-9ae3c927f220,Hacienda Heights,17.92,20,20,metric,68,1016,1.5,360,90,0,0,1562676484,1562727956,50,haze
130,1562675199416.00,51397770-d216-4391-ab33-243fb24bb81e,Hacienda Heights,17.88,20,20,metric,68,1016,1.5,360,90,0,0,1562676484,1562727956,50,haze
131,1562676999646.00,51397770-d216-4391-ab33-243fb24bb81e,Hacienda Heights,17.91,20,20,metric,87,1017,2.1,60,69,0,0,1562676484,1562727956,50,haze
132,1562677305758.00,d8e061cb-282b-43f2-854e-9ae3c927f220,Hacienda Heights,17.91,20,20,metric,87,1017,2.1,60,69,0,0,1562676484,1562727956,50,haze
133,1562679105813.00,d8e061cb-282b-43f2-854e-9ae3c927f220,Hacienda Heights,18.15,20,20,metric,82,1016,2.6,170,90,0,0,1562676484,1562727956,50,haze
134,1562678799381.00,51397770-d216-4391-ab33-243fb24bb81e,Hacienda Heights,18.04,20,20,metric,82,1016,2.6,170,90,0,0,1562676484,1562727956,50,haze
135,1562680599527.00,51397770-d216-4391-ab33-243fb24bb81e,Hacienda Heights,18.25,20,20,metric,82,1016,2.6,170,90,0,0,1562676484,1562727956,50,mist
136,1562682399379.00,51397770-d216-4391-ab33-243fb24bb81e,Hacienda Heights,18.33,20,20,metric,68,1016,2.1,0,90,0,0,1562676484,1562727956,50,mist
137,1562684199600.00,51397770-d216-4391-ab33-243fb24bb81e,Hacienda Heights,18.35,20,20,metric,77,1018,2.6,0,90,0,0,1562676484,1562727956,50,haze
138,1562627038892.00,99a86843-82f2-43af-844a-978669900d19,Hacienda Heights,23.8,26.67,26.67,metric,53,1016,4.6,240,1,0,0,1562590052,1562641571,1,clear sky
139,1562628839503.00,99a86843-82f2-43af-844a-978669900d19,Hacienda Heights,23.68,26.67,26.67,metric,50,1015,3.1,0,1,0,0,1562590052,1562641571,1,clear sky
140,1562687017377.00,99a86843-82f2-43af-844a-978669900d19,Hacienda Heights,19.34,21.67,21.67,metric,64,1017,0.79,250.327,90,0,0,1562676484,1562727956,50,haze
141,1562690626781.00,99a86843-82f2-43af-844a-978669900d19,Hacienda Heights,21.23,23.33,23.33,metric,60,1017,2.92,216.756,75,0,0,1562676484,1562727956,50,haze
142,1562692426611.00,99a86843-82f2-43af-844a-978669900d19,Hacienda Heights,21.69,23.89,23.89,metric,64,1018,2.1,0,1,0,0,1562676484,1562727956,50,haze
143,1562694226709.00,99a86843-82f2-43af-844a-978669900d19,Hacienda Heights,22.72,25,25,metric,56,1017,2.92,216.756,40,0,0,1562676484,1562727956,50,haze
144,1562696026704.00,99a86843-82f2-43af-844a-978669900d19,Hacienda Heights,23.16,25.56,25.56,metric,64,1018,2.1,220,1,0,0,1562676484,1562727956,50,haze
145,1562699430550.00,99a86843-82f2-43af-844a-978669900d19,Hacienda Heights,24.38,27.22,27.22,metric,53,1018,2.6,230,1,0,0,1562676484,1562727956,50,haze
146,1562701230743.00,99a86843-82f2-43af-844a-978669900d19,Hacienda Heights,25.4,28.89,28.89,metric,44,1017,1.5,0,40,0,0,1562676484,1562727956,50,haze
147,1562703030406.00,99a86843-82f2-43af-844a-978669900d19,Hacienda Heights,26.12,30,30,metric,47,1017,3.6,240,1,0,0,1562676484,1562727956,50,haze
148,1562687799457.00,51397770-d216-4391-ab33-243fb24bb81e,Hacienda Heights,19.57,21.67,21.67,metric,77,1018,0.79,250.327,90,0,0,1562676484,1562727956,50,haze
149,1562689599370.00,51397770-d216-4391-ab33-243fb24bb81e,Hacienda Heights,20.38,22.22,22.22,metric,60,1017,0.79,250.327,75,0,0,1562676484,1562727956,50,haze
150,1562691399591.00,51397770-d216-4391-ab33-243fb24bb81e,Hacienda Heights,21.41,23.33,23.33,metric,64,1018,2.1,0,1,0,0,1562676484,1562727956,50,haze
151,1562698326486.00,51397770-d216-4391-ab33-243fb24bb81e,Hacienda Heights,24.07,26.67,26.67,metric,53,1018,2.6,230,1,0,0,1562676484,1562727956,50,haze
152,1562700126953.00,51397770-d216-4391-ab33-243fb24bb81e,Hacienda Heights,24.84,27.22,27.22,metric,44,1017,1.5,0,40,0,0,1562676484,1562727956,50,haze
153,1562706080485.00,51397770-d216-4391-ab33-243fb24bb81e,Hacienda Heights,26.91,31.11,31.11,metric,42,1017,3.1,250,1,0,0,1562676484,1562727956,1,clear sky
154,1562639622289.00,acc0b042-1b33-4857-bceb-7ddbdc9394ce,Hacienda Heights,20.88,23,23,metric,60,1015,3.6,200,1,0,0,1562590052,1562641571,1,clear sky
155,1562639623810.00,acc0b042-1b33-4857-bceb-7ddbdc9394ce,Hacienda Heights,20.73,23,23,metric,60,1015,3.6,200,1,0,0,1562590052,1562641571,1,clear sky
156,1562639627685.00,acc0b042-1b33-4857-bceb-7ddbdc9394ce,Hacienda Heights,20.73,23,23,metric,60,1015,3.6,200,1,0,0,1562590052,1562641571,1,clear sky
157,1562639628622.00,acc0b042-1b33-4857-bceb-7ddbdc9394ce,Hacienda Heights,20.91,23,23,metric,60,1015,3.6,200,1,0,0,1562590052,1562641571,1,clear sky
158,1562684307961.00,acc0b042-1b33-4857-bceb-7ddbdc9394ce,Hacienda Heights,18.46,20,20,metric,77,1018,2.6,0,90,0,0,1562676484,1562727956,50,haze
159,1562684320553.00,acc0b042-1b33-4857-bceb-7ddbdc9394ce,Hacienda Heights,18.46,20,20,metric,77,1018,2.6,0,90,0,0,1562676484,1562727956,50,haze
160,1562685708267.00,acc0b042-1b33-4857-bceb-7ddbdc9394ce,Hacienda Heights,18.94,21.11,21.11,metric,64,1017,0.79,250.327,90,0,0,1562676484,1562727956,50,haze
161,1562702254253.00,acc0b042-1b33-4857-bceb-7ddbdc9394ce,Hacienda Heights,25.75,29.44,29.44,metric,47,1017,3.6,240,1,0,0,1562676484,1562727956,50,haze
162,1562702269516.00,acc0b042-1b33-4857-bceb-7ddbdc9394ce,Hacienda Heights,25.75,29.44,29.44,metric,47,1017,3.6,240,1,0,0,1562676484,1562727956,50,haze
163,1562706101111.00,acc0b042-1b33-4857-bceb-7ddbdc9394ce,Hacienda Heights,26.87,31.11,31.11,metric,42,1017,3.1,250,1,0,0,1562676484,1562727956,1,clear sky
164,1562704830414.00,99a86843-82f2-43af-844a-978669900d19,Hacienda Heights,26.76,30.56,30.56,metric,42,1016,3.6,260,40,0,0,1562676484,1562727956,3,scattered clouds
165,1562706236589.00,51397770-d216-4391-ab33-243fb24bb81e,Hacienda Heights,26.91,31.11,31.11,metric,42,1017,3.1,250,1,0,0,1562676484,1562727956,1,clear sky
166,1562593816465.00,baf0ca22-ca12-4ebd-8378-20189109324f,Hacienda Heights,17.34,19,19,metric,82,1016,1.5,200,90,0,0,1562590052,1562641571,50,mist
167,1562598353521.00,baf0ca22-ca12-4ebd-8378-20189109324f,Hacienda Heights,17.42,19.44,19.44,metric,82,1017,2.1,270,90,0,0,1562590052,1562641571,50,haze
168,1562599728511.00,baf0ca22-ca12-4ebd-8378-20189109324f,Hacienda Heights,17.51,19.44,19.44,metric,72,1016,2.1,127.889,90,0,0,1562590052,1562641571,50,haze
169,1562601499672.00,baf0ca22-ca12-4ebd-8378-20189109324f,Hacienda Heights,17.67,19.44,19.44,metric,82,1017,2.6,300,90,0,0,1562590052,1562641571,50,haze
170,1562603299316.00,baf0ca22-ca12-4ebd-8378-20189109324f,Hacienda Heights,18.07,20,20,metric,68,1016,1.5,160,90,0,0,1562590052,1562641571,50,haze
171,1562605099410.00,baf0ca22-ca12-4ebd-8378-20189109324f,Hacienda Heights,18.76,20,20,metric,63,1016,2.6,180,90,0,0,1562590052,1562641571,50,haze
172,1562621242308.00,baf0ca22-ca12-4ebd-8378-20189109324f,Hacienda Heights,23.61,26.11,26.11,metric,50,1015,3.1,0,20,0,0,1562590052,1562641571,2,few clouds
173,1562623042162.00,baf0ca22-ca12-4ebd-8378-20189109324f,Hacienda Heights,23.81,26.11,26.11,metric,53,1016,4.6,260,1,0,0,1562590052,1562641571,1,clear sky
174,1562624842081.00,baf0ca22-ca12-4ebd-8378-20189109324f,Hacienda Heights,23.82,26.11,26.11,metric,50,1015,3.1,190,1,0,0,1562590052,1562641571,1,clear sky
175,1562647590095.00,baf0ca22-ca12-4ebd-8378-20189109324f,Hacienda Heights,18.3,20,20,metric,77,1016,2.58,218.878,75,0,0,1562590052,1562641571,4,broken clouds
176,1562649390159.00,baf0ca22-ca12-4ebd-8378-20189109324f,Hacienda Heights,18.16,20,20,metric,68,1016,2.58,218.878,90,0,0,1562590052,1562641571,4,overcast clouds
177,1562652989996.00,baf0ca22-ca12-4ebd-8378-20189109324f,Hacienda Heights,17.68,20,20,metric,72,1016,3.1,320,75,0,0,1562590052,1562641571,4,broken clouds
178,1562707049723.00,baf0ca22-ca12-4ebd-8378-20189109324f,Hacienda Heights,26.64,31,31,metric,37,1016,4.37,228.934,1,0,0,1562676484,1562727956,1,clear sky
179,1562604636971.00,e4b4a4bf-3ca0-49df-8c29-1c655ba1d0fb,Hacienda Heights,18.7,20,20,metric,68,1016,1.5,160,90,0,0,1562590052,1562641571,50,haze
180,1562604648587.00,e4b4a4bf-3ca0-49df-8c29-1c655ba1d0fb,Hacienda Heights,18.7,20,20,metric,68,1016,1.5,160,90,0,0,1562590052,1562641571,50,haze
181,1562604649182.00,e4b4a4bf-3ca0-49df-8c29-1c655ba1d0fb,Hacienda Heights,18.7,20,20,metric,68,1016,1.5,160,90,0,0,1562590052,1562641571,50,haze
182,1562606512595.00,e4b4a4bf-3ca0-49df-8c29-1c655ba1d0fb,Hacienda Heights,19.06,20.56,20.56,metric,68,1016,1.5,170,90,0,0,1562590052,1562641571,50,haze
183,1562707638294.00,e4b4a4bf-3ca0-49df-8c29-1c655ba1d0fb,Hacienda Heights,26.75,32,32,metric,37,1016,4.37,228.934,1,0,0,1562676484,1562727956,1,clear sky
184,1562647275788.00,903be8ed-91d3-455a-a64b-1964e2d66e1b,Hacienda Heights,18.33,20,20,metric,72,1016,2.6,230,75,0,0,1562590052,1562641571,4,broken clouds
185,1562648916749.00,903be8ed-91d3-455a-a64b-1964e2d66e1b,Hacienda Heights,18.24,20.56,20.56,metric,77,1016,2.58,218.878,75,0,0,1562590052,1562641571,4,broken clouds
186,1562649075620.00,903be8ed-91d3-455a-a64b-1964e2d66e1b,Hacienda Heights,18.2,20,20,metric,77,1016,2.58,218.878,75,0,0,1562590052,1562641571,4,broken clouds
187,1562650314436.00,903be8ed-91d3-455a-a64b-1964e2d66e1b,Hacienda Heights,17.98,20,20,metric,72,1016,2.1,310,40,0,0,1562590052,1562641571,3,scattered clouds
188,1562667828434.00,903be8ed-91d3-455a-a64b-1964e2d66e1b,Hacienda Heights,17.76,20,20,metric,72,1016,1.28,226.266,90,0,0,1562676484,1562727956,50,mist
189,1562692493414.00,903be8ed-91d3-455a-a64b-1964e2d66e1b,Hacienda Heights,21.74,24,24,metric,68,1018,2.92,216.756,1,0,0,1562676484,1562727956,50,haze
190,1562694293590.00,903be8ed-91d3-455a-a64b-1964e2d66e1b,Hacienda Heights,22.74,25,25,metric,64,1018,2.1,220,1,0,0,1562676484,1562727956,50,haze
191,1562695483943.00,903be8ed-91d3-455a-a64b-1964e2d66e1b,Hacienda Heights,23.1,25.56,25.56,metric,64,1018,2.1,220,1,0,0,1562676484,1562727956,50,haze
192,1562697293505.00,903be8ed-91d3-455a-a64b-1964e2d66e1b,Hacienda Heights,23.78,26.11,26.11,metric,53,1017,2.92,216.756,40,0,0,1562676484,1562727956,50,haze
193,1562699084074.00,903be8ed-91d3-455a-a64b-1964e2d66e1b,Hacienda Heights,24.27,26.67,26.67,metric,53,1018,2.6,230,1,0,0,1562676484,1562727956,50,haze
194,1562700884088.00,903be8ed-91d3-455a-a64b-1964e2d66e1b,Hacienda Heights,25.39,28.33,28.33,metric,44,1017,1.5,0,40,0,0,1562676484,1562727956,50,haze
195,1562704484125.00,903be8ed-91d3-455a-a64b-1964e2d66e1b,Hacienda Heights,26.66,30.56,30.56,metric,42,1016,3.6,260,40,0,0,1562676484,1562727956,3,scattered clouds
196,1562706284095.00,903be8ed-91d3-455a-a64b-1964e2d66e1b,Hacienda Heights,26.87,31.11,31.11,metric,42,1017,3.1,250,1,0,0,1562676484,1562727956,1,clear sky
197,1562632407707.00,6489598a-b088-46f7-ae6e-d2dfb0c67ea5,Hacienda Heights,23.27,25.56,25.56,metric,50,1015,2.6,0,1,0,0,1562590052,1562641571,1,clear sky
198,1562632408388.00,6489598a-b088-46f7-ae6e-d2dfb0c67ea5,Hacienda Heights,23.29,25.56,25.56,metric,50,1015,2.6,0,1,0,0,1562590052,1562641571,1,clear sky
199,1562632429721.00,6489598a-b088-46f7-ae6e-d2dfb0c67ea5,Hacienda Heights,23.24,25.56,25.56,metric,50,1015,2.6,0,1,0,0,1562590052,1562641571,1,clear sky
200,1562632456444.00,6489598a-b088-46f7-ae6e-d2dfb0c67ea5,Hacienda Heights,23.24,25.56,25.56,metric,50,1015,2.6,0,1,0,0,1562590052,1562641571,1,clear sky
201,1562632464767.00,6489598a-b088-46f7-ae6e-d2dfb0c67ea5,Hacienda Heights,23.24,25.56,25.56,metric,50,1015,2.6,0,1,0,0,1562590052,1562641571,1,clear sky
202,1562632465748.00,6489598a-b088-46f7-ae6e-d2dfb0c67ea5,Hacienda Heights,23.24,25.56,25.56,metric,50,1015,2.6,0,1,0,0,1562590052,1562641571,1,clear sky
203,1562632480636.00,6489598a-b088-46f7-ae6e-d2dfb0c67ea5,Hacienda Heights,23.3,25.56,25.56,metric,50,1015,2.6,0,1,0,0,1562590052,1562641571,1,clear sky
204,1562632480872.00,6489598a-b088-46f7-ae6e-d2dfb0c67ea5,Hacienda Heights,23.3,25.56,25.56,metric,50,1015,2.6,0,1,0,0,1562590052,1562641571,1,clear sky
205,1562632511214.00,6489598a-b088-46f7-ae6e-d2dfb0c67ea5,Hacienda Heights,23.24,25.56,25.56,metric,50,1015,2.6,0,1,0,0,1562590052,1562641571,1,clear sky
206,1562712918703.00,6489598a-b088-46f7-ae6e-d2dfb0c67ea5,Hacienda Heights,26.44,32,32,metric,37,1016,4.6,220,1,0,0,1562676484,1562727956,1,clear sky
207,1562621870319.00,5b2c4ac8-eea6-4f17-850f-0a7f10acee2f,Hacienda Heights,23.74,26.11,26.11,metric,50,1015,3.1,0,20,0,0,1562590052,1562641571,2,few clouds
208,1562638261499.00,5b2c4ac8-eea6-4f17-850f-0a7f10acee2f,Hacienda Heights,21.43,24.44,24.44,metric,56,1015,5.1,240,1,0,0,1562590052,1562641571,1,clear sky
209,1562708157213.00,5b2c4ac8-eea6-4f17-850f-0a7f10acee2f,Hacienda Heights,26.74,32,32,metric,37,1016,4.37,228.934,1,0,0,1562676484,1562727956,1,clear sky
210,1562708877158.00,5b2c4ac8-eea6-4f17-850f-0a7f10acee2f,Hacienda Heights,26.77,32,32,metric,37,1015,2.1,220,1,0,0,1562676484,1562727956,1,clear sky
211,1562711406655.00,5b2c4ac8-eea6-4f17-850f-0a7f10acee2f,Hacienda Heights,26.74,33,33,metric,42,1015,2.6,220,1,0,0,1562676484,1562727956,1,clear sky
212,1562712049920.00,91b15bd0-965d-44f7-aa2a-169214e1b28c,Marina del Rey,24.93,30.56,20.56,metric,64,1016,7.2,270,40,0,0,1562680000,1562730000,802,Clouds: scattered clouds
213,1562712049926.00,91b15bd0-965d-44f7-aa2a-169214e1b28c,Marina del Rey,24.93,30.56,20.56,metric,64,1016,7.2,270,40,0,0,1562680000,1562730000,802,Clouds: scattered clouds
214,1562724019728.00,2d6133af-c77d-42e2-bacd-3d15e0f3a222,Hacienda Heights,23.44,28,28,metric,53,1016,5.1,260,1,0,0,1562676484,1562727956,1,clear sky
215,1562724860427.00,2d6133af-c77d-42e2-bacd-3d15e0f3a222,Hacienda Heights,23.15,27,27,metric,53,1016,5.1,260,1,0,0,1562676484,1562727956,1,clear sky
216,1562724864544.00,2d6133af-c77d-42e2-bacd-3d15e0f3a222,Hacienda Heights,23.15,27,27,metric,53,1016,5.1,260,1,0,0,1562676484,1562727956,1,clear sky
217,1562726208107.00,2d6133af-c77d-42e2-bacd-3d15e0f3a222,Hacienda Heights,22.2,26,26,metric,50,1015,1.5,0,1,0,0,1562676484,1562727956,1,clear sky
218,1562731502025.00,fbd51491-a197-47c6-9c11-a3bf84705ff5,Avalon,18.87,20,20,metric,82,1016,1.5,250,75,0,0,1562676636,1562727805,50,haze
219,1562731587645.00,a8c008a0-0617-456a-b29e-a091555a889a,Afton,13.85,16,16,metric,48,1025,4.1,110,1,0,0,1562673207,1562727873,1,clear sky
220,1562731594684.00,a8c008a0-0617-456a-b29e-a091555a889a,Afton,13.85,16,16,metric,48,1025,4.1,110,1,0,0,1562673207,1562727873,1,clear sky
221,1562731643584.00,fbd51491-a197-47c6-9c11-a3bf84705ff5,Avalon,18.85,20,20,metric,82,1016,1.5,250,75,0,0,1562676636,1562727805,50,haze
222,1562731644417.00,fbd51491-a197-47c6-9c11-a3bf84705ff5,Avalon,18.85,20,20,metric,82,1016,1.5,250,75,0,0,1562676636,1562727805,50,haze
223,1562731832034.00,fbd51491-a197-47c6-9c11-a3bf84705ff5,Avalon,18.87,20,20,metric,82,1016,1.5,250,75,0,0,1562676636,1562727805,50,haze
224,1562731833194.00,fbd51491-a197-47c6-9c11-a3bf84705ff5,Avalon,18.87,20,20,metric,82,1016,1.5,250,75,0,0,1562676636,1562727805,50,haze
225,1562629816345.00,4d6a0382-238d-4bd4-84ee-d88cc35a5f3d,Hacienda Heights,23.62,26.11,26.11,metric,50,1015,4.1,270,1,0,0,1562590052,1562641571,1,clear sky
226,1562629909133.00,4d6a0382-238d-4bd4-84ee-d88cc35a5f3d,Hacienda Heights,23.62,26.11,26.11,metric,50,1015,4.1,270,1,0,0,1562590052,1562641571,1,clear sky
227,1562629927354.00,4d6a0382-238d-4bd4-84ee-d88cc35a5f3d,Hacienda Heights,23.61,26.11,26.11,metric,50,1015,4.1,270,1,0,0,1562590052,1562641571,1,clear sky
228,1562639022711.00,4d6a0382-238d-4bd4-84ee-d88cc35a5f3d,Hacienda Heights,21.09,24,24,metric,60,1015,3.6,200,1,0,0,1562590052,1562641571,1,clear sky
229,1562640822768.00,4d6a0382-238d-4bd4-84ee-d88cc35a5f3d,Hacienda Heights,20.21,23,23,metric,60,1015,7.2,240,1,0,0,1562590052,1562641571,1,clear sky
230,1562642622911.00,4d6a0382-238d-4bd4-84ee-d88cc35a5f3d,Hacienda Heights,19.5,22,22,metric,60,1015,3.6,190,1,0,0,1562590052,1562641571,1,clear sky
231,1562644422836.00,4d6a0382-238d-4bd4-84ee-d88cc35a5f3d,Hacienda Heights,19.05,21.11,21.11,metric,64,1016,4.1,250,3,0,0,1562590052,1562641571,1,clear sky
232,1562646222739.00,4d6a0382-238d-4bd4-84ee-d88cc35a5f3d,Hacienda Heights,18.54,20,20,metric,72,1016,2.6,230,75,0,0,1562590052,1562641571,4,broken clouds
233,1562648022713.00,4d6a0382-238d-4bd4-84ee-d88cc35a5f3d,Hacienda Heights,18.25,20,20,metric,77,1016,2.58,218.878,75,0,0,1562590052,1562641571,4,broken clouds
234,1562649823039.00,4d6a0382-238d-4bd4-84ee-d88cc35a5f3d,Hacienda Heights,18.15,20,20,metric,72,1016,2.1,310,40,0,0,1562590052,1562641571,3,scattered clouds
235,1562651622865.00,4d6a0382-238d-4bd4-84ee-d88cc35a5f3d,Hacienda Heights,17.93,20,20,metric,72,1016,3.1,320,75,0,0,1562590052,1562641571,4,broken clouds
236,1562653428196.00,4d6a0382-238d-4bd4-84ee-d88cc35a5f3d,Hacienda Heights,17.62,19.44,19.44,metric,77,1017,2.58,218.878,75,0,0,1562590052,1562641571,4,broken clouds
237,1562696408939.00,4d6a0382-238d-4bd4-84ee-d88cc35a5f3d,Hacienda Heights,23.33,26,26,metric,53,1017,2.92,216.756,40,0,0,1562676484,1562727956,50,haze
238,1562700009340.00,4d6a0382-238d-4bd4-84ee-d88cc35a5f3d,Hacienda Heights,24.83,27.22,27.22,metric,44,1017,1.5,0,40,0,0,1562676484,1562727956,50,haze
239,1562701809358.00,4d6a0382-238d-4bd4-84ee-d88cc35a5f3d,Hacienda Heights,25.76,29.44,29.44,metric,44,1017,2.6,250,1,0,0,1562676484,1562727956,50,haze
240,1562703608865.00,4d6a0382-238d-4bd4-84ee-d88cc35a5f3d,Hacienda Heights,26.22,29.44,29.44,metric,42,1016,3.6,260,40,0,0,1562676484,1562727956,3,scattered clouds
241,1562705409168.00,4d6a0382-238d-4bd4-84ee-d88cc35a5f3d,Hacienda Heights,26.77,30.56,30.56,metric,36,1017,2.1,300,1,0,0,1562676484,1562727956,1,clear sky
242,1562707209249.00,4d6a0382-238d-4bd4-84ee-d88cc35a5f3d,Hacienda Heights,26.51,31,31,metric,37,1016,4.37,228.934,1,0,0,1562676484,1562727956,1,clear sky
243,1562709008914.00,4d6a0382-238d-4bd4-84ee-d88cc35a5f3d,Hacienda Heights,26.73,32,32,metric,37,1015,2.1,220,1,0,0,1562676484,1562727956,1,clear sky
244,1562710808961.00,4d6a0382-238d-4bd4-84ee-d88cc35a5f3d,Hacienda Heights,26.89,32,32,metric,42,1015,2.6,220,1,0,0,1562676484,1562727956,1,clear sky
245,1562712610018.00,4d6a0382-238d-4bd4-84ee-d88cc35a5f3d,Hacienda Heights,26.33,32.22,32.22,metric,28,1016,2.6,250,1,0,0,1562676484,1562727956,1,clear sky
246,1562723698812.00,4d6a0382-238d-4bd4-84ee-d88cc35a5f3d,Hacienda Heights,23.55,28,28,metric,53,1016,5.1,260,1,0,0,1562676484,1562727956,1,clear sky
247,1562725500760.00,4d6a0382-238d-4bd4-84ee-d88cc35a5f3d,Hacienda Heights,22.96,26.11,26.11,metric,50,1015,1.5,0,1,0,0,1562676484,1562727956,1,clear sky
248,1562727298299.00,4d6a0382-238d-4bd4-84ee-d88cc35a5f3d,Hacienda Heights,21.8,25.56,25.56,metric,60,1016,4.1,260,1,0,0,1562676484,1562727956,1,clear sky
249,1562729098221.00,4d6a0382-238d-4bd4-84ee-d88cc35a5f3d,Hacienda Heights,20.94,23.89,23.89,metric,56,1015,2.1,0,1,0,0,1562676484,1562727956,1,clear sky
250,1562789191345.00,4d6a0382-238d-4bd4-84ee-d88cc35a5f3d,Hacienda Heights,26.55,32.78,32.78,metric,42,1018,3.1,260,1,0,0,1562762917,1562814340,50,haze
251,1562789214267.00,4d6a0382-238d-4bd4-84ee-d88cc35a5f3d,Hacienda Heights,26.55,32.78,32.78,metric,42,1018,3.1,260,1,0,0,1562762917,1562814340,50,haze
