_id,timestamp,device_id,datatype,double_energy,inference,blob_feature,double_convo_start,double_convo_end
1,1562712077549.00,91b15bd0-965d-44f7-aa2a-169214e1b28c,0,42,1,,0,0
2,1562712078450.00,91b15bd0-965d-44f7-aa2a-169214e1b28c,0,43,1,,0,0
3,1562712079473.00,91b15bd0-965d-44f7-aa2a-169214e1b28c,0,53,1,,0,0
4,1562712080371.00,91b15bd0-965d-44f7-aa2a-169214e1b28c,0,43,1,,0,0
5,1562712081392.00,91b15bd0-965d-44f7-aa2a-169214e1b28c,0,49,1,,0,0
6,1562712082293.00,91b15bd0-965d-44f7-aa2a-169214e1b28c,0,47,1,,0,0
7,1562712083312.00,91b15bd0-965d-44f7-aa2a-169214e1b28c,0,47,1,,0,0
8,1562712084213.00,91b15bd0-965d-44f7-aa2a-169214e1b28c,0,41,1,,0,0
9,1562712085232.00,91b15bd0-965d-44f7-aa2a-169214e1b28c,0,41,1,,0,0
10,1562712086134.00,91b15bd0-965d-44f7-aa2a-169214e1b28c,0,43,1,,0,0
11,1562712087151.00,91b15bd0-965d-44f7-aa2a-169214e1b28c,0,48,1,,0,0
12,1562712088055.00,91b15bd0-965d-44f7-aa2a-169214e1b28c,0,57,1,,0,0
13,1562712089075.00,91b15bd0-965d-44f7-aa2a-169214e1b28c,0,50,1,,0,0
14,1562712089971.00,91b15bd0-965d-44f7-aa2a-169214e1b28c,0,61,1,,0,0
15,1562712090990.00,91b15bd0-965d-44f7-aa2a-169214e1b28c,0,53,1,,0,0
16,1562712091891.00,91b15bd0-965d-44f7-aa2a-169214e1b28c,0,41,1,,0,0
17,1562712092915.00,91b15bd0-965d-44f7-aa2a-169214e1b28c,0,44,1,,0,0
18,1562712093814.00,91b15bd0-965d-44f7-aa2a-169214e1b28c,0,51,1,,0,0
19,1562712094832.00,91b15bd0-965d-44f7-aa2a-169214e1b28c,0,44,1,,0,0
20,1562712095731.00,91b15bd0-965d-44f7-aa2a-169214e1b28c,0,125,1,,0,0
21,1562712096751.00,91b15bd0-965d-44f7-aa2a-169214e1b28c,0,71,1,,0,0
22,1562712097652.00,91b15bd0-965d-44f7-aa2a-169214e1b28c,0,213,1,,0,0
23,1562712098670.00,91b15bd0-965d-44f7-aa2a-169214e1b28c,0,41,1,,0,0
24,1562712099573.00,91b15bd0-965d-44f7-aa2a-169214e1b28c,0,78,1,,0,0
25,1562712100592.00,91b15bd0-965d-44f7-aa2a-169214e1b28c,0,87,1,,0,0
26,1562712101490.00,91b15bd0-965d-44f7-aa2a-169214e1b28c,0,42,1,,0,0
27,1562712102514.00,91b15bd0-965d-44f7-aa2a-169214e1b28c,0,215,1,,0,0
28,1562712103413.00,91b15bd0-965d-44f7-aa2a-169214e1b28c,0,48,1,,0,0
29,1562712104432.00,91b15bd0-965d-44f7-aa2a-169214e1b28c,0,126,1,,0,0
30,1562712105330.00,91b15bd0-965d-44f7-aa2a-169214e1b28c,0,58,1,,0,0
31,1562712106350.00,91b15bd0-965d-44f7-aa2a-169214e1b28c,0,44,1,,0,0
32,1562712107250.00,91b15bd0-965d-44f7-aa2a-169214e1b28c,0,39,1,,0,0
33,1562712108270.00,91b15bd0-965d-44f7-aa2a-169214e1b28c,0,43,1,,0,0
34,1562712109170.00,91b15bd0-965d-44f7-aa2a-169214e1b28c,0,45,1,,0,0
35,1562712110190.00,91b15bd0-965d-44f7-aa2a-169214e1b28c,0,41,1,,0,0
36,1562712111090.00,91b15bd0-965d-44f7-aa2a-169214e1b28c,0,40,1,,0,0
37,1562712112110.00,91b15bd0-965d-44f7-aa2a-169214e1b28c,0,39,1,,0,0
38,1562712113010.00,91b15bd0-965d-44f7-aa2a-169214e1b28c,0,38,1,,0,0
39,1562712114030.00,91b15bd0-965d-44f7-aa2a-169214e1b28c,0,41,1,,0,0
40,1562712114930.00,91b15bd0-965d-44f7-aa2a-169214e1b28c,0,51,1,,0,0
41,1562712115951.00,91b15bd0-965d-44f7-aa2a-169214e1b28c,0,37,1,,0,0
42,1562712116850.00,91b15bd0-965d-44f7-aa2a-169214e1b28c,0,34,1,,0,0
43,1562712117870.00,91b15bd0-965d-44f7-aa2a-169214e1b28c,0,36,1,,0,0
44,1562712118770.00,91b15bd0-965d-44f7-aa2a-169214e1b28c,0,56,1,,0,0
45,1562712119790.00,91b15bd0-965d-44f7-aa2a-169214e1b28c,0,41,1,,0,0
46,1562712120690.00,91b15bd0-965d-44f7-aa2a-169214e1b28c,0,40,1,,0,0
47,1562712121710.00,91b15bd0-965d-44f7-aa2a-169214e1b28c,0,42,1,,0,0
48,1562712122610.00,91b15bd0-965d-44f7-aa2a-169214e1b28c,0,52,1,,0,0
49,1562712123631.00,91b15bd0-965d-44f7-aa2a-169214e1b28c,0,39,1,,0,0
50,1562712124530.00,91b15bd0-965d-44f7-aa2a-169214e1b28c,0,40,1,,0,0
51,1562712125550.00,91b15bd0-965d-44f7-aa2a-169214e1b28c,0,47,1,,0,0
52,1562712126451.00,91b15bd0-965d-44f7-aa2a-169214e1b28c,0,49,1,,0,0
53,1562712127471.00,91b15bd0-965d-44f7-aa2a-169214e1b28c,0,45,1,,0,0
54,1562712128370.00,91b15bd0-965d-44f7-aa2a-169214e1b28c,0,45,1,,0,0
55,1562712129390.00,91b15bd0-965d-44f7-aa2a-169214e1b28c,0,43,1,,0,0
56,1562712130290.00,91b15bd0-965d-44f7-aa2a-169214e1b28c,0,55,1,,0,0
57,1562712131310.00,91b15bd0-965d-44f7-aa2a-169214e1b28c,0,49,1,,0,0
58,1562712132210.00,91b15bd0-965d-44f7-aa2a-169214e1b28c,0,64,1,,0,0
59,1562712133229.00,91b15bd0-965d-44f7-aa2a-169214e1b28c,0,62,1,,0,0
60,1562712134129.00,91b15bd0-965d-44f7-aa2a-169214e1b28c,0,38,1,,0,0
61,1562712135151.00,91b15bd0-965d-44f7-aa2a-169214e1b28c,0,56,1,,0,0
62,1562712136050.00,91b15bd0-965d-44f7-aa2a-169214e1b28c,0,77,1,,0,0
63,1562712317445.00,91b15bd0-965d-44f7-aa2a-169214e1b28c,0,50,1,,0,0
64,1562712318344.00,91b15bd0-965d-44f7-aa2a-169214e1b28c,0,30,1,,0,0
65,1562712319363.00,91b15bd0-965d-44f7-aa2a-169214e1b28c,0,35,1,,0,0
66,1562712320264.00,91b15bd0-965d-44f7-aa2a-169214e1b28c,0,39,1,,0,0
67,1562712321284.00,91b15bd0-965d-44f7-aa2a-169214e1b28c,0,36,1,,0,0
68,1562712322186.00,91b15bd0-965d-44f7-aa2a-169214e1b28c,0,49,1,,0,0
69,1562712323205.00,91b15bd0-965d-44f7-aa2a-169214e1b28c,0,86,1,,0,0
70,1562712324104.00,91b15bd0-965d-44f7-aa2a-169214e1b28c,0,106,1,,0,0
71,1562712325124.00,91b15bd0-965d-44f7-aa2a-169214e1b28c,0,112,1,,0,0
72,1562712326029.00,91b15bd0-965d-44f7-aa2a-169214e1b28c,0,62,1,,0,0
73,1562712327044.00,91b15bd0-965d-44f7-aa2a-169214e1b28c,0,30,1,,0,0
74,1562712327944.00,91b15bd0-965d-44f7-aa2a-169214e1b28c,0,30,1,,0,0
75,1562712328967.00,91b15bd0-965d-44f7-aa2a-169214e1b28c,0,32,1,,0,0
76,1562712329865.00,91b15bd0-965d-44f7-aa2a-169214e1b28c,0,32,1,,0,0
77,1562712330885.00,91b15bd0-965d-44f7-aa2a-169214e1b28c,0,32,1,,0,0
78,1562712331785.00,91b15bd0-965d-44f7-aa2a-169214e1b28c,0,32,1,,0,0
79,1562712332806.00,91b15bd0-965d-44f7-aa2a-169214e1b28c,0,29,1,,0,0
80,1562712333704.00,91b15bd0-965d-44f7-aa2a-169214e1b28c,0,31,1,,0,0
81,1562712334724.00,91b15bd0-965d-44f7-aa2a-169214e1b28c,0,33,1,,0,0
82,1562712335623.00,91b15bd0-965d-44f7-aa2a-169214e1b28c,0,42,1,,0,0
83,1562712336645.00,91b15bd0-965d-44f7-aa2a-169214e1b28c,0,47,1,,0,0
84,1562712337546.00,91b15bd0-965d-44f7-aa2a-169214e1b28c,0,37,1,,0,0
85,1562712338566.00,91b15bd0-965d-44f7-aa2a-169214e1b28c,0,38,1,,0,0
86,1562712339464.00,91b15bd0-965d-44f7-aa2a-169214e1b28c,0,41,1,,0,0
87,1562712340485.00,91b15bd0-965d-44f7-aa2a-169214e1b28c,0,36,1,,0,0
88,1562712341384.00,91b15bd0-965d-44f7-aa2a-169214e1b28c,0,41,1,,0,0
89,1562712342406.00,91b15bd0-965d-44f7-aa2a-169214e1b28c,0,47,1,,0,0
90,1562712343305.00,91b15bd0-965d-44f7-aa2a-169214e1b28c,0,39,1,,0,0
91,1562712344323.00,91b15bd0-965d-44f7-aa2a-169214e1b28c,0,45,1,,0,0
92,1562712345223.00,91b15bd0-965d-44f7-aa2a-169214e1b28c,0,47,1,,0,0
93,1562712346245.00,91b15bd0-965d-44f7-aa2a-169214e1b28c,0,53,1,,0,0
94,1562712347144.00,91b15bd0-965d-44f7-aa2a-169214e1b28c,0,66,1,,0,0
95,1562712348165.00,91b15bd0-965d-44f7-aa2a-169214e1b28c,0,51,1,,0,0
96,1562712349064.00,91b15bd0-965d-44f7-aa2a-169214e1b28c,0,53,1,,0,0
97,1562712350084.00,91b15bd0-965d-44f7-aa2a-169214e1b28c,0,61,1,,0,0
98,1562712350985.00,91b15bd0-965d-44f7-aa2a-169214e1b28c,0,67,1,,0,0
99,1562712352004.00,91b15bd0-965d-44f7-aa2a-169214e1b28c,0,57,1,,0,0
100,1562712352906.00,91b15bd0-965d-44f7-aa2a-169214e1b28c,0,52,1,,0,0
101,1562712353923.00,91b15bd0-965d-44f7-aa2a-169214e1b28c,0,53,1,,0,0
102,1562712354824.00,91b15bd0-965d-44f7-aa2a-169214e1b28c,0,52,1,,0,0
103,1562712355845.00,91b15bd0-965d-44f7-aa2a-169214e1b28c,0,62,1,,0,0
104,1562712356745.00,91b15bd0-965d-44f7-aa2a-169214e1b28c,0,52,1,,0,0
105,1562712357765.00,91b15bd0-965d-44f7-aa2a-169214e1b28c,0,44,1,,0,0
106,1562712358665.00,91b15bd0-965d-44f7-aa2a-169214e1b28c,0,46,1,,0,0
107,1562712359684.00,91b15bd0-965d-44f7-aa2a-169214e1b28c,0,46,1,,0,0
108,1562712360585.00,91b15bd0-965d-44f7-aa2a-169214e1b28c,0,46,1,,0,0
109,1562712361608.00,91b15bd0-965d-44f7-aa2a-169214e1b28c,0,68,1,,0,0
110,1562712362504.00,91b15bd0-965d-44f7-aa2a-169214e1b28c,0,62,1,,0,0
111,1562712363523.00,91b15bd0-965d-44f7-aa2a-169214e1b28c,0,54,1,,0,0
112,1562712364426.00,91b15bd0-965d-44f7-aa2a-169214e1b28c,0,50,1,,0,0
113,1562712365444.00,91b15bd0-965d-44f7-aa2a-169214e1b28c,0,54,1,,0,0
114,1562712366347.00,91b15bd0-965d-44f7-aa2a-169214e1b28c,0,50,1,,0,0
115,1562712367366.00,91b15bd0-965d-44f7-aa2a-169214e1b28c,0,42,1,,0,0
116,1562712368264.00,91b15bd0-965d-44f7-aa2a-169214e1b28c,0,45,1,,0,0
117,1562712369285.00,91b15bd0-965d-44f7-aa2a-169214e1b28c,0,44,1,,0,0
118,1562712370184.00,91b15bd0-965d-44f7-aa2a-169214e1b28c,0,50,1,,0,0
119,1562712371205.00,91b15bd0-965d-44f7-aa2a-169214e1b28c,0,35,1,,0,0
120,1562712372104.00,91b15bd0-965d-44f7-aa2a-169214e1b28c,0,37,1,,0,0
121,1562712373124.00,91b15bd0-965d-44f7-aa2a-169214e1b28c,0,41,1,,0,0
122,1562712374027.00,91b15bd0-965d-44f7-aa2a-169214e1b28c,0,43,1,,0,0
123,1562712375043.00,91b15bd0-965d-44f7-aa2a-169214e1b28c,0,41,1,,0,0
124,1562712375943.00,91b15bd0-965d-44f7-aa2a-169214e1b28c,0,45,1,,0,0
125,1562712557389.00,91b15bd0-965d-44f7-aa2a-169214e1b28c,0,45,1,,0,0
126,1562712558269.00,91b15bd0-965d-44f7-aa2a-169214e1b28c,0,77,1,,0,0
127,1562712559310.00,91b15bd0-965d-44f7-aa2a-169214e1b28c,0,91,1,,0,0
128,1562712560191.00,91b15bd0-965d-44f7-aa2a-169214e1b28c,0,127,1,,0,0
129,1562712561229.00,91b15bd0-965d-44f7-aa2a-169214e1b28c,0,114,1,,0,0
130,1562712562112.00,91b15bd0-965d-44f7-aa2a-169214e1b28c,0,107,1,,0,0
131,1562712563151.00,91b15bd0-965d-44f7-aa2a-169214e1b28c,0,86,1,,0,0
132,1562712564027.00,91b15bd0-965d-44f7-aa2a-169214e1b28c,0,83,1,,0,0
133,1562712565069.00,91b15bd0-965d-44f7-aa2a-169214e1b28c,0,73,1,,0,0
134,1562712565950.00,91b15bd0-965d-44f7-aa2a-169214e1b28c,0,63,1,,0,0
135,1562712566989.00,91b15bd0-965d-44f7-aa2a-169214e1b28c,0,50,1,,0,0
136,1562712567868.00,91b15bd0-965d-44f7-aa2a-169214e1b28c,0,46,1,,0,0
137,1562712568910.00,91b15bd0-965d-44f7-aa2a-169214e1b28c,0,47,1,,0,0
138,1562712569792.00,91b15bd0-965d-44f7-aa2a-169214e1b28c,0,46,1,,0,0
139,1562712570830.00,91b15bd0-965d-44f7-aa2a-169214e1b28c,0,47,1,,0,0
140,1562712571712.00,91b15bd0-965d-44f7-aa2a-169214e1b28c,0,48,1,,0,0
141,1562712572748.00,91b15bd0-965d-44f7-aa2a-169214e1b28c,0,54,1,,0,0
142,1562712573630.00,91b15bd0-965d-44f7-aa2a-169214e1b28c,0,43,1,,0,0
143,1562712574668.00,91b15bd0-965d-44f7-aa2a-169214e1b28c,0,40,1,,0,0
144,1562712575548.00,91b15bd0-965d-44f7-aa2a-169214e1b28c,0,46,1,,0,0
145,1562712576590.00,91b15bd0-965d-44f7-aa2a-169214e1b28c,0,45,1,,0,0
146,1562712577468.00,91b15bd0-965d-44f7-aa2a-169214e1b28c,0,42,1,,0,0
147,1562712578509.00,91b15bd0-965d-44f7-aa2a-169214e1b28c,0,47,1,,0,0
148,1562712579392.00,91b15bd0-965d-44f7-aa2a-169214e1b28c,0,50,1,,0,0
149,1562712580429.00,91b15bd0-965d-44f7-aa2a-169214e1b28c,0,53,1,,0,0
150,1562712581309.00,91b15bd0-965d-44f7-aa2a-169214e1b28c,0,49,1,,0,0
151,1562712582348.00,91b15bd0-965d-44f7-aa2a-169214e1b28c,0,45,1,,0,0
152,1562712583232.00,91b15bd0-965d-44f7-aa2a-169214e1b28c,0,61,1,,0,0
153,1562712584269.00,91b15bd0-965d-44f7-aa2a-169214e1b28c,0,54,1,,0,0
154,1562712585149.00,91b15bd0-965d-44f7-aa2a-169214e1b28c,0,45,1,,0,0
155,1562712586191.00,91b15bd0-965d-44f7-aa2a-169214e1b28c,0,47,1,,0,0
156,1562712587068.00,91b15bd0-965d-44f7-aa2a-169214e1b28c,0,44,1,,0,0
157,1562712588109.00,91b15bd0-965d-44f7-aa2a-169214e1b28c,0,41,1,,0,0
158,1562712588992.00,91b15bd0-965d-44f7-aa2a-169214e1b28c,0,41,1,,0,0
159,1562712590032.00,91b15bd0-965d-44f7-aa2a-169214e1b28c,0,36,1,,0,0
160,1562712590910.00,91b15bd0-965d-44f7-aa2a-169214e1b28c,0,51,1,,0,0
161,1562712591949.00,91b15bd0-965d-44f7-aa2a-169214e1b28c,0,41,1,,0,0
162,1562712592832.00,91b15bd0-965d-44f7-aa2a-169214e1b28c,0,58,1,,0,0
163,1562712593871.00,91b15bd0-965d-44f7-aa2a-169214e1b28c,0,64,1,,0,0
164,1562712594747.00,91b15bd0-965d-44f7-aa2a-169214e1b28c,0,71,1,,0,0
165,1562712595787.00,91b15bd0-965d-44f7-aa2a-169214e1b28c,0,47,1,,0,0
166,1562712596667.00,91b15bd0-965d-44f7-aa2a-169214e1b28c,0,39,1,,0,0
167,1562712597708.00,91b15bd0-965d-44f7-aa2a-169214e1b28c,0,35,1,,0,0
168,1562712598588.00,91b15bd0-965d-44f7-aa2a-169214e1b28c,0,39,1,,0,0
169,1562712599628.00,91b15bd0-965d-44f7-aa2a-169214e1b28c,0,43,1,,0,0
170,1562712600508.00,91b15bd0-965d-44f7-aa2a-169214e1b28c,0,41,1,,0,0
171,1562712601548.00,91b15bd0-965d-44f7-aa2a-169214e1b28c,0,39,1,,0,0
172,1562712602429.00,91b15bd0-965d-44f7-aa2a-169214e1b28c,0,52,1,,0,0
173,1562712603472.00,91b15bd0-965d-44f7-aa2a-169214e1b28c,0,74,1,,0,0
174,1562712604350.00,91b15bd0-965d-44f7-aa2a-169214e1b28c,0,94,1,,0,0
175,1562712605393.00,91b15bd0-965d-44f7-aa2a-169214e1b28c,0,80,1,,0,0
176,1562712606269.00,91b15bd0-965d-44f7-aa2a-169214e1b28c,0,81,1,,0,0
177,1562712607311.00,91b15bd0-965d-44f7-aa2a-169214e1b28c,0,63,1,,0,0
178,1562712608190.00,91b15bd0-965d-44f7-aa2a-169214e1b28c,0,55,1,,0,0
179,1562712609232.00,91b15bd0-965d-44f7-aa2a-169214e1b28c,0,45,1,,0,0
180,1562712610110.00,91b15bd0-965d-44f7-aa2a-169214e1b28c,0,45,1,,0,0
181,1562712611150.00,91b15bd0-965d-44f7-aa2a-169214e1b28c,0,51,1,,0,0
182,1562712612033.00,91b15bd0-965d-44f7-aa2a-169214e1b28c,0,40,1,,0,0
183,1562712613069.00,91b15bd0-965d-44f7-aa2a-169214e1b28c,0,48,1,,0,0
184,1562712613948.00,91b15bd0-965d-44f7-aa2a-169214e1b28c,0,63,1,,0,0
185,1562712614988.00,91b15bd0-965d-44f7-aa2a-169214e1b28c,0,107,1,,0,0
186,1562712615870.00,91b15bd0-965d-44f7-aa2a-169214e1b28c,0,186,1,,0,0
187,1562712616909.00,91b15bd0-965d-44f7-aa2a-169214e1b28c,0,178,1,,0,0
188,1562712798245.00,91b15bd0-965d-44f7-aa2a-169214e1b28c,0,68,1,,0,0
189,1562712799265.00,91b15bd0-965d-44f7-aa2a-169214e1b28c,0,39,1,,0,0
190,1562712800165.00,91b15bd0-965d-44f7-aa2a-169214e1b28c,0,35,1,,0,0
191,1562712801187.00,91b15bd0-965d-44f7-aa2a-169214e1b28c,0,33,1,,0,0
192,1562712802086.00,91b15bd0-965d-44f7-aa2a-169214e1b28c,0,41,1,,0,0
193,1562712803106.00,91b15bd0-965d-44f7-aa2a-169214e1b28c,0,40,1,,0,0
194,1562712804005.00,91b15bd0-965d-44f7-aa2a-169214e1b28c,0,36,1,,0,0
195,1562712805026.00,91b15bd0-965d-44f7-aa2a-169214e1b28c,0,40,1,,0,0
196,1562712805925.00,91b15bd0-965d-44f7-aa2a-169214e1b28c,0,39,1,,0,0
197,1562712806946.00,91b15bd0-965d-44f7-aa2a-169214e1b28c,0,36,1,,0,0
198,1562712807845.00,91b15bd0-965d-44f7-aa2a-169214e1b28c,0,42,1,,0,0
199,1562712808866.00,91b15bd0-965d-44f7-aa2a-169214e1b28c,0,36,1,,0,0
200,1562712809766.00,91b15bd0-965d-44f7-aa2a-169214e1b28c,0,33,1,,0,0
201,1562712810785.00,91b15bd0-965d-44f7-aa2a-169214e1b28c,0,36,1,,0,0
202,1562712811689.00,91b15bd0-965d-44f7-aa2a-169214e1b28c,0,33,1,,0,0
203,1562712812707.00,91b15bd0-965d-44f7-aa2a-169214e1b28c,0,34,1,,0,0
204,1562712813606.00,91b15bd0-965d-44f7-aa2a-169214e1b28c,0,34,1,,0,0
205,1562712814624.00,91b15bd0-965d-44f7-aa2a-169214e1b28c,0,35,1,,0,0
206,1562712815528.00,91b15bd0-965d-44f7-aa2a-169214e1b28c,0,44,1,,0,0
207,1562712816547.00,91b15bd0-965d-44f7-aa2a-169214e1b28c,0,38,1,,0,0
208,1562712817449.00,91b15bd0-965d-44f7-aa2a-169214e1b28c,0,43,1,,0,0
209,1562712818466.00,91b15bd0-965d-44f7-aa2a-169214e1b28c,0,47,1,,0,0
210,1562712819365.00,91b15bd0-965d-44f7-aa2a-169214e1b28c,0,42,1,,0,0
211,1562712820389.00,91b15bd0-965d-44f7-aa2a-169214e1b28c,0,40,1,,0,0
212,1562712821285.00,91b15bd0-965d-44f7-aa2a-169214e1b28c,0,46,1,,0,0
213,1562712822307.00,91b15bd0-965d-44f7-aa2a-169214e1b28c,0,57,1,,0,0
214,1562712823206.00,91b15bd0-965d-44f7-aa2a-169214e1b28c,0,53,1,,0,0
215,1562712824226.00,91b15bd0-965d-44f7-aa2a-169214e1b28c,0,68,1,,0,0
216,1562712825126.00,91b15bd0-965d-44f7-aa2a-169214e1b28c,0,63,1,,0,0
217,1562712826145.00,91b15bd0-965d-44f7-aa2a-169214e1b28c,0,45,1,,0,0
218,1562712827045.00,91b15bd0-965d-44f7-aa2a-169214e1b28c,0,41,1,,0,0
219,1562712828065.00,91b15bd0-965d-44f7-aa2a-169214e1b28c,0,37,1,,0,0
220,1562712828967.00,91b15bd0-965d-44f7-aa2a-169214e1b28c,0,35,1,,0,0
221,1562712829984.00,91b15bd0-965d-44f7-aa2a-169214e1b28c,0,37,1,,0,0
222,1562712830889.00,91b15bd0-965d-44f7-aa2a-169214e1b28c,0,43,1,,0,0
223,1562712831906.00,91b15bd0-965d-44f7-aa2a-169214e1b28c,0,41,1,,0,0
224,1562712832805.00,91b15bd0-965d-44f7-aa2a-169214e1b28c,0,41,1,,0,0
225,1562712833825.00,91b15bd0-965d-44f7-aa2a-169214e1b28c,0,40,1,,0,0
226,1562712834725.00,91b15bd0-965d-44f7-aa2a-169214e1b28c,0,41,1,,0,0
227,1562712835746.00,91b15bd0-965d-44f7-aa2a-169214e1b28c,0,35,1,,0,0
228,1562712836646.00,91b15bd0-965d-44f7-aa2a-169214e1b28c,0,39,1,,0,0
229,1562712837666.00,91b15bd0-965d-44f7-aa2a-169214e1b28c,0,37,1,,0,0
230,1562712838566.00,91b15bd0-965d-44f7-aa2a-169214e1b28c,0,38,1,,0,0
231,1562712839587.00,91b15bd0-965d-44f7-aa2a-169214e1b28c,0,36,1,,0,0
232,1562712840487.00,91b15bd0-965d-44f7-aa2a-169214e1b28c,0,40,1,,0,0
233,1562712841504.00,91b15bd0-965d-44f7-aa2a-169214e1b28c,0,37,1,,0,0
234,1562712842405.00,91b15bd0-965d-44f7-aa2a-169214e1b28c,0,38,1,,0,0
235,1562712843424.00,91b15bd0-965d-44f7-aa2a-169214e1b28c,0,35,1,,0,0
236,1562712844326.00,91b15bd0-965d-44f7-aa2a-169214e1b28c,0,37,1,,0,0
237,1562712845347.00,91b15bd0-965d-44f7-aa2a-169214e1b28c,0,35,1,,0,0
238,1562712846246.00,91b15bd0-965d-44f7-aa2a-169214e1b28c,0,33,1,,0,0
239,1562712847266.00,91b15bd0-965d-44f7-aa2a-169214e1b28c,0,34,1,,0,0
240,1562712848167.00,91b15bd0-965d-44f7-aa2a-169214e1b28c,0,33,1,,0,0
241,1562712849186.00,91b15bd0-965d-44f7-aa2a-169214e1b28c,0,33,1,,0,0
242,1562712850087.00,91b15bd0-965d-44f7-aa2a-169214e1b28c,0,35,1,,0,0
243,1562712851106.00,91b15bd0-965d-44f7-aa2a-169214e1b28c,0,34,1,,0,0
244,1562712852006.00,91b15bd0-965d-44f7-aa2a-169214e1b28c,0,35,1,,0,0
245,1562712853024.00,91b15bd0-965d-44f7-aa2a-169214e1b28c,0,35,1,,0,0
246,1562712853925.00,91b15bd0-965d-44f7-aa2a-169214e1b28c,0,35,1,,0,0
247,1562712854945.00,91b15bd0-965d-44f7-aa2a-169214e1b28c,0,36,1,,0,0
248,1562712855850.00,91b15bd0-965d-44f7-aa2a-169214e1b28c,0,36,1,,0,0
249,1562712856866.00,91b15bd0-965d-44f7-aa2a-169214e1b28c,0,37,1,,0,0
250,1562713059187.00,91b15bd0-965d-44f7-aa2a-169214e1b28c,0,37,1,,0,0
251,1562713060207.00,91b15bd0-965d-44f7-aa2a-169214e1b28c,0,53,1,,0,0
252,1562713061108.00,91b15bd0-965d-44f7-aa2a-169214e1b28c,0,51,1,,0,0
253,1562713062130.00,91b15bd0-965d-44f7-aa2a-169214e1b28c,0,54,1,,0,0
254,1562713063028.00,91b15bd0-965d-44f7-aa2a-169214e1b28c,0,72,1,,0,0
255,1562713064050.00,91b15bd0-965d-44f7-aa2a-169214e1b28c,0,81,1,,0,0
256,1562713064947.00,91b15bd0-965d-44f7-aa2a-169214e1b28c,0,65,1,,0,0
257,1562713065969.00,91b15bd0-965d-44f7-aa2a-169214e1b28c,0,58,1,,0,0
258,1562713066868.00,91b15bd0-965d-44f7-aa2a-169214e1b28c,0,49,1,,0,0
259,1562713067887.00,91b15bd0-965d-44f7-aa2a-169214e1b28c,0,46,1,,0,0
260,1562713068790.00,91b15bd0-965d-44f7-aa2a-169214e1b28c,0,47,1,,0,0
261,1562713069807.00,91b15bd0-965d-44f7-aa2a-169214e1b28c,0,42,1,,0,0
262,1562713070710.00,91b15bd0-965d-44f7-aa2a-169214e1b28c,0,47,1,,0,0
263,1562713071728.00,91b15bd0-965d-44f7-aa2a-169214e1b28c,0,48,1,,0,0
264,1562713072628.00,91b15bd0-965d-44f7-aa2a-169214e1b28c,0,52,1,,0,0
265,1562713073649.00,91b15bd0-965d-44f7-aa2a-169214e1b28c,0,49,1,,0,0
266,1562713074546.00,91b15bd0-965d-44f7-aa2a-169214e1b28c,0,48,1,,0,0
267,1562713075566.00,91b15bd0-965d-44f7-aa2a-169214e1b28c,0,51,1,,0,0
268,1562713076468.00,91b15bd0-965d-44f7-aa2a-169214e1b28c,0,62,1,,0,0
269,1562713077488.00,91b15bd0-965d-44f7-aa2a-169214e1b28c,0,64,1,,0,0
270,1562713078389.00,91b15bd0-965d-44f7-aa2a-169214e1b28c,0,55,1,,0,0
271,1562713079408.00,91b15bd0-965d-44f7-aa2a-169214e1b28c,0,56,1,,0,0
272,1562713080308.00,91b15bd0-965d-44f7-aa2a-169214e1b28c,0,48,1,,0,0
273,1562713081329.00,91b15bd0-965d-44f7-aa2a-169214e1b28c,0,54,1,,0,0
274,1562713082226.00,91b15bd0-965d-44f7-aa2a-169214e1b28c,0,69,1,,0,0
275,1562713083247.00,91b15bd0-965d-44f7-aa2a-169214e1b28c,0,48,1,,0,0
276,1562713084148.00,91b15bd0-965d-44f7-aa2a-169214e1b28c,0,53,1,,0,0
277,1562713085168.00,91b15bd0-965d-44f7-aa2a-169214e1b28c,0,59,1,,0,0
278,1562713086071.00,91b15bd0-965d-44f7-aa2a-169214e1b28c,0,75,1,,0,0
279,1562713087087.00,91b15bd0-965d-44f7-aa2a-169214e1b28c,0,58,1,,0,0
280,1562713087988.00,91b15bd0-965d-44f7-aa2a-169214e1b28c,0,66,1,,0,0
281,1562713089009.00,91b15bd0-965d-44f7-aa2a-169214e1b28c,0,50,1,,0,0
282,1562713089906.00,91b15bd0-965d-44f7-aa2a-169214e1b28c,0,60,1,,0,0
283,1562713090928.00,91b15bd0-965d-44f7-aa2a-169214e1b28c,0,67,1,,0,0
284,1562713091827.00,91b15bd0-965d-44f7-aa2a-169214e1b28c,0,70,1,,0,0
285,1562713092847.00,91b15bd0-965d-44f7-aa2a-169214e1b28c,0,67,1,,0,0
286,1562713093746.00,91b15bd0-965d-44f7-aa2a-169214e1b28c,0,70,1,,0,0
287,1562713094767.00,91b15bd0-965d-44f7-aa2a-169214e1b28c,0,68,1,,0,0
288,1562713095671.00,91b15bd0-965d-44f7-aa2a-169214e1b28c,0,65,1,,0,0
289,1562713096687.00,91b15bd0-965d-44f7-aa2a-169214e1b28c,0,68,1,,0,0
290,1562713097587.00,91b15bd0-965d-44f7-aa2a-169214e1b28c,0,71,1,,0,0
