SALE TYPE,SOLD DATE,PROPERTY TYPE,ADDRESS,CITY,STATE OR PROVINCE,ZIP OR POSTAL CODE,PRICE,BEDS,BATHS,LOCATION,SQUARE FEET,LOT SIZE,YEAR BUILT,DAYS ON MARKET,$/SQUARE FEET,HOA/MONTH,STATUS,NEXT OPEN HOUSE START TIME,NEXT OPEN HOUSE END TIME,URL (SEE http://www.redfin.com/buy-a-home/comparative-market-analysis FOR INFO ON PRICING),SOURCE,MLS#,FAVORITE,INTERESTED,LATITUDE,LONGITUDE
MLS Listing,,Single Family Residential,28350 Infinity Cir,Saugus,CA,91390,875000,5,3.0,COPN - Copper Hill North,3554,26516,2002,4,246,,Active,,,http://www.redfin.com/CA/Santa-Clarita/28350-Infinity-Cir-91390/home/8121317,CRMLS,BB20147316,N,Y,34.4639509,-118.5253734
MLS Listing,,Single Family Residential,28207 Ridge View Dr,Canyon Country,CA,91387,669000,3,2.0,CAN2 - Canyon Country 2,2036,10726,1996,5,329,,Active,,,http://www.redfin.com/CA/Santa-Clarita/28207-Ridge-View-Dr-91387/home/6027487,CRMLS,BB20136496,N,Y,34.4244013,-118.4396071
MLS Listing,,Single Family Residential,23825 Bella Vista Dr,Newhall,CA,91321,875000,4,4.0,NEW1 - Newhall 1,2966,6577,1992,11,295,122,Active,,,http://www.redfin.com/CA/Santa-Clarita/23825-Bella-Vista-Dr-91321/home/6004542,CRMLS,BB20140639,N,Y,34.3699153,-118.5511446
MLS Listing,,Condo/Co-op,24123 Del Monte Dr #97,Valencia,CA,91355,325000,1,1.0,VAL1 - Valencia 1,693,842295,1989,32,469,300,Active,,,http://www.redfin.com/CA/Santa-Clarita/24123-W-Del-Monte-Dr-91355/unit-97/home/6074750,CRMLS,BB20111238,N,Y,34.410723,-118.5605659
MLS Listing,,Condo/Co-op,21851 Moveo Dr,Saugus,CA,91350,549000,3,3.0,BOUQ - Bouquet Canyon,1861,15402,2013,1,295,220,Active,,,http://www.redfin.com/CA/Santa-Clarita/21851-Moveo-Dr-91350/home/79039585,CRMLS,TR20149654,N,Y,34.4158305,-118.517857
MLS Listing,,Mobile/Manufactured Home,27361 sierra Hwy #16,Canyon Country,CA,91351,179900,3,2.0,CAN1 - Canyon Country 1,,,1998,1,,,Active,,,http://www.redfin.com/CA/Canyon-Country/27361-Sierra-Hwy-91351/unit-16/home/145119699,CRISNet,SR20149555,N,Y,34.4093776,-118.4599125
MLS Listing,,Single Family Residential,24005 Briardale Way,Newhall,CA,91321,875000,5,2.75,NEW1 - Newhall 1,2930,9506,1984,1,299,190,Active,,,http://www.redfin.com/CA/Newhall/24005-Briardale-Way-91321/home/6002615,CRISNet,SR20145475,N,Y,34.3587716,-118.5412099
MLS Listing,,Vacant Land,address available,Valencia,CA,91354,45000,,,Valencia,,,,1,,,Active,,,http://www.redfin.com/CA/Valencia/address-available-91354/home/171224240,CRMLS,200035422,N,Y,34.456151,-118.5713823
MLS Listing,,Vacant Land,no NW address available,Valencia,CA,91354,45000,0,,,,,,1,,,Active,,,http://www.redfin.com/CA/Santa-Clarita/no-NW-address-available-91354/home/166584478,SDMLS,200035422,N,Y,34.456151,-118.5713823
MLS Listing,,Townhouse,24754 Masters Cup Way,Valencia,CA,91355,374999,3,1.5,VAL1 - Valencia 1,1169,1406,1974,2,321,284,Active,,,http://www.redfin.com/CA/Santa-Clarita/24754-Masters-Cup-Way-91355/home/6043264,CRISNet,SR20148690,N,Y,34.388315,-118.566807
MLS Listing,,Single Family Residential,28842 Rock Canyon Dr,Saugus,CA,91390,799000,4,4.0,COPN - Copper Hill North,2897,14941,2001,2,276,173,Active,,,http://www.redfin.com/CA/Santa-Clarita/28842-Rock-Canyon-Dr-91390/home/8110960,CRISNet,SR20148422,N,Y,34.4700912,-118.5162566
MLS Listing,,Condo/Co-op,18209 Sierra #126,Canyon Country,CA,91351,290000,2,2.0,CAN1 - Canyon Country 1,795,312806,1987,2,365,330,Active,,,http://www.redfin.com/CA/Santa-Clarita/18209-Sierra-Hwy-91351/unit-126/home/5914644,CRISNet,SR20148581,N,Y,34.4210025,-118.4547869
MLS Listing,,Single Family Residential,24003 Saint Moritz Dr,Valencia,CA,91355,725000,3,2.5,VSUM - Valencia Summit,1656,7155,1987,3,438,50,Active,,,http://www.redfin.com/CA/Santa-Clarita/24003-St-Moritz-Dr-91355/home/6070621,CRISNet,SR20147482,N,Y,34.4023046,-118.5547426
MLS Listing,,Single Family Residential,22023 Alamogordo Rd,Santa Clarita,CA,91350,585000,3,2.0,Bouquet Canyon,1188,6441,1964,4,492,,Active,,,http://www.redfin.com/CA/Santa-Clarita/22023-Alamogordo-Rd-91350/home/5932914,TheMLS,20-609192,N,Y,34.4367234,-118.5214966
MLS Listing,,Single Family Residential,27165 Westview Ln,Valencia,CA,91354,599000,3,2.25,NBRG - Valencia Northbridge,1732,44104,1998,4,346,120,Active,,,http://www.redfin.com/CA/Santa-Clarita/27165-Westview-Ln-91354/home/5963449,CRMLS,PW20146610,N,Y,34.431923,-118.550882
MLS Listing,,Single Family Residential,28028 Liana Ln,Valencia,CA,91354,819000,5,4.0,NPRK - Valencia Northpark,2937,5536,1997,4,279,32,Active,,,http://www.redfin.com/CA/Valencia/28028-Liana-Ln-91354/home/5950648,CRISNet,SR20147348,N,Y,34.4574702,-118.543707
MLS Listing,,Single Family Residential,19816 Collins Rd,Canyon Country,CA,91351,520000,3,2.0,RBGL - Rainbow Glen,1172,295931,1986,4,444,170,Active,,,http://www.redfin.com/CA/Canyon-Country/19816-Collins-Rd-91351/home/6014823,CRISNet,SR20147681,N,Y,34.4111993,-118.4803503
MLS Listing,,Single Family Residential,23315 Summerglen Pl,Valencia,CA,91354,799000,5,3.0,NPRK - Valencia Northpark,2939,5941,1996,4,272,41,Active,,,http://www.redfin.com/CA/Santa-Clarita/23315-Summerglen-Pl-91354/home/5949076,CRISNet,SR20147750,N,Y,34.4522908,-118.5450158
MLS Listing,,Townhouse,24600 Brighton Dr Unit B,Valencia,CA,91355,569950,2,2.5,VSUM - Valencia Summit,1581,716118,1988,4,360,475,Active,,,http://www.redfin.com/CA/Valencia/24600-Brighton-Dr-91355/unit-B/home/6069372,CRISNet,SR20145314,N,Y,34.3993817,-118.5644793
MLS Listing,,Townhouse,24922 Avignon Dr #65,Valencia,CA,91355,699000,2,3.0,NBRG - Valencia Northbridge,1936,98140,1999,4,361,388,Active,,,http://www.redfin.com/CA/Santa-Clarita/24922-Avignon-Dr-91355/unit-65/home/6075489,CRISNet,SR20137070,N,Y,34.421805,-118.570911
MLS Listing,,Single Family Residential,21644 Agajanian Ln,Saugus,CA,91350,710000,4,3.0,BOUQ - Bouquet Canyon,2620,5808,1988,4,271,15,Active,,,http://www.redfin.com/CA/Santa-Clarita/21644-Agajanian-Ln-91350/home/6384298,CRISNet,SR20147570,N,Y,34.4574628,-118.5132688
MLS Listing,,Single Family Residential,28636 Farrier Dr,Valencia,CA,91354,845000,4,3.5,VLWH - Valencia West Hills,3152,7049,2014,4,268,128,Active,,,http://www.redfin.com/CA/Valencia/28636-Farrier-Dr-91354/home/40487778,CRISNet,SR20147337,N,Y,34.4569988,-118.5733693
MLS Listing,,Townhouse,22067 Barrington Way,Saugus,CA,91350,497000,3,2.5,RVLG - River Village,1600,22200,2016,4,311,276,Active,,,http://www.redfin.com/CA/Santa-Clarita/22067-Barrington-Way-91350/home/110208215,CRISNet,SR20144828,N,Y,34.428389,-118.508654
MLS Listing,,Single Family Residential,15920 Austin Ct,Canyon Country,CA,91387,727000,5,4.0,CAN2 - Canyon Country 2,3483,5303,2006,4,209,250,Active,,,http://www.redfin.com/CA/Santa-Clarita/15920-Austin-Ct-91387/home/12284261,CRISNet,SR20147094,N,Y,34.4398249,-118.413686
MLS Listing,,Single Family Residential,25689 Alicante Dr,Valencia,CA,91355,545000,3,2.0,VAL1 - Valencia 1,1128,4693,1982,4,483,55,Active,,,http://www.redfin.com/CA/Santa-Clarita/25689-Alicante-Dr-91355/home/6063464,CRISNet,SR20147346,N,Y,34.404244,-118.542514
MLS Listing,,Single Family Residential,26975 Cape Cod Dr,VALENCIA,CA,91355,639888,3,2.5,VALENCIA,2069,53186,2001,4,309,225,Active,,,http://www.redfin.com/CA/Santa-Clarita/26975-Cape-Cod-Dr-91355/home/8115788,MLSListings,ML81802677,N,Y,34.428067,-118.563685
MLS Listing,,Townhouse,23942 Brescia Dr,Valencia,CA,91354,559000,3,2.5,VLWC - Valencia West Creek,1660,730529,2008,4,337,271,Active,,,http://www.redfin.com/CA/Valencia/23942-Brescia-Dr-91354/home/17233002,CRISNet,SR20147101,N,Y,34.4615463,-118.5566422
MLS Listing,,Townhouse,22126 Barrington Way,Saugus,CA,91350,599900,5,4.0,River Village,2430,23726,2017,4,247,320,Active,,,http://www.redfin.com/CA/Santa-Clarita/22126-Barrington-Way-91350/home/143942271,VCRDS,220007796,N,Y,34.4278497,-118.5102883
MLS Listing,,Single Family Residential,27277 Edgemont Ln,Saugus,CA,91350,619900,4,3.0,FEKS - Five Knolls,2212,82584,2017,4,280,220,Active,,,http://www.redfin.com/CA/Santa-Clarita/Edgemont-Ln-91351/home/131848708,CRISNet,SR20146157,N,Y,34.431449,-118.497056
MLS Listing,,Single Family Residential,23240 Via Barra,Valencia,CA,91355,620000,4,1.75,VAL1 - Valencia 1,1360,5302,1972,4,456,,Active,,,http://www.redfin.com/CA/Santa-Clarita/23240-Via-Barra-91355/home/6060628,CRISNet,SR20142620,N,Y,34.3944435,-118.5432053
MLS Listing,,Condo/Co-op,18730 Vista Del Canon Unit E,Newhall,CA,91321,339950,2,1.0,NEW4 - Newhall 4,809,78014,1990,4,420,350,Active,,,http://www.redfin.com/CA/Newhall/18730-Vista-Del-Canon-91321/unit-E/home/6032524,CRISNet,SR20146013,N,Y,34.40287,-118.464388
MLS Listing,,Condo/Co-op,26867 Avenue Of The Oaks Unit B,Newhall,CA,91321,290000,2,1.5,NEW4 - Newhall 4,864,353027,1964,5,336,305,Active,,,http://www.redfin.com/CA/Newhall/26867-Avenue-Of-The-Oaks-91321/unit-B/home/6078115,CRISNet,SR20145520,N,Y,34.4026139,-118.4888403
MLS Listing,,Mobile/Manufactured Home,27361 Sierra Hwy,Canyon Country,CA,91351,184500,4,2.0,CAN1 - Canyon Country 1,1680,,2007,5,110,,Active,,,http://www.redfin.com/CA/Santa-Clarita/27361-Sierra-Hwy-91351/home/135256105,CRISNet,SR20146875,N,Y,34.410231,-118.462888
MLS Listing,,Single Family Residential,23958 Via Aranda,Valencia,CA,91355,579900,3,2.0,VAL1 - Valencia 1,1429,5861,1968,5,406,55,Active,,,http://www.redfin.com/CA/Santa-Clarita/23958-Via-Aranda-91355/home/6055777,CRISNet,SR20146815,N,Y,34.3825699,-118.5539194
MLS Listing,,Condo/Co-op,26333 Long Oak Dr,Newhall,CA,91321,449000,2,2.0,NEW4 - Newhall 4,1162,655073,1970,5,386,411,Active,,,http://www.redfin.com/CA/Santa-Clarita/26333-Long-Oak-Dr-91321/home/6079551,CRISNet,SR20143554,N,Y,34.4017878,-118.4816061
MLS Listing,,Mobile/Manufactured Home,21432 Tumbleweed Way,Saugus,CA,91354,130000,2,2.0,BOUQ - Bouquet Canyon,1434,,1979,5,91,1007,Active,,,http://www.redfin.com/CA/Saugus/21432-Tumbleweed-WAY-91354/home/167680480,CRISNet,SR20146563,N,Y,34.4618402,-118.5492933
MLS Listing,,Condo/Co-op,24419 Valle Del Oro #204,Newhall,CA,91321,329000,2,2.0,NEW5 - Newhall Area 5,883,132273,1990,5,373,417,Active,,,http://www.redfin.com/CA/Santa-Clarita/24419-Valle-Del-Oro-91321/unit-204/home/6009520,CRISNet,SR20145882,N,Y,34.3780945,-118.5112326
MLS Listing,,Single Family Residential,27268 Marisa Dr,Canyon Country,CA,91387,570000,3,2.5,CAN1 - Canyon Country 1,1722,143136,2004,5,331,119,Active,,,http://www.redfin.com/CA/Santa-Clarita/27268-Marisa-Dr-91387/home/12479164,CRISNet,SR20146118,N,Y,34.408295,-118.44895
MLS Listing,,Single Family Residential,25917 San Clemente Dr,Newhall,CA,91321,520000,3,2.0,NEW4 - Newhall 4,1272,4357,1993,5,409,210,Active,,,http://www.redfin.com/CA/Santa-Clarita/25917-San-Clemente-Dr-91321/home/6030616,CRISNet,SR20145772,N,Y,34.3942239,-118.4731434
MLS Listing,,Townhouse,24055 Tango Dr,Valencia,CA,91354,595000,3,3.0,Tesoro de Valle,2039,301525,2004,5,292,300,Active,,,http://www.redfin.com/CA/Valencia/24055-Tango-Dr-91354/home/8134010,TheMLS,20-608156,N,Y,34.46815,-118.560451
MLS Listing,,Single Family Residential,28353 Mayfair Dr,Valencia,CA,91354,519000,2,2.5,NPRK - Valencia Northpark,1234,106566,1998,5,421,200,Active,,,http://www.redfin.com/CA/Santa-Clarita/28353-Mayfair-Dr-91354/home/8099705,CRISNet,SR20143408,N,Y,34.4634186,-118.5444206
MLS Listing,,Condo/Co-op,24839 Apple St Unit A,Newhall,CA,91321,369000,2,2.0,NEW1 - Newhall 1,1156,181854,1981,6,319,342,Active,,,http://www.redfin.com/CA/Santa-Clarita/24839-Apple-St-91321/unit-A/home/6006912,CRISNet,SR20145780,N,Y,34.3779795,-118.5436842
MLS Listing,,Single Family Residential,20101 Shadow Is,Canyon Country,CA,91351,175000,2,2.0,CAN1 - Canyon Country 1,1752,4160,1989,6,100,,Active,,,http://www.redfin.com/CA/Santa-Clarita/20101-Shadow-Island-Dr-91351/home/172542160,CRISNet,SR20145795,N,Y,34.4288413,-118.4863477
MLS Listing,,Single Family Residential,22676 La Rochelle Dr,Saugus,CA,91350,599000,4,3.0,BOUQ - Bouquet Canyon,1726,7629,1957,6,347,,Active,,,http://www.redfin.com/CA/Santa-Clarita/22676-La-Rochelle-Dr-91350/home/5925490,CRISNet,SR20145233,N,Y,34.450132,-118.5337504
MLS Listing,,Single Family Residential,22028 Windham Way,Saugus,CA,91350,599000,4,3.0,RVLG - River Village,2423,29152,2016,6,247,164,Active,,,http://www.redfin.com/CA/Santa-Clarita/22028-Windham-Way-91350/home/109240791,CRISNet,SR20143134,N,Y,34.4290559,-118.5074217
MLS Listing,,Townhouse,22104 Barrington Way,Saugus,CA,91350,499900,3,3.0,RVLG - River Village,1690,22870,2017,6,296,276,Active,,,http://www.redfin.com/CA/Santa-Clarita/22104-Barrington-Way-91350/home/143367498,CRISNet,SR20143892,N,Y,34.4278843,-118.5094731
MLS Listing,,Single Family Residential,21841 Propello Dr,Saugus,CA,91350,540000,4,3.0,VMET - Villa Metro,2122,25896,2016,7,254,225,Active,,,http://www.redfin.com/CA/Santa-Clarita/21841-Propello-Dr-91350/home/108422777,CRISNet,SR20144826,N,Y,34.4169622,-118.5180284
MLS Listing,,Single Family Residential,22030 Grovepark Dr,Saugus,CA,91350,624900,3,3.0,BOUQ - Bouquet Canyon,1672,5698,1989,7,374,56,Active,,,http://www.redfin.com/CA/Santa-Clarita/22030-Grovepark-Dr-91350/home/5928964,CRISNet,SR20144208,N,Y,34.4469054,-118.5213598
MLS Listing,,Single Family Residential,27758 Caraway Ln,Santa Clarita,CA,91350,575000,4,3.0,Santa Clarita,1670,4583,1980,7,344,65,Active,,,http://www.redfin.com/CA/Santa-Clarita/27758-Caraway-Ln-91350/home/6376798,AVMLS,20005636,N,Y,34.447234,-118.5134691
MLS Listing,,Single Family Residential,23656 Via Delfina,Valencia,CA,91355,589000,3,2.0,Valencia 1,1514,6032,1972,7,389,,Active,,,http://www.redfin.com/CA/Santa-Clarita/23656-Via-Delfina-91355/home/6059572,TheMLS,20-607238,N,Y,34.3918875,-118.547948
MLS Listing,,Condo/Co-op,27068 Hidaway Ave #3,Canyon Country,CA,91351,369999,2,1.5,CAN1 - Canyon Country 1,1078,843622,1980,7,343,383,Active,,,http://www.redfin.com/CA/Santa-Clarita/27068-Hidaway-Ave-91351/unit-3/home/5916919,CRISNet,SR20144171,N,Y,34.4136127,-118.4671181
MLS Listing,,Mobile/Manufactured Home,18540 Soledad Canyon Rd Spc 21,Canyon Country,CA,91351,73000,3,2.0,Canyon Country,1144,,1997,8,64,,Active,,,http://www.redfin.com/CA/Canyon-Country/18540-Soledad-Canyon-Rd-91351/unit-21/home/172527822,AVMLS,20005610,N,Y,34.4162727,-118.4566964
MLS Listing,,Condo/Co-op,26410 Oak Highland Dr,Newhall,CA,91321,439000,2,2.0,NEW4 - Newhall 4,1190,31828,1975,8,369,410,Active,,,http://www.redfin.com/CA/Santa-Clarita/26410-Oak-Highland-Dr-91321/home/6080236,CRISNet,SR20143593,N,Y,34.402112,-118.4772519
MLS Listing,,Condo/Co-op,26814 Circle Of The Oaks,Newhall,CA,91321,425000,2,1.75,NEW4 - Newhall 4,1365,352427,1965,8,311,335,Active,,,http://www.redfin.com/CA/Newhall/26814-Circle-of-the-Oaks-91321/home/6077539,CRISNet,SR20143001,N,Y,34.4061996,-118.4676197
MLS Listing,,Single Family Residential,27009 Pierpont Ct,Valencia,CA,91355,799000,4,3.0,Valencia Bridgeport,2572,4086,2000,8,311,215,Active,,,http://www.redfin.com/CA/Santa-Clarita/27009-Pierpont-Ct-91355/home/8108949,TheMLS,20-606774,N,Y,34.4267085,-118.5528274
MLS Listing,,Single Family Residential,27629 Solana Way,Santa Clarita,CA,91350,749900,4,3.5,Canyon Country 1,3516,,2017,9,213,224,Active,,,http://www.redfin.com/CA/Santa-Clarita/27629-Solana-Way-91351/home/143518961,TheMLS,20-596966,N,Y,34.436142,-118.495766
MLS Listing,,Single Family Residential,25211 Via Tanara,Valencia,CA,91355,615000,4,2.0,VAL1 - Valencia 1,1743,4929,1968,9,353,55,Active,,,http://www.redfin.com/CA/Santa-Clarita/25211-Via-Tanara-91355/home/6053205,CRISNet,SR20139103,N,Y,34.3798477,-118.5506378
MLS Listing,,Townhouse,27076 Hidaway Ave #2,Canyon Country,CA,91351,414850,3,2.5,CAN1 - Canyon Country 1,1250,843622,1980,9,332,353,Active,,,http://www.redfin.com/CA/Santa-Clarita/27076-Hidaway-Ave-91351/unit-2/home/5916581,CRISNet,SR20142644,N,Y,34.4136127,-118.4671181
MLS Listing,,Townhouse,22934 Harvest Ml,Saugus,CA,91350,461990,2,2.5,RVLG - River Village,1366,1366,2020,10,338,375,Active,,,http://www.redfin.com/CA/Santa-Clarita/22934-Harvest-Mill-Cir-91350/home/172522906,CRMLS,CV20142521,N,Y,34.4259227,-118.5333466
MLS Listing,,Mobile/Manufactured Home,21435 brierway #94,Canyon Country,CA,91351,159000,3,2.0,CAN1 - Canyon Country 1,,,1979,10,,,Active,,,http://www.redfin.com/CA/Santa-Clarita/21435-brierway-91351/unit-94/home/172522884,CRISNet,SR20142513,N,Y,34.4235425,-118.4720633
MLS Listing,,Single Family Residential,27668 Grassy Knoll Ln,Valencia,CA,91354,724990,4,2.5,CRSD - Valencia Creekside,2363,6319,2004,10,307,176,Active,,,http://www.redfin.com/CA/Santa-Clarita/27668-Grassy-Knoll-Ln-91354/home/8129020,CRISNet,SR20142430,N,Y,34.4429465,-118.5543718
MLS Listing,,Condo/Co-op,22932 Harvest Ml,Saugus,CA,91350,491990,3,2.5,RVLG - River Village,1473,1473,2020,10,334,375,Active,,,http://www.redfin.com/CA/Santa-Clarita/22932-Harvest-Mill-Cir-91350/home/172522873,CRMLS,CV20142515,N,Y,34.4259227,-118.5333466
MLS Listing,,Single Family Residential,24910 Wheeler Rd,Newhall,CA,91321,1549000,6,7.0,NEW1 - Newhall 1,5311,23711,1990,10,292,122,Active,,,http://www.redfin.com/CA/Newhall/24910-Wheeler-Rd-91321/home/17224284,CRISNet,SR20142415,N,Y,34.3711772,-118.5505701
MLS Listing,,Mobile/Manufactured Home,30000 sand canyon Rd #65,Canyon Country,CA,91387,139900,4,2.0,CAN1 - Canyon Country 1,,,1991,11,,,Active,,,http://www.redfin.com/CA/Canyon-Country/30000-Sand-Canyon-Rd-91387/unit-65/home/18972360,CRISNet,SR20141829,N,Y,34.4488226,-118.4203513
MLS Listing,,Single Family Residential,26923 Cape Cod Dr,Valencia,CA,91355,660000,3,3.0,VALB - Valencia Bridgeport,1796,32178,2001,11,367,218,Active,,,http://www.redfin.com/CA/Santa-Clarita/26923-Cape-Cod-Dr-91355/home/8113994,CRISNet,SR20140611,N,Y,34.427497,-118.564233
MLS Listing,,Single Family Residential,22344 Windriver Ct,Saugus,CA,91350,979000,5,5.0,RVLG - River Village,4513,8025,2014,11,217,140,Active,,,http://www.redfin.com/CA/Santa-Clarita/22344-Windriver-Ct-91350/home/22335422,CRISNet,SR20140329,N,Y,34.4237983,-118.5164339
MLS Listing,,Mobile/Manufactured Home,23500 the old Rd #49,Newhall,CA,91321,74900,2,2.0,NEW1 - Newhall 1,,,1978,11,,,Active,,,http://www.redfin.com/CA/Newhall/23500-The-Old-Rd-91321/unit-49/home/172518295,CRISNet,SR20141465,N,Y,34.3514394,-118.539185
MLS Listing,,Single Family Residential,27635 Sequoia Glen Dr,Valencia,CA,91354,600000,4,2.0,VALN - Valencia North,1624,7336,1978,11,369,,Active,,,http://www.redfin.com/CA/Santa-Clarita/27635-Sequoia-Glen-Dr-91354/home/5987535,CRISNet,SR20141352,N,Y,34.4519706,-118.5395114
MLS Listing,,Townhouse,23965 Arroyo Park Dr #96,Valencia,CA,91355,519000,2,2.0,VAL1 - Valencia 1,1537,571030,1985,11,338,335,Active,,,http://www.redfin.com/CA/Valencia/23965-Arroyo-Park-Dr-91355/unit-96/home/6069281,CRISNet,SR20141365,N,Y,34.4059553,-118.5557618
MLS Listing,,Single Family Residential,27485 Mulberry Ct,Saugus,CA,91350,599999,4,3.0,FEKS - Five Knolls,2241,38293,2017,11,268,215,Active,,,http://www.redfin.com/CA/Santa-Clarita/Mulberry-Ct-91351/home/143255640,CRISNet,SR20140446,N,Y,34.435277,-118.497872
MLS Listing,,Townhouse,28744 Jardineras Dr,Valencia,CA,91354,525000,3,2.5,Valencia West Creek,1440,35484,2018,11,365,255,Active,,,http://www.redfin.com/CA/Valencia/28744-Jardineras-Dr-91354/home/167293786,VCRDS,220007486,N,Y,34.459708,-118.562544
MLS Listing,,Single Family Residential,23933 Francisco Way,Valencia,CA,91354,795000,4,3.0,TSRO - Tesoro de Valle,2992,6523,2004,11,266,183,Active,,,http://www.redfin.com/CA/Santa-Clarita/23933-Francisco-Way-91354/home/22715627,CRISNet,SR20139875,N,Y,34.4654936,-118.5599094
MLS Listing,,Single Family Residential,28252 Cedar Ln,Saugus,CA,91350,544999,3,2.5,COPN - Copper Hill North,1726,485513,2001,11,316,85,Active,,,http://www.redfin.com/CA/Saugus/28252-Cedar-Ln-91350/home/8116037,CRISNet,SR20139706,N,Y,34.4567864,-118.5110838
MLS Listing,,Condo/Co-op,28314 Camino Del Arte Dr,Valencia,CA,91354,579900,3,3.0,VLWC - Valencia West Creek,1889,,2010,11,307,128,Active,,,http://www.redfin.com/CA/Valencia/28314-Camino-Del-Arte-Dr-91354/home/28913212,CRMLS,PW20141146,N,Y,34.452518,-118.562694
MLS Listing,,Single Family Residential,24001 Gamble House Ct,Valencia,CA,91355,624950,3,2.0,VAL1 - Valencia 1,1495,4832,1985,12,418,59,Active,,,http://www.redfin.com/CA/Santa-Clarita/24001-Gamble-House-Ct-91355/home/6068625,CRISNet,SR20139679,N,Y,34.4090939,-118.5546514
MLS Listing,,Single Family Residential,19230 Wellhaven St,Canyon Country,CA,91351,515000,5,2.0,Canyon Country 1,1918,6461,1961,12,269,,Active,,,http://www.redfin.com/CA/Canyon-Country/19230-Wellhaven-St-91351/home/5910606,TheMLS,20-603462,N,Y,34.4174359,-118.4716606
MLS Listing,,Single Family Residential,22918 Raintree Ln,Saugus,CA,91390,695000,3,2.0,COPN - Copper Hill North,1706,5474,1999,13,407,150,Active,,,http://www.redfin.com/CA/Santa-Clarita/22918-Raintree-Ln-91390/home/6385715,CRISNet,SR20139855,N,Y,34.4767668,-118.5352245
MLS Listing,,Single Family Residential,21154 Elder Creek Dr,Saugus,CA,91350,745000,4,3.0,BOUQ - Bouquet Canyon,2354,7583,1987,13,316,90,Active,,,http://www.redfin.com/CA/Santa-Clarita/21154-Elder-Creek-Dr-91350/home/6042661,CRISNet,SR20138150,N,Y,34.4424899,-118.5062857
MLS Listing,,Mobile/Manufactured Home,25000 Hawkbryn #37,Newhall,CA,91321,59000,2,1.0,NEW1 - Newhall 1,900,,1960,13,66,,Active,,,http://www.redfin.com/CA/Santa-Clarita/25000-Hawkbryn-Ave-91321/unit-37/home/172503647,CRISNet,SR20137321,N,Y,34.3715463,-118.5590062
MLS Listing,,Single Family Residential,27321 Woodlawn Ct,Valencia,CA,91354,910000,5,4.0,NBRG - Valencia Northbridge,3596,6442,1998,13,253,55,Active,,,http://www.redfin.com/CA/Santa-Clarita/27321-Woodlawn-Ct-91354/home/5945402,CRISNet,SR20134435,N,Y,34.4431307,-118.5418144
MLS Listing,,Single Family Residential,29266 Discovery Ridge Dr,Saugus,CA,91390,869999,5,4.0,COPN - Copper Hill North,3447,5303,2004,14,252,130,Active,,,http://www.redfin.com/CA/Santa-Clarita/29266-Discovery-Ridge-Dr-91390/home/8135075,CRISNet,SR20138790,N,Y,34.4796156,-118.5208581
MLS Listing,,Single Family Residential,25542 Via Dolarita,Valencia,CA,91355,739000,4,3.0,Valencia 1,2288,16007,1978,14,323,,Active,,,http://www.redfin.com/CA/Santa-Clarita/25542-Via-Dolarita-91355/home/6045488,TheMLS,20-604172,N,Y,34.3839009,-118.5579346
MLS Listing,,Mobile/Manufactured Home,27361 sierra Hwy #196,Canyon Country,CA,91351,195000,3,2.0,CAN1 - Canyon Country 1,,,2004,14,,,Active,,,http://www.redfin.com/CA/Canyon-Country/27361-Sierra-Hwy-91351/unit-196/home/40416848,CRISNet,SR20138702,N,Y,34.4093776,-118.4599125
MLS Listing,,Single Family Residential,23905 Lakeside Rd,Valencia,CA,91355,1299995,4,5.0,VALB - Valencia Bridgeport,3816,6253,2002,14,341,208,Active,,,http://www.redfin.com/CA/Santa-Clarita/23905-Lakeside-Rd-91355/home/8108779,CRMLS,OC20138441,N,Y,34.4271656,-118.555495
MLS Listing,,Single Family Residential,19108 Lauren Ln,Saugus,CA,91350,1199995,5,4.0,PLUM - Plum Canyon,2873,8347,2017,14,418,183,Active,,,http://www.redfin.com/CA/Santa-Clarita/19108-Lauren-Ln-91350/home/167301856,CRMLS,PW20138424,N,Y,34.4450545,-118.4703603
MLS Listing,,Single Family Residential,19114 Lauren Ln,Saugus,CA,91350,1249995,5,4.0,PLUM - Plum Canyon,2766,6972,2017,14,452,183,Active,,,http://www.redfin.com/CA/Santa-Clarita/19114-Lauren-Ln-91350/home/167301853,CRMLS,PW20138379,N,Y,34.445092,-118.4705454
MLS Listing,,Condo/Co-op,24535 Town Center Dr #6104,Valencia,CA,91355,649550,3,2.0,VAL1 - Valencia 1,1608,,2003,14,404,350,Active,,,http://www.redfin.com/CA/Santa-Clarita/24535-Town-Center-Dr-91355/unit-6104/home/12288409,CRISNet,SR20137118,N,Y,34.4188684,-118.563332
MLS Listing,,Condo/Co-op,22120 Barrington Way,Saugus,CA,91350,585000,5,4.0,RVLG - River Village,2440,23726,2017,15,240,319,Active,,,http://www.redfin.com/CA/Santa-Clarita/22120-Barrington-Way-91350/home/143942267,CRISNet,SR20131384,N,Y,34.4278497,-118.5102883
MLS Listing,,Single Family Residential,28040 Lacomb Dr,Canyon Country,CA,91351,599000,3,2.0,CAN1 - Canyon Country 1,1240,17766,1962,17,483,,Active,,,http://www.redfin.com/CA/Santa-Clarita/28040-Lacomb-Dr-91351/home/5902054,CRISNet,SR20136606,N,Y,34.4339205,-118.4780249
MLS Listing,,Condo/Co-op,24505 Town Center Dr #7103,Valencia,CA,91355,345000,1,1.0,VAL1 - Valencia 1,740,161602,2003,17,466,350,Active,,,http://www.redfin.com/CA/Santa-Clarita/24505-Town-Center-Dr-91355/unit-7103/home/12288414,CRISNet,SR20136486,N,Y,34.4188684,-118.563332
MLS Listing,,Condo/Co-op,24505 Town Center Dr #7214,Valencia,CA,91355,339800,1,1.0,VAL1 - Valencia 1,816,161613,2003,17,416,350,Active,,,http://www.redfin.com/CA/Santa-Clarita/24505-Town-Center-Dr-91355/unit-7214/home/12288423,CRISNet,SR20135014,N,Y,34.4188684,-118.563332
MLS Listing,,Condo/Co-op,24505 Town Center Dr #7402,Valencia,CA,91355,334990,1,1.0,VAL1 - Valencia 1,740,161613,2003,17,453,350,Active,,,http://www.redfin.com/CA/Santa-Clarita/24505-Town-Center-Dr-91355/unit-7402/home/12292933,CRISNet,SR20136338,N,Y,34.4188684,-118.563332
MLS Listing,,Single Family Residential,28982 Garnet Canyon Dr,Saugus,CA,91390,799000,5,3.0,COPN - Copper Hill North,2772,18275,2001,18,288,130,Active,,,http://www.redfin.com/CA/Santa-Clarita/28982-Garnet-Canyon-Dr-91390/home/8106274,CRISNet,SR20135607,N,Y,34.4726321,-118.5220439
MLS Listing,,Single Family Residential,26209 Bungalow Court Dr,Valencia,CA,91355,685000,4,3.0,VAL1 - Valencia 1,1905,4114,1985,18,360,59,Active,,,http://www.redfin.com/CA/Santa-Clarita/26209-Bungalow-Ct-Dr-91355/home/6068304,CRISNet,SR20131936,N,Y,34.4084399,-118.5559738
MLS Listing,,Vacant Land,0 San Francisquito Cyn Rd,Saugus,CA,91390,450000,,,COPN - Copper Hill North,,932135,,19,,,Active,,,http://www.redfin.com/CA/Agua-Dulce/San-Francisquito-Canyon-Rd-91390/home/146496090,CRISNet,SR20134949,N,Y,34.468861,-118.540858
MLS Listing,,Single Family Residential,28411 Hawks Ridge Dr,Canyon Country,CA,91351,840000,5,4.0,CAN1 - Canyon Country 1,3882,19890,2002,19,216,75,Active,,,http://www.redfin.com/CA/Canyon-Country/28411-Hawks-Ridge-Dr-91351/home/8109258,CRISNet,SR20132153,N,Y,34.4386752,-118.4669385
MLS Listing,,Single Family Residential,27746 Summer Grove Pl,Valencia,CA,91354,575000,3,2.5,CRSD - Valencia Creekside,1623,437945,2004,19,354,174,Active,,,http://www.redfin.com/CA/Santa-Clarita/27746-Summer-Grove-Pl-91354/home/8141754,CRMLS,TR20131764,N,Y,34.446557,-118.556486
MLS Listing,,Condo/Co-op,16834 Shinedale Dr,Canyon Country,CA,91387,529000,4,2.75,CAN2 - Canyon Country 2,2050,7670,1978,19,258,210,Active,,,http://www.redfin.com/CA/Santa-Clarita/16834-Shinedale-Dr-91387/home/6026458,CRISNet,SR20134029,N,Y,34.4229881,-118.429762
MLS Listing,,Single Family Residential,22439 Guadilamar Dr,Saugus,CA,91350,590000,3,2.0,BOUQ - Bouquet Canyon,1435,10646,1959,20,411,,Active,,,http://www.redfin.com/CA/Santa-Clarita/22439-Guadilamar-Dr-91350/home/5925946,CRISNet,SR20133943,N,Y,34.4470059,-118.5297517
MLS Listing,,Condo/Co-op,26109 Mcbean #58,Valencia,CA,91355,473000,2,2.0,VAL1 - Valencia 1,1154,571035,1985,20,410,335,Active,,,http://www.redfin.com/CA/Valencia/26109-McBean-Pkwy-91355/unit-58/home/6068792,CRISNet,SR20133247,N,Y,34.4059553,-118.5557618
MLS Listing,,Single Family Residential,28518 High Ridge Dr,Saugus,CA,91390,635000,3,3.0,COPN - Copper Hill North,2141,6835,2002,21,297,,Active,,,http://www.redfin.com/CA/Santa-Clarita/28518-High-Ridge-Dr-91390/home/8121261,CRISNet,SR20130650,N,Y,34.4619155,-118.5027956
MLS Listing,,Mobile/Manufactured Home,24833 railroad Ave #2,Newhall,CA,91321,45000,2,2.0,NEW1 - Newhall 1,,,1978,21,,,Active,,,http://www.redfin.com/CA/Santa-Clarita/24833-Railroad-Ave-91321/unit-2/home/172389154,CRISNet,SR20132615,N,Y,34.3865626,-118.5329898
MLS Listing,,Townhouse,15919 Rosehaven Ln,Canyon Country,CA,91387,462500,3,2.0,CAN2 - Canyon Country 2,1090,207611,1982,21,424,325,Active,,,http://www.redfin.com/CA/Santa-Clarita/15919-Rosehaven-Ln-91387/home/6022160,CRISNet,SR20132000,N,Y,34.4288426,-118.4141137
MLS Listing,,Single Family Residential,27823 Parkvale Dr,Saugus,CA,91350,580000,4,2.0,BOUQ - Bouquet Canyon,1650,6562,1965,21,352,,Active,,,http://www.redfin.com/CA/Santa-Clarita/27823-Parkvale-Dr-91350/home/5934369,CRISNet,SR20132234,N,Y,34.4482527,-118.5034798
MLS Listing,,Condo/Co-op,24113 Del Monte Dr #31,Valencia,CA,91355,415000,2,2.0,VAL1 - Valencia 1,1000,842295,1990,22,415,300,Active,,,http://www.redfin.com/CA/Santa-Clarita/24113-W-Del-Monte-Dr-91355/unit-31/home/6074523,CRISNet,SR20131994,N,Y,34.410723,-118.5605659
MLS Listing,,Single Family Residential,19404 Delight St,Canyon Country,CA,91351,569000,3,2.0,CAN1 - Canyon Country 1,1492,6186,1961,22,381,,Active,,,http://www.redfin.com/CA/Canyon-Country/19404-Delight-St-91351/home/5909172,CRISNet,SR20131351,N,Y,34.4235917,-118.474398
MLS Listing,,Single Family Residential,29131 Starwood Pl,Saugus,CA,91390,899000,4,3.5,COPN - Copper Hill North,3436,6168,2003,23,262,150,Active,,,http://www.redfin.com/CA/Santa-Clarita/29131-Starwood-Pl-91390/home/8111100,i-Tech MLS,320002247,N,Y,34.4790549,-118.5345296
MLS Listing,,Single Family Residential,24336 Jennifer Pl,Newhall,CA,91321,609000,4,2.0,NEW1 - Newhall 1,1698,6289,1976,24,359,,Active,,,http://www.redfin.com/CA/Santa-Clarita/24336-Jennifer-Pl-91321/home/5989003,CRISNet,SR20130752,N,Y,34.373018,-118.5600322
MLS Listing,,Condo/Co-op,27642 Susan Beth Way Unit L,Saugus,CA,91350,295000,2,1.0,BOUQ - Bouquet Canyon,870,45367,1985,25,339,335,Active,,,http://www.redfin.com/CA/Santa-Clarita/27642-Susan-Beth-Way-91350/unit-L/home/6375967,CRISNet,SR20130323,N,Y,34.444578,-118.510292
MLS Listing,,Townhouse,16668 Minter Ct,Canyon Country,CA,91387,485000,4,3.0,CAN2 - Canyon Country 2,1693,130085,1980,26,286,200,Active,,,http://www.redfin.com/CA/Santa-Clarita/16668-Minter-Ct-91387/home/6024787,CRISNet,SR20129555,N,Y,34.4247918,-118.4276511
MLS Listing,,Single Family Residential,16003 Baker Canyon Rd,Santa Clarita,CA,91390,499000,3,2.0,Canyon Country 2,1600,27931,1951,26,312,,Active,,,http://www.redfin.com/CA/Santa-Clarita/16003-Baker-Canyon-Rd-91390/home/6372109,TheMLS,20-598998,N,Y,34.4544505,-118.4150552
MLS Listing,,Single Family Residential,29538 Hacienda Dr,Valencia,CA,91354,1495000,6,5.5,TSRO - Tesoro de Valle,5020,8909,2004,26,298,185,Active,,,http://www.redfin.com/CA/Santa-Clarita/29538-Hacienda-Dr-91354/home/8134950,CRISNet,SR20127165,N,Y,34.4742211,-118.5607618
MLS Listing,,Single Family Residential,23733 Noble Fir Ct,Valencia,CA,91354,709000,2,2.5,BCRO - Valencia Belcaro,2287,3778,2004,27,310,346,Active,,,http://www.redfin.com/CA/Santa-Clarita/23733-Noble-Fir-Ct-91354/home/8148228,CRISNet,SR20128674,N,Y,34.459359,-118.55092
MLS Listing,,Single Family Residential,28259 Enderly St,Canyon Country,CA,91351,575000,4,2.0,CAN1 - Canyon Country 1,1450,10411,1964,27,397,,Active,,,http://www.redfin.com/CA/Santa-Clarita/28259-Enderly-St-91351/home/5900324,CRISNet,SR20128612,N,Y,34.4377343,-118.4785268
MLS Listing,,Condo/Co-op,24545 Town Center Dr #5110,Valencia,CA,91355,355000,1,1.0,VAL1 - Valencia 1,740,161613,2003,27,480,350,Active,,,http://www.redfin.com/CA/Santa-Clarita/24545-Town-Center-Dr-91355/unit-5110/home/12288457,CRISNet,SR20128472,N,Y,34.4198665,-118.5644636
MLS Listing,,Single Family Residential,27459 Spruce Ct,Saugus,CA,91350,589000,4,3.0,FEKS - Five Knolls,1895,43944,2016,27,311,220,Active,,,http://www.redfin.com/CA/Santa-Clarita/27459-Spruce-Ct-91350/home/143516346,CRISNet,SR20128324,N,Y,34.4347908,-118.4970939
MLS Listing,,Townhouse,18130 Flynn Dr #61405,Canyon Country,CA,91387,425000,2,2.0,CAN1 - Canyon Country 1,1225,74197,1999,27,347,300,Active,,,http://www.redfin.com/CA/Canyon-Country/18130-Flynn-Dr-91387/unit-61405/home/6039522,CRISNet,SR20128093,N,Y,34.405454,-118.453067
MLS Listing,,Single Family Residential,29321 Hacienda Ranch Ct,Valencia,CA,91354,949000,5,5.0,TSRO - Tesoro de Valle,4005,11039,2004,28,237,185,Active,,,http://www.redfin.com/CA/Valencia/29321-Hacienda-Ranch-Ct-91354/home/22929757,CRMLS,PW20127486,N,Y,34.471485,-118.566872
MLS Listing,,Single Family Residential,19258 Bension Dr,Saugus,CA,91350,1225000,5,4.5,PLUM - Plum Canyon,4307,8133,2015,28,284,168,Active,,,http://www.redfin.com/CA/Santa-Clarita/19258-Bension-Dr-91350/home/22696267,CRISNet,SR20125120,N,Y,34.4506697,-118.4718431
MLS Listing,,Single Family Residential,25226 Vermont Dr,Newhall,CA,91321,465000,3,2.0,NEW1 - Newhall 1,1400,7519,1959,28,332,,Active,,,http://www.redfin.com/CA/Santa-Clarita/25226-Vermont-Dr-91321/home/6003377,CRISNet,SR20126893,N,Y,34.3775564,-118.5518698
MLS Listing,,Single Family Residential,19546 Eleven Ct,Newhall,CA,91321,569000,2,2.0,NEW4 - Newhall 4,1460,425795,2004,29,390,450,Active,,,http://www.redfin.com/CA/Santa-Clarita/19546-Eleven-Ct-91321/home/8146838,CRISNet,SR20110626,N,Y,34.4046122,-118.4782263
MLS Listing,,Mobile/Manufactured Home,18145 Soledad Canyon Rd #16,Canyon Country,CA,91387,145000,2,2.0,CAN2 - Canyon Country 2,1060,,2015,29,137,,Active,,,http://www.redfin.com/CA/Canyon-Country/18145-Soledad-Canyon-Rd-91387/unit-16/home/113157799,CRISNet,SR20126393,N,Y,34.4165871,-118.44776
MLS Listing,,Condo/Co-op,26103 Mcbean #132,Valencia,CA,91355,350000,1,1.0,VAL1 - Valencia 1,696,571035,1985,29,503,335,Active,,,http://www.redfin.com/CA/Valencia/26103-McBean-Pkwy-91355/unit-132/home/6069023,CRISNet,SR20121408,N,Y,34.4059553,-118.5557618
MLS Listing,,Mobile/Manufactured Home,21409 Tumbleweed Way #0,Saugus,CA,91350,138500,3,2.0,BOUQ - Bouquet Canyon,1404,,1998,29,99,,Active,,,http://www.redfin.com/CA/Santa-Clarita/21409-Tumbleweed-Way-91350/unit-21/home/22142739,CRISNet,SR20126020,N,Y,34.4196227,-118.5120061
MLS Listing,,Single Family Residential,19318 Fairweather St,Canyon Country,CA,91351,530000,3,2.0,CAN1 - Canyon Country 1,1483,6435,1961,29,357,,Active,,,http://www.redfin.com/CA/Santa-Clarita/19318-Fairweather-St-91351/home/5905719,CRISNet,SR20125031,N,Y,34.4243501,-118.4730521
MLS Listing,,Townhouse,23916 Calle Del Sol Dr,Valencia,CA,91354,539900,3,3.0,VLWC - Valencia West Creek,1490,730529,2015,29,362,236,Active,,,http://www.redfin.com/CA/Valencia/23916-Calle-Del-Sol-Dr-91354/home/17232648,CRISNet,SR20125784,N,Y,34.461608,-118.5565856
MLS Listing,,Single Family Residential,28405 Rock Canyon Dr,Saugus,CA,91390,699950,4,2.0,COPN - Copper Hill North,2084,7853,2000,32,336,,Active,,,http://www.redfin.com/CA/Santa-Clarita/28405-Rock-Canyon-Dr-91390/home/8106208,CRISNet,SR20124426,N,Y,34.4614515,-118.5145182
MLS Listing,,Condo/Co-op,26353 Oak Plain Dr Unit B,Newhall,CA,91321,292500,2,2.0,NEW4 - Newhall 4,909,294152,1973,32,322,460,Active,,,http://www.redfin.com/CA/Newhall/26353-Oak-Plain-Dr-91321/unit-B/home/6080027,CRISNet,SR20124541,N,Y,34.4014381,-118.4788863
MLS Listing,,Condo/Co-op,25730 Player Dr Unit S4,Valencia,CA,91355,360000,2,2.0,VAL1 - Valencia 1,948,676061,1971,32,380,404,Active,,,http://www.redfin.com/CA/Santa-Clarita/25730-Player-Dr-91355/unit-S4/home/6044540,CRISNet,SR20123458,N,Y,34.3892963,-118.5620825
MLS Listing,,Single Family Residential,23239 Barnacle Ln,Valencia,CA,91355,649900,4,2.5,VALB - Valencia Bridgeport,2167,2734,2002,32,300,210,Active,,,http://www.redfin.com/CA/Santa-Clarita/23239-Barnacle-Ln-91355/home/8109171,CRMLS,IV20124353,N,Y,34.4275752,-118.5423589
MLS Listing,,Condo/Co-op,26827 Circle Of The Oaks,Newhall,CA,91321,330000,2,2.0,NEW4 - Newhall 4,1254,352420,1965,33,263,335,Active,,,http://www.redfin.com/CA/Newhall/26827-Circle-of-the-Oaks-91321/home/6077653,CRISNet,SR20123412,N,Y,34.4057507,-118.4694529
MLS Listing,,Single Family Residential,23922 Via Danza,Valencia,CA,91355,659900,4,2.0,VAL1 - Valencia 1,1743,5062,1968,34,379,55,Active,,,http://www.redfin.com/CA/Valencia/23922-Via-Danza-91355/home/6056062,CRISNet,SR20122766,N,Y,34.3806385,-118.5533746
MLS Listing,,Townhouse,23730 Hickory Ct,Valencia,CA,91354,675000,3,2.5,BCRO - Valencia Belcaro,2287,3396,2004,35,295,346,Active,,,http://www.redfin.com/CA/Santa-Clarita/23730-Hickory-Ct-91354/home/8131407,CRISNet,SR20121071,N,Y,34.458499,-118.55063
MLS Listing,,Single Family Residential,27846 Caraway Ln,Saugus,CA,91350,585000,4,2.0,BOUQ - Bouquet Canyon,1400,5480,1980,36,418,65,Active,,,http://www.redfin.com/CA/Santa-Clarita/27846-Caraway-Ln-91350/home/6376880,CRISNet,SR20121084,N,Y,34.4492074,-118.5132146
MLS Listing,,Mobile/Manufactured Home,20401 Soledad Cyn Rd #689,Canyon Country,CA,91351,139900,4,2.0,CAN1 - Canyon Country 1,1344,1344,2005,36,104,,Active,,,http://www.redfin.com/CA/Canyon-Country/20401-Soledad-Canyon-Rd-91351/unit-689/home/17493525,CRISNet,SR20121091,N,Y,34.421757,-118.4902172
MLS Listing,,Single Family Residential,27633 Hermes Ln,Canyon Country,CA,91351,559940,3,2.75,CAN1 - Canyon Country 1,1759,167941,2001,36,318,165,Active,,,http://www.redfin.com/CA/Santa-Clarita/27633-Hermes-Ln-91351/home/8108551,CRISNet,SR20119758,N,Y,34.421746,-118.465895
MLS Listing,,Single Family Residential,24479 Stonechat Ct,Valencia,CA,91355,929000,4,3.0,VSUM - Valencia Summit,2883,6657,1989,36,322,50,Active,,,http://www.redfin.com/CA/Santa-Clarita/24479-Stonechat-Ct-91355/home/6072870,CRISNet,SR20120248,N,Y,34.4084751,-118.5647744
MLS Listing,,Mobile/Manufactured Home,21206 Blue Curl Way #0,Canyon Country,CA,91351,120000,2,2.0,CAN1 - Canyon Country 1,1440,,1977,38,83,,Active,,,http://www.redfin.com/CA/Canyon-Country/21206-Blue-Curl-Way-91351/unit-0/home/17959670,CRISNet,SR20119876,N,Y,34.4208224,-118.5061432
MLS Listing,,Single Family Residential,28825 Loretta Ln,Canyon Country,CA,91387,499900,3,3.0,CAN3 - Canyon Country 3,1838,207611,1982,39,272,325,Active,,,http://www.redfin.com/CA/Santa-Clarita/28825-Loretta-Ln-91387/home/6022133,CRISNet,SR20117929,N,Y,34.4293706,-118.4144668
MLS Listing,,Vacant Land,0 Esguerra Rd,Saugus,CA,,150000,,,BOUQ - Bouquet Canyon,,1995919,,39,,,Active,,,http://www.redfin.com/CA/Santa-Clarita/Esguerra-Rd-91390/home/144287940,CRISNet,SR20118997,N,Y,34.465641,-118.44483
MLS Listing,,Mobile/Manufactured Home,27361 Sierra Hwy #65,Canyon Country,CA,91351,165000,3,2.0,CAN1 - Canyon Country 1,,,1999,39,,,Active,,,http://www.redfin.com/CA/Santa-Clarita/27361-Sierra-Hwy-91351/unit-65/home/172183453,CRISNet,SR20118666,N,Y,34.4102003,-118.4628645
MLS Listing,,Single Family Residential,28335 Rodgers Dr,Saugus,CA,91350,695950,5,3.0,PLUM - Plum Canyon,2467,8437,1995,40,282,,Active,,,http://www.redfin.com/CA/Santa-Clarita/28335-Rodgers-Dr-91350/home/5975570,CRISNet,SR20117034,N,Y,34.4514628,-118.4897037
MLS Listing,,Single Family Residential,21102 Mill Ridge Dr,Saugus,CA,91350,899500,4,3.0,BOUQ - Bouquet Canyon,2796,24125,1979,41,322,90,Active,,,http://www.redfin.com/CA/Santa-Clarita/21102-Mill-Ridge-Dr-91350/home/6042611,CRISNet,SR20117488,N,Y,34.4411144,-118.5043901
MLS Listing,,Single Family Residential,21113 Oakleaf Canyon Dr,Newhall,CA,91321,729950,5,3.0,NEW5 - Newhall Area 5,3185,5811,2001,41,229,190,Active,,,http://www.redfin.com/CA/Newhall/21113-Oakleaf-Canyon-Dr-91321/home/8112778,CRISNet,SR20116981,N,Y,34.3725022,-118.5054869
MLS Listing,,Townhouse,28952 Rue Daniel,Canyon Country,CA,91387,459900,3,2.0,CAN2 - Canyon Country 2,1090,335551,1983,41,422,325,Active,,,http://www.redfin.com/CA/Santa-Clarita/28952-Rue-Daniel-91387/home/6022886,CRISNet,SR20117116,N,Y,34.4305605,-118.4088938
MLS Listing,,Single Family Residential,18602 Kimbrough St,Canyon Country,CA,91351,529000,4,2.0,CAN1 - Canyon Country 1,1715,7086,1963,41,308,,Active,,,http://www.redfin.com/CA/Santa-Clarita/18602-Kimbrough-St-91351/home/5913082,CRISNet,SR20113967,N,Y,34.4237683,-118.460551
MLS Listing,,Single Family Residential,23810 Cherry Ct,Valencia,CA,91354,760000,2,3.0,BCRO - Valencia Belcaro,2430,3831,2004,41,313,389,Active,,,http://www.redfin.com/CA/Santa-Clarita/23810-Cherry-Ct-91354/home/8131345,CRISNet,SR20117160,N,Y,34.4576044,-118.5516418
MLS Listing,,Single Family Residential,28443 Meadowlark Ct,Valencia,CA,91354,519888,2,2.5,NPRK - Valencia Northpark,1234,68030,1999,42,421,180,Active,,,http://www.redfin.com/CA/Valencia/28443-Meadowlark-Ct-91354/home/8104611,CRISNet,SR20116136,N,Y,34.465243,-118.5449759
MLS Listing,,Single Family Residential,18711 Nathan Hill Dr,Canyon Country,CA,91351,600000,3,2.5,CAN1 - Canyon Country 1,2122,73758,1990,43,283,110,Active,,,http://www.redfin.com/CA/Santa-Clarita/18711-W-Nathan-Hill-Dr-91351/home/5913402,CRISNet,SR20115379,N,Y,34.421106,-118.4622225
MLS Listing,,Mobile/Manufactured Home,27361 Sierra Hwy #290,Canyon Country,CA,91351,115000,2,2.0,CAN1 - Canyon Country 1,,,1971,44,,,Active,,,http://www.redfin.com/CA/Santa-Clarita/27361-Sierra-Hwy-91351/unit-290/home/65547155,CRISNet,SR20114217,N,Y,34.4102003,-118.4628645
MLS Listing,,Townhouse,27655 Ironstone Dr #4,Canyon Country,CA,91387,399950,3,3.0,Canyon Country 2,1268,76243,1985,47,315,338,Active,,,http://www.redfin.com/CA/Santa-Clarita/27655-Ironstone-Dr-91387/unit-4/home/6038107,VCRDS,220005926,N,Y,34.4159384,-118.449483
MLS Listing,,Vacant Land,9999 Vasquez Cyn,Canyon Country,CA,91351,800000,,,Canyon Country 1,,1777248,,48,,,Active,,,http://www.redfin.com/CA/Canyon-Country/9999-Vasquez-Canyon-Rd-91351/home/172046939,VCRDS,220005883,N,Y,34.4543307,-118.4203014
MLS Listing,,Vacant Land,0 Teller Ave,Agua Dulce,CA,91350,80000,,,699 - Not Defined,,290545,,49,,,Active,,,http://www.redfin.com/CA/Agua-Dulce/0-Teller-AVE-91350/home/172041942,CRMLS,SW20111076,N,Y,34.4338228,-118.5155901
MLS Listing,,Vacant Land,0 Vasquez Canyon Rd,Valencia,CA,91354,5000000,,,Bouquet Canyon,,4878720,,49,,,Active,,,http://www.redfin.com/CA/Santa-Clarita/Vasquez-Canyon-Rd-91351/home/144277883,VCRDS,220005836,N,Y,34.473238,-118.45448
MLS Listing,,Single Family Residential,24214 Oak Vale Dr,Valencia,CA,91355,999999,4,3.0,VAL1 - Valencia 1,3694,7588,1985,50,271,42,Active,,,http://www.redfin.com/CA/Santa-Clarita/24214-Oak-Vale-Dr-91355/home/6044983,PFAR,820002105,N,Y,34.3870842,-118.5582538
MLS Listing,,Vacant Land,1 Vac/Vic San Francisquito,Green Valley,CA,91350,15000,,,LEL - Lake Elizabeth,,4792,,50,,,Active,,,http://www.redfin.com/CA/Green-Valley/1-Vac-Vic-San-Francisquito-91350/home/172036228,CRISNet,SR20110492,N,Y,34.4338228,-118.5155901
MLS Listing,,Condo/Co-op,18209 Sierra #19,Canyon Country,CA,91351,280000,2,2.0,CAN1 - Canyon Country 1,795,312806,1987,52,352,330,Active,,,http://www.redfin.com/CA/Santa-Clarita/18209-Sierra-Hwy-91351/unit-19/home/5913779,CRISNet,SR20109091,N,Y,34.4210025,-118.4547869
MLS Listing,,Condo/Co-op,26832 Circle Of The Oaks,Newhall,CA,91321,395000,2,2.0,Newhall 4,1254,352420,1965,53,315,335,Active,,,http://www.redfin.com/CA/Santa-Clarita/26832-Circle-of-the-Oaks-91321/home/6077565,VCRDS,220005700,N,Y,34.4056417,-118.4689023
MLS Listing,,Single Family Residential,29830 Wisteria Valley Rd,Canyon Country,CA,91387,649900,6,2.0,Canyon Country 2,1959,8056,1970,54,332,,Active,,,http://www.redfin.com/CA/Santa-Clarita/29830-Wistaria-Valley-Rd-91387/home/6047839,TheMLS,20-586390,N,Y,34.4480262,-118.3995259
MLS Listing,,Condo/Co-op,19738 Spanish Oak Dr,Newhall,CA,91321,297500,2,2.0,NEW4 - Newhall 4,960,270955,1971,55,310,445,Active,,,http://www.redfin.com/CA/Santa-Clarita/19738-Spanish-Oak-Dr-91321/home/6079835,CRISNet,SR20106267,N,Y,34.401383,-118.481532
MLS Listing,,Townhouse,27122 Crossglade Ave #6,Canyon Country,CA,91351,349900,2,1.5,CAN1 - Canyon Country 1,1114,843622,1980,55,314,350,Active,,,http://www.redfin.com/CA/Santa-Clarita/27122-Crossglade-Ave-91351/unit-6/home/5916133,CRISNet,SR20105813,N,Y,34.4136127,-118.4671181
MLS Listing,,Single Family Residential,24240 Bella Ct,Newhall,CA,91321,860000,6,4.0,NEW1 - Newhall 1,4035,5809,1985,56,213,190,Active,,,http://www.redfin.com/CA/Newhall/24240-Bella-Ct-91321/home/6002447,CRISNet,SR20105210,N,Y,34.3628419,-118.5426409
MLS Listing,,Mobile/Manufactured Home,26603 Cattail Way,Canyon Country,CA,91351,219000,3,2.0,RBGL - Rainbow Glen,1344,,2004,57,163,,Active,,,http://www.redfin.com/CA/Santa-Clarita/26603-Cattail-Way-91351/unit-313/home/22141798,CRISNet,SR20105104,N,Y,34.4218584,-118.5066988
MLS Listing,,Vacant Land,1 A,Castaic,CA,,35000,,,699 - Not Defined,,5700,,57,,,Active,,,http://www.redfin.com/CA/Valencia/26017-Huntington-Ln-91355/home/171961372,CRMLS,TR20104783,N,Y,34.4373638,-118.5911528
MLS Listing,,Vacant Land,0 Hydrangea,Canyon Country,CA,91387,1199000,,,CAN1 - Canyon Country 1,,1407373,,58,,,Active,,,http://www.redfin.com/CA/Santa-Clarita/Hydrangea-Way-91387/home/144913318,CRISNet,SR20104051,N,Y,34.45385,-118.39109
MLS Listing,,Single Family Residential,24105 Clearbank Ln,Newhall,CA,91321,875000,4,3.5,NEW1 - Newhall 1,3140,43983,1984,60,279,215,Active,,,http://www.redfin.com/CA/Newhall/24105-Clearbank-Ln-91321/home/6002680,CRISNet,SR20102602,N,Y,34.3600903,-118.54129
MLS Listing,,Mobile/Manufactured Home,20401 Soledad Canyon Rd #529,Canyon Country,CA,91351,125900,4,2.0,CAN1 - Canyon Country 1,1387,,1997,60,91,,Active,,,http://www.redfin.com/CA/Canyon-Country/20401-Soledad-Canyon-Rd-91351/unit-529/home/170003539,CRISNet,SR20101706,N,Y,34.4222741,-118.4927463
MLS Listing,,Single Family Residential,19553 Eleven Ct,Newhall,CA,91321,553000,3,2.0,NEW4 - Newhall 4,1591,425795,2004,62,348,450,Active,,,http://www.redfin.com/CA/Santa-Clarita/19553-Eleven-Ct-91321/home/8145915,CRISNet,SR20101278,N,Y,34.4050608,-118.4782666
MLS Listing,,Vacant Land,55555 Vac/Steele St Pav /Vic High Si,Agua Dulce,CA,91350,559900,,,ADUL - Agua Dulce,,3494702,,62,,,Active,,,http://www.redfin.com/CA/Agua-Dulce/55555-Vac-Steele-St-Pav-Vic-High-Si-91350/home/167211000,CRISNet,SR20100743,N,Y,34.4338228,-118.5155901
MLS Listing,,Single Family Residential,28917 Mirada Circulo,Valencia,CA,91354,625000,3,3.0,TSRO - Tesoro de Valle,2129,82342,2003,63,294,320,Active,,,http://www.redfin.com/CA/Santa-Clarita/28917-Mirada-Circulo-91354/home/22929462,CRISNet,SR20100661,N,Y,34.465005,-118.556087
MLS Listing,,Vacant Land,0 Escondido Canyon Rd/Vic Ave,Agua Dulce,CA,91350,245000,,,ADUL - Agua Dulce,,444709,,64,,,Active,,,http://www.redfin.com/CA/Agua-Dulce/0-Escondido-Canyon-Rd-Vic-AVE-91350/home/171850244,CRISNet,SR20099353,N,Y,34.4338228,-118.5155901
MLS Listing,,Single Family Residential,24277 Palo Verde Dr,Valencia,CA,91354,1025000,5,5.0,TSRO - Tesoro de Valle,4086,7932,2004,67,251,183,Active,,,http://www.redfin.com/CA/Santa-Clarita/24277-Palo-Verde-Dr-91354/home/8135010,CRISNet,SR20096467,N,Y,34.4739877,-118.5637941
MLS Listing,,Single Family Residential,26447 Marsala Dr,Valencia,CA,91355,695000,3,2.0,VSUM - Valencia Summit,1571,5215,1988,67,442,50,Active,,,http://www.redfin.com/CA/Santa-Clarita/26447-Marsala-Dr-91355/home/6073357,CRISNet,SR20089720,N,Y,34.4103461,-118.5633609
MLS Listing,,Townhouse,26803 Monet Ln,Valencia,CA,91355,785000,3,2.5,NBRG - Valencia Northbridge,2093,139111,1998,67,375,388,Active,,,http://www.redfin.com/CA/Santa-Clarita/26803-Monet-Ln-91355/home/6075375,CRISNet,SR20097554,N,Y,34.421162,-118.56873
MLS Listing,,Single Family Residential,28139 Caraway Ln,Saugus,CA,91350,759500,3,2.5,BOUQ - Bouquet Canyon,2170,19064,1987,67,350,,Active,,,http://www.redfin.com/CA/Santa-Clarita/28139-Caraway-Ln-91350/home/6381219,CRISNet,SR20098221,N,Y,34.454498,-118.5190337
MLS Listing,,Single Family Residential,26320 Long Oak Dr,Newhall,CA,91321,489900,3,2.0,Newhall 4,1479,655073,1970,67,331,411,Active,,,http://www.redfin.com/CA/Newhall/26320-Long-Oak-Dr-91321/home/6079568,VCRDS,220005138,N,Y,34.4023987,-118.481984
MLS Listing,,Single Family Residential,23545 Arlen Dr,Newhall,CA,91321,649900,3,2.0,NEW1 - Newhall 1,1792,8301,1975,69,363,,Active,,,http://www.redfin.com/CA/Newhall/23545-Arlen-Dr-91321/home/6006137,CRISNet,SR20096424,N,Y,34.3728551,-118.5433932
MLS Listing,,Townhouse,28291 Canterbury Ct #139,Valencia,CA,91354,475000,3,3.0,NPRK - Valencia Northpark,1635,55342,2002,69,291,285,Active,,,http://www.redfin.com/CA/Santa-Clarita/28291-Canterbury-Ct-91354/unit-139/home/8116324,CRISNet,SR20090450,N,Y,34.4613778,-118.5474378
MLS Listing,,Condo/Co-op,26812 Circle Of The Oaks,Newhall,CA,91321,379900,2,1.75,NEW4 - Newhall 4,1141,352420,1965,70,333,335,Active,,,http://www.redfin.com/CA/Santa-Clarita/26812-Circle-of-the-Oaks-91321/home/6077538,CRISNet,SR20095144,N,Y,34.4060482,-118.4675618
MLS Listing,,Mobile/Manufactured Home,18540 Soledad Canyon Rd #68,Canyon Country,CA,91351,79950,2,2.0,CAN1 - Canyon Country 1,1120,,1988,70,71,,Active,,,http://www.redfin.com/CA/Santa-Clarita/18540-Soledad-Canyon-Rd-91351/unit-68/home/171799497,CRISNet,SR20095976,N,Y,34.414448,-118.458242
MLS Listing,,Single Family Residential,26296 Park View Rd,Valencia,CA,91355,968750,4,4.0,Valencia Summit,3108,10897,1988,71,312,50,Active,,,http://www.redfin.com/CA/Santa-Clarita/26296-Park-View-Rd-91355/home/6072465,TheMLS,20-580316,N,Y,34.4092513,-118.559599
MLS Listing,,Single Family Residential,21751 Placeritos Blvd,Newhall,CA,91321,1825000,6,5.5,PLAC - Placerita Canyon,5491,52031,1949,76,332,,Active,,,http://www.redfin.com/CA/Newhall/21751-Placeritos-Blvd-91321/home/6011020,CRISNet,SR20090615,N,Y,34.385193,-118.5188284
MLS Listing,,Single Family Residential,25172 Karie Ln,Saugus,CA,91350,1459900,4,3.0,CJRC - Circle J Ranch,4166,58529,1988,77,350,125,Active,,,http://www.redfin.com/CA/Santa-Clarita/25172-Karie-Ln-91350/home/6011370,CRISNet,SR20090319,N,Y,34.393661,-118.5118043
MLS Listing,,Mobile/Manufactured Home,26410 DOVEWEED Way #52,Saugus,CA,91350,185000,2,2.0,699 - Not Defined,1344,,1979,77,138,,Active,,,http://www.redfin.com/CA/Santa-Clarita/26410-Doveweed-Way-91350/unit-52/home/170426179,CRISNet,SR20090224,N,Y,34.4188359,-118.5107123
MLS Listing,,Single Family Residential,23206 Via Calisero,Valencia,CA,91355,650000,4,3.0,VAL1 - Valencia 1,2192,6374,1969,82,297,,Active,,,http://www.redfin.com/CA/Santa-Clarita/23206-Via-Calisero-91355/home/6051415,CRISNet,SR20086863,N,Y,34.3851691,-118.5414724
MLS Listing,,Single Family Residential,26038 Charing Cross Rd,Valencia,CA,91355,1200000,3,3.0,VSUM - Valencia Summit,3089,10961,1986,83,388,50,Active,,,http://www.redfin.com/CA/Santa-Clarita/26038-Charing-Cross-Rd-91355/home/6070144,CRISNet,SR20085260,N,Y,34.4003457,-118.5580714
MLS Listing,,Condo/Co-op,25400 Parkwood Ln,Saugus,CA,91350,490000,3,2.5,CJRC - Circle J Ranch,1684,9599,2001,84,291,275,Active,,,http://www.redfin.com/CA/Santa-Clarita/Parkwood-Ln-Unknown/home/8109404,CRISNet,SR20085851,N,Y,34.397334,-118.536312
MLS Listing,,Single Family Residential,24012 Rockridge Ct,Valencia,CA,91355,589000,2,2.0,VAL1 - Valencia 1,1259,3508,1985,85,468,82,Active,,,http://www.redfin.com/CA/Santa-Clarita/24012-Rockridge-Ct-91355/home/6068250,CRISNet,SR20083728,N,Y,34.4096223,-118.5560194
MLS Listing,,Vacant Land,28314 Hillfield Ln,Canyon Country,CA,,200000,,,CAN1 - Canyon Country 1,,11891,,85,,,Active,,,http://www.redfin.com/CA/Santa-Clarita/28314-Hillfield-Ln-91351/home/161427367,CRISNet,SR20084999,N,Y,34.4282957,-118.4467377
MLS Listing,,Single Family Residential,27300 Sandstone Pl,Saugus,CA,91350,639000,4,3.0,FEKS - Five Knolls,2563,32580,2017,85,249,220,Active,,,http://www.redfin.com/CA/Santa-Clarita/27300-Sandstone-Pl-91350/home/143519001,CRISNet,SR20080598,N,Y,34.432069,-118.4968996
MLS Listing,,Single Family Residential,26478 Oak Highland Dr,Newhall,CA,91321,487500,3,2.0,NEW4 - Newhall 4,1479,572861,1969,85,330,411,Active,,,http://www.redfin.com/CA/Santa-Clarita/26478-Oak-Highland-Dr-91321/home/6079193,CRISNet,SR20084038,N,Y,34.4028862,-118.4782033
MLS Listing,,Mobile/Manufactured Home,20401 Soledad Cyn #375,Canyon Country,CA,91351,139900,3,2.0,CAN1 - Canyon Country 1,,,2005,91,,,Active,,,http://www.redfin.com/CA/Canyon-Country/20401-Soledad-Canyon-Rd-91351/unit-375/home/171441191,CRISNet,SR20081033,N,Y,34.4222741,-118.4927463
MLS Listing,,Single Family Residential,27632 Kristin Ln,Saugus,CA,91350,599999,3,2.0,BOUQ - Bouquet Canyon,1307,5307,1993,91,459,52,Active,,,http://www.redfin.com/CA/Santa-Clarita/27632-Kristin-Ln-91350/home/5929929,CRISNet,SR20080686,N,Y,34.4481566,-118.5225456
MLS Listing,,Mobile/Manufactured Home,27361 Sierra Hwy #113,Canyon Country,CA,91351,110000,2,2.0,CAN1 - Canyon Country 1,,,1994,92,,,Active,,,http://www.redfin.com/CA/Canyon-Country/27361-Sierra-Hwy-91351/unit-113/home/49732742,CRISNet,SR20080279,N,Y,34.4093776,-118.4599125
MLS Listing,,Vacant Land,0 Davenport Rd & Summit Knl,Agua Dulce,CA,91350,169000,,,ADUL - Agua Dulce,,358381,,95,,,Active,,,http://www.redfin.com/CA/Agua-Dulce/0-Vac-Davenport-Rd-Vic-SMT-91350/home/160543268,CRMLS,SB20079213,N,Y,34.4338228,-118.5155901
MLS Listing,,Single Family Residential,23957 Via Bocina,Valencia,CA,91355,725000,5,3.0,VAL1 - Valencia 1,2800,6967,1968,97,259,55,Active,,,http://www.redfin.com/CA/Santa-Clarita/23957-Via-Bocina-91355/home/6055819,CRISNet,SR20077949,N,Y,34.3822103,-118.554241
MLS Listing,,Single Family Residential,26209 Park View Rd,Valencia,CA,91355,979499,5,4.0,VSUM - Valencia Summit,3108,9740,1988,97,315,50,Active,,,http://www.redfin.com/CA/Santa-Clarita/26209-Park-View-Rd-91355/home/6072412,CRISNet,SR20076136,N,Y,34.4065959,-118.560967
MLS Listing,,Townhouse,19315 Opal Ln,Saugus,CA,91350,490000,3,2.5,PLUM - Plum Canyon,1710,116806,2005,104,287,180,Active,,,http://www.redfin.com/CA/Santa-Clarita/19315-Opal-Ln-91350/home/12282509,CRISNet,SR20072965,N,Y,34.44496,-118.473952
MLS Listing,,Multi-Family (5+ Unit),24969 Walnut St,Newhall,CA,91321,5800000,33,24.0,Downtown Newhall,20606,23924,1974,105,281,,Active,,,http://www.redfin.com/CA/Santa-Clarita/24969-Walnut-St-91321/home/6051788,TheMLS,20-571056,N,Y,34.3887626,-118.5375048
MLS Listing,,Multi-Family (5+ Unit),24862 Walnut St,Newhall,CA,91321,3600000,18,17.0,Downtown Newhall,13044,23504,1939,105,276,,Active,,,http://www.redfin.com/CA/Santa-Clarita/24862-Walnut-St-91321/home/6052064,TheMLS,20-571054,N,Y,34.3867809,-118.5345429
MLS Listing,,Multi-Family (5+ Unit),24857 Walnut St,Newhall,CA,91321,4200000,33,18.0,Downtown Newhall,16773,24395,1983,105,250,,Active,,,http://www.redfin.com/CA/Santa-Clarita/24857-Walnut-St-91321/home/6052155,TheMLS,20-571052,N,Y,34.3859912,-118.5357946
MLS Listing,,Multi-Family (5+ Unit),24817 Walnut St,Newhall,CA,91321,4400000,33,19.0,Downtown Newhall,15280,22888,1965,105,288,,Active,,,http://www.redfin.com/CA/Santa-Clarita/24817-Walnut-St-91321/home/6052197,TheMLS,20-571050,N,Y,34.3848738,-118.5350193
MLS Listing,,Multi-Family (5+ Unit),25016 Walnut St,Newhall,CA,91321,6700000,29,30.0,Downtown Newhall,21716,44518,1979,105,309,,Active,,,http://www.redfin.com/CA/Santa-Clarita/25016-Walnut-St-91321/home/6052018,TheMLS,20-571048,N,Y,34.3900764,-118.5375048
MLS Listing,,Multi-Family (5+ Unit),24842 Newhall Ave,Newhall,CA,91321,35795000,11,7.5,Downtown Newhall,124481,204175,1963,105,288,,Active,,,http://www.redfin.com/CA/Santa-Clarita/24842-Newhall-Ave-91321/home/6052179,TheMLS,20-571038,N,Y,34.3850297,-118.5363952
MLS Listing,,Single Family Residential,25064 Highspring Ave,Newhall,CA,91321,675000,4,2.0,NEW1 - Newhall 1,1815,8484,1962,109,372,,Active,,,http://www.redfin.com/CA/Newhall/25064-Highspring-Ave-91321/home/6006372,CRISNet,SR20065823,N,Y,34.3738899,-118.5492933
MLS Listing,,Condo/Co-op,24505 Town Center Dr #7310,Valencia,CA,91355,355000,1,1.0,VAL1 - Valencia 1,780,161613,2003,114,455,350,Active,,,http://www.redfin.com/CA/Santa-Clarita/24505-Town-Center-Dr-91355/unit-7310/home/12294036,CRMLS,AR20068014,N,Y,34.4188684,-118.563332
MLS Listing,,Vacant Land,0 Vac/Vic Hugo Ln/Tuthill Ln,Agua Dulce,CA,91350,199000,,,ADUL - Agua Dulce,,3283117,,117,,,Active,,,http://www.redfin.com/CA/Saugus/0-VAC-VIC-HUGO-LN-TUTHILL-91350/home/169758831,CRISNet,SR20067874,N,Y,34.413898,-118.541
MLS Listing,,Vacant Land,0 Vac/Skiff Rd/Vic Country Way,Agua Dulce,CA,91350,499000,,,ADUL - Agua Dulce,,1560000,,120,,,Active,,,http://www.redfin.com/CA/Agua-Dulce/0-Vac-Skiff-Rd-Vic-Country-WAY-91350/home/171231405,CRISNet,SR20065224,N,Y,34.4338228,-118.5155901
MLS Listing,,Single Family Residential,19102 Lauren Ln,Saugus,CA,91350,1299995,5,3.75,PLUM - Plum Canyon,2993,8544,2017,124,434,183,Active,,,http://www.redfin.com/CA/Santa-Clarita/19102-Lauren-Ln-91350/home/169917051,CRMLS,PW20062704,N,Y,34.444886,-118.470192
MLS Listing,,Vacant Land,24288 Logdell,Newhall,CA,,348800,,,NEW1 - Newhall 1,,117612,,125,,,Active,,,http://www.redfin.com/CA/Santa-Clarita/24288-Logdell-Ave-91321/home/40005145,CRISNet,SR20062929,N,Y,34.3701028,-118.5341223
MLS Listing,,Single Family Residential,19108 Point Arena Ct,Newhall,CA,91321,548000,4,2.0,NEW4 - Newhall 4,1400,10950,1966,127,391,,Active,,,http://www.redfin.com/CA/Santa-Clarita/19108-Point-Arena-Ct-91321/home/6030024,CRMLS,WS20062272,N,Y,34.3991989,-118.4681932
MLS Listing,,Mobile/Manufactured Home,20401 Soledad Canyon Rd #436,Canyon Country,CA,91351,99000,4,2.0,CAN1 - Canyon Country 1,1405,,1997,129,70,,Active,,,http://www.redfin.com/CA/Canyon-Country/20401-Soledad-Canyon-Rd-91351/unit-436/home/171171063,CRISNet,SR20061485,N,Y,34.4222741,-118.4927463
MLS Listing,,Vacant Land,0 Vac/Vic Lewis Hill Rd/Barber Rd,Agua Dulce,CA,91350,160000,,,ADUL - Agua Dulce,,450555,,134,,,Active,,,http://www.redfin.com/CA/Agua-Dulce/0-Vac-Vic-Lewis-Hill-Rd-Barber-RD-91350/home/171129670,CRISNet,SR20057487,N,Y,34.4338228,-118.5155901
MLS Listing,,Single Family Residential,26900 Mirasol St,Valencia,CA,91355,1700000,5,5.5,VALW - Valencia Woodlands,4565,10732,2002,136,372,247,Active,,,http://www.redfin.com/CA/Santa-Clarita/26900-Mirasol-St-91355/home/8100852,CRISNet,SR20056700,N,Y,34.4119176,-118.5685362
MLS Listing,,Single Family Residential,21137 Placerita Canyon Rd,Newhall,CA,91321,1550000,9,7.0,PLAC - Placerita Canyon,5674,69347,1977,137,273,,Active,,,http://www.redfin.com/CA/Newhall/21137-Placerita-Canyon-Rd-91321/home/6008443,CRISNet,SR20055822,N,Y,34.3813496,-118.5072899
MLS Listing,,Condo/Co-op,26134 Rainbow Glen Dr #44,Newhall,CA,91321,449000,2,2.0,NEW4 - Newhall 4,1254,357103,1980,138,358,371,Active,,,http://www.redfin.com/CA/Santa-Clarita/26134-Rainbow-Glen-Dr-91321/unit-44/home/171082608,CRISNet,SR20055151,N,Y,34.400301,-118.4820264
MLS Listing,,Vacant Land,28402 Bouquet Canyon Rd,Saugus,CA,91350,1500000,,,BOUQ - Bouquet Canyon,,119450,,140,,,Active,,,http://www.redfin.com/CA/Santa-Clarita/28402-Bouquet-Canyon-Rd-91350/home/5966060,CRISNet,SR20053653,N,Y,34.457725,-118.4950295
MLS Listing,,Vacant Land,1 Ensenada Rd,Green Valley,CA,91350,15000,,,LEL - Lake Elizabeth,,5890,,140,,,Active,,,http://www.redfin.com/CA/Green-Valley/1-Ensenada-RD-91350/home/171050440,CRISNet,SR20053540,N,Y,34.4338228,-118.5155901
MLS Listing,,Vacant Land,0 the old Rd,Newhall,CA,,125000,,,NEW1 - Newhall 1,,74655,,140,,,Active,,,http://www.redfin.com/CA/Newhall/0-THE-OLD-Rd-91354/home/22158973,CRISNet,SR20053316,N,Y,34.34477,-118.53008
MLS Listing,,Vacant Land,0 Vac/Elizabeth Lake Rd/Vic 60th,Leona Valley,CA,91350,117120,,,LEL - Lake Elizabeth,,1062864,,144,,,Active,,,http://www.redfin.com/CA/Leona-Valley/0-Vac-Elizabeth-Lake-Rd-Vic-60th-91350/home/171030955,CRISNet,SR20048911,N,Y,34.4338228,-118.5155901
MLS Listing,,Vacant Land,0 Vac/Godde Hill/Vic Eliz Lake Rd,Leona Valley,CA,91350,138864,,,LEL - Lake Elizabeth,,1260190,,144,,,Active,,,http://www.redfin.com/CA/Leona-Valley/0-Vac-Godde-Hill-Vic-Eliz-Lake-RD-91350/home/171030893,CRISNet,SR20048851,N,Y,34.4338228,-118.5155901
MLS Listing,,Vacant Land,0 Vac/Godde Hill Road Pav /Vic 6 St,Leona Valley,CA,91350,755568,,,LEL - Lake Elizabeth,,6856779,,144,,,Active,,,http://www.redfin.com/CA/Leona-Valley/0-Vac-Godde-Hill-Road-Pav-Vic-6-ST-91350/home/171030644,CRISNet,SR20040501,N,Y,34.4338228,-118.5155901
MLS Listing,,Vacant Land,0 Vac/Cor Agua Dulce Canyon Rd/D,Agua Dulce,CA,91350,333000,,,ADUL - Agua Dulce,,206832,,145,,,Active,,,http://www.redfin.com/CA/Agua-Dulce/0-Vac-Cor-Agua-Dulce-Canyon-Rd-D-91350/home/171018073,CRISNet,SR20040126,N,Y,34.4338228,-118.5155901
MLS Listing,,Mobile/Manufactured Home,18204 Soledad Canyon Rd #35,Canyon Country,CA,91387,70000,2,1.0,CAN1 - Canyon Country 1,,,2013,145,,,Active,,,http://www.redfin.com/CA/Canyon-Country/18204-Soledad-Cyn-Rd-91351/unit-35/home/108273499,CRISNet,SR20037407,N,Y,34.41614,-118.450388
MLS Listing,,Single Family Residential,24109 Willowbrooke Ct,Valencia,CA,91354,739900,4,3.0,CRSD - Valencia Creekside,2578,3866,2005,145,287,176,Active,,,http://www.redfin.com/CA/Santa-Clarita/24109-Willowbrooke-Ct-91354/home/8147391,CRISNet,SR20048669,N,Y,34.4418824,-118.5571594
MLS Listing,,Single Family Residential,27828 Parkvale Dr,Saugus,CA,91350,569900,4,2.0,BOUQ - Bouquet Canyon,2068,6716,1965,146,276,,Active,,,http://www.redfin.com/CA/Santa-Clarita/27828-Parkvale-Dr-91350/home/5934424,CRISNet,SR20048293,N,Y,34.4485557,-118.5030693
MLS Listing,,Townhouse,26126 Rainbow Glen Dr #40,Newhall,CA,91321,465000,3,2.0,NEW4 - Newhall 4,1469,357103,1980,146,317,371,Active,,,http://www.redfin.com/CA/Santa-Clarita/26126-Rainbow-Glen-Dr-91321/unit-40/home/6011881,CRISNet,SR20046132,N,Y,34.4003087,-118.4816986
MLS Listing,,Vacant Land,0 Vacant Lot,Newhall,CA,91321,425000,,,NEW4 - Newhall 4,,156801,,147,,,Active,,,http://www.redfin.com/CA/Santa-Clarita/Vacant-Lot-91321/home/170949959,CRISNet,SR20047015,N,Y,34.393616,-118.488165
MLS Listing,,Vacant Land,0 Fourl Rd,Newhall,CA,93543,149000,,,NEW1 - Newhall 1,,7497,,148,,,Active,,,http://www.redfin.com/CA/Newhall/0-Fourl-RD-93543/home/170939319,CRISNet,SR20046258,N,Y,34.372257,-118.555562
MLS Listing,,Vacant Land,Fourl Rd,Santa Clarita,CA,91321,149000,,,Santa Clarita,,7405,,148,,,Active,,,http://www.redfin.com/CA/Santa-Clarita/Fourl-Rd-91321/home/22148668,AVMLS,20001867,N,Y,34.371709,-118.554193
MLS Listing,,Vacant Land,0 Vac/Calle El Cavelito/Vic Mont,Green Valley,CA,91350,27000,,,LEL - Lake Elizabeth,,13702,,148,,,Active,,,http://www.redfin.com/CA/Green-Valley/0-Vac-Calle-El-Cavelito-Vic-Mont-91350/home/170936525,CRISNet,SR20043237,N,Y,34.4338228,-118.5155901
MLS Listing,,Single Family Residential,27003 Mirasol St,Valencia,CA,91355,1525000,5,5.0,VALW - Valencia Woodlands,4479,6931,2001,150,340,258,Active,,,http://www.redfin.com/CA/Santa-Clarita/27003-Mirasol-St-91355/home/8106075,CRISNet,SR20018304,N,Y,34.4143176,-118.5697302
MLS Listing,,Single Family Residential,34371 Bouquet Cyn #81,Saugus,CA,91390,110000,2,1.0,Bouquet Canyon,947,,1928,153,116,,Active,,,http://www.redfin.com/CA/Santa-Clarita/34371-Bouquet-Canyon-Rd-91350/unit-81/home/69095781,TheMLS,20-558066,N,Y,34.4186369,-118.541957
MLS Listing,,Mobile/Manufactured Home,16408 Sierra Hwy #22,Canyon Country,CA,91351,99000,2,1.0,CAN1 - Canyon Country 1,,,1973,154,,,Active,,,http://www.redfin.com/CA/Canyon-Country/16408-Sierra-Hwy-91351/unit-22/home/170665529,CRISNet,SR20041148,N,Y,34.4503595,-118.4220027
MLS Listing,,Mobile/Manufactured Home,27361 Sierra Hwy #31,Canyon Country,CA,91351,119900,3,2.0,CAN1 - Canyon Country 1,,,1989,158,,,Active,,,http://www.redfin.com/CA/Santa-Clarita/27361-Sierra-Hwy-91351/unit-31/home/170621723,CRISNet,SR20038793,N,Y,34.4102003,-118.4628645
MLS Listing,,Mobile/Manufactured Home,20401 Soledad Cyn #518,Canyon Country,CA,91351,69900,2,2.0,CAN1 - Canyon Country 1,,,1973,160,,,Active,,,http://www.redfin.com/CA/Canyon-Country/20401-Soledad-Canyon-Rd-91351/unit-518/home/170598717,CRISNet,SR20036798,N,Y,34.4222741,-118.4927463
MLS Listing,,Single Family Residential,19852 Terri Dr,Canyon Country,CA,91351,559995,3,2.5,RBGL - Rainbow Glen,1733,146375,1985,165,323,165,Active,,,http://www.redfin.com/CA/Santa-Clarita/19852-Terri-Dr-91351/home/6013794,CRISNet,SR20032728,N,Y,34.4144403,-118.4831061
MLS Listing,,Vacant Land,0 Dewolf/ Atwood,Newhall,CA,,475000,,,NEW1 - Newhall 1,,11142,,167,,,Active,,,http://www.redfin.com/CA/Santa-Clarita/DeWolf-91321/home/172257433,CRISNet,SR20031839,N,Y,34.373361,-118.5400404
MLS Listing,,Condo/Co-op,24585 Town Center Dr #4202,Valencia,CA,91355,437000,2,2.0,VAL1 - Valencia 1,1090,81656,2003,167,401,350,Active,,,http://www.redfin.com/CA/Santa-Clarita/24585-Town-Center-Dr-91355/unit-4202/home/12294037,i-Tech MLS,320000530,N,Y,34.4198665,-118.5644636
MLS Listing,,Single Family Residential,15707 Alia,Canyon Country,CA,91387,789000,5,4.0,CAN1 - Canyon Country 1,3619,5489,2006,169,218,247,Active,,,http://www.redfin.com/CA/Santa-Clarita/15707-Alia-Ct-91387/home/17237421,CRISNet,SR20028112,N,Y,34.4388577,-118.4099436
MLS Listing,,Vacant Land,90 bella Vis,Newhall,CA,,199000,,,DNEW - Downtown Newhall,,5655,,169,,,Active,,,http://www.redfin.com/CA/Santa-Clarita/Bella-Vista-Dr-91321/home/144923023,CRISNet,SR20029909,N,Y,34.3709322,-118.5507972
MLS Listing,,Single Family Residential,28163 Anvil Ct,Valencia,CA,91354,1100000,5,4.5,Valencia West Hills,3959,10888,2013,170,278,128,Active,,,http://www.redfin.com/CA/Valencia/28163-N-Anvil-Ct-91354/home/40487614,TheMLS,20-546786,N,Y,34.4508711,-118.5696989
MLS Listing,,Vacant Land,0 Vac/Mt Emma Road Pav /Vic Dust,Acton,CA,91350,199000,,,ACTO - Acton,,1713470,,172,,,Active,,,http://www.redfin.com/CA/Agua-Dulce/Mt-Emma-Rd-Pav-Vic-Dust-RD-91350/home/170169767,CRISNet,SR20017137,N,Y,34.4338228,-118.5155901
MLS Listing,,Single Family Residential,20062 Crestview Dr,Canyon Country,CA,91351,180000,3,2.0,CAN1 - Canyon Country 1,1482,3500,2001,173,121,,Active,,,http://www.redfin.com/CA/Santa-Clarita/20062-Crest-View-Dr-91351/home/21884349,CRISNet,SR20027044,N,Y,34.4291447,-118.4852617
MLS Listing,,Vacant Land,0 Vac/Cor Calle Cerritos/El Capt,Green Valley,CA,91350,25000,,,LEL - Lake Elizabeth,,7773,,176,,,Active,,,http://www.redfin.com/CA/Green-Valley/0-WATER-METER-Calle-Cerritos-El-Capitan-91350/home/146123384,CRISNet,SR20024570,N,Y,34.4338228,-118.5155901
MLS Listing,,Vacant Land,0 Vac/Cor Cerritos/Calle Hermosa,Green Valley,CA,91350,47000,,,LEL - Lake Elizabeth,,13400,,176,,,Active,,,http://www.redfin.com/CA/Green-Valley/0-Vac-Cor-Cerritos-Calle-Hermosa-91350/home/146124240,CRISNet,SR20024517,N,Y,34.4338228,-118.5155901
MLS Listing,,Vacant Land,0 Bella Vis,Newhall,CA,,299000,,,DNEW - Downtown Newhall,,9629,,178,,,Active,,,http://www.redfin.com/CA/Santa-Clarita/Bella-Vista-Dr-91321/home/144923022,CRISNet,SR20023136,N,Y,34.371392,-118.551111
MLS Listing,,Vacant Land,25035 Atwood Blvd,Newhall,CA,,125000,,,DNEW - Downtown Newhall,,7346,,178,,,Active,,,http://www.redfin.com/CA/Santa-Clarita/25035-Atwood-Blvd-91321/home/17492328,CRISNet,SR20023089,N,Y,34.3727567,-118.55397
MLS Listing,,Vacant Land,0 poppymeadow,Canyon Country,CA,,285000,,,CAN2 - Canyon Country 2,,218697,,178,,,Active,,,http://www.redfin.com/CA/Santa-Clarita/Poppy-Meadow-St-91387/home/104249688,CRISNet,SR20023052,N,Y,34.4386974,-118.3988981
MLS Listing,,Vacant Land,0 Sierra Hwy,Canyon Country,CA,91351,399000,,,CAN1 - Canyon Country 1,,30777,,180,,,Active,,,http://www.redfin.com/CA/Santa-Clarita/27534-Sierra-Hwy-91351/home/143934541,i-Tech MLS,320000249,N,Y,34.4155512,-118.456229
MLS Listing,,Mobile/Manufactured Home,18540 Soledad Canyon Rd #26 #26,Canyon Country,CA,91351,49900,2,2.0,CAN1 - Canyon Country 1,,,2005,181,,,Active,,,http://www.redfin.com/CA/Canyon-Country/18540-Soledad-Canyon-Rd-91351/unit-26/home/18970893,CRISNet,SR20020874,N,Y,34.4162727,-118.4566964
MLS Listing,,Vacant Land,1 Vac/Napa/Vic Spunky Canyon Rd,Green Valley,CA,91350,15000,,,699 - Not Defined,,4981,,181,,,Active,,,http://www.redfin.com/CA/Green-Valley/1-Calle-La-Pastura-Vic-Spunky-Canyon-Rd-91350/home/144762799,CRISNet,SR20020307,N,Y,34.4338228,-118.5155901
MLS Listing,,Vacant Land,1 Vac/Rainbow Wk/Vic Shoreline Dr,Green Valley,CA,91350,15000,,,LEL - Lake Elizabeth,,5004,,182,,,Active,,,http://www.redfin.com/CA/Green-Valley/1-Vac-Rainbow-Wk-Vic-Shoreline-Dr-91350/home/144762783,CRISNet,SR20019962,N,Y,34.4338228,-118.5155901
MLS Listing,,Vacant Land,1 Vac/Cor Chiquito/San Francisqu,Green Valley,CA,91350,15000,,,LEL - Lake Elizabeth,,6119,,182,,,Active,,,http://www.redfin.com/CA/Agua-Dulce/1-Vac-Cor-Chiquito-San-Francisqu-91350/home/171444884,CRISNet,SR20019923,N,Y,34.4338228,-118.5155901
MLS Listing,,Vacant Land,1 Vac/Calle Rososalito/Vic El Mo,Green Valley,CA,91350,10000,,,LEL - Lake Elizabeth,,5512,,182,,,Active,,,http://www.redfin.com/CA/Agua-Dulce/1-Vac-Calle-Rososalito-Vic-El-Mo-91350/home/171444883,CRISNet,SR20019810,N,Y,34.4338228,-118.5155901
MLS Listing,,Vacant Land,0 Vac/Vic Tick Canyon Rd/1 Mi N,Agua Dulce,CA,91350,50000,,,ADUL - Agua Dulce,,222557,,183,,,Active,,,http://www.redfin.com/CA/Agua-Dulce/0-TICK-CYN-Rd-91350/home/146124114,CRISNet,SR20017548,N,Y,34.4338228,-118.5155901
MLS Listing,,Vacant Land,0 Drake Pl,Canyon Country,CA,,79000,,,CAN1 - Canyon Country 1,,249586,,186,,,Active,,,http://www.redfin.com/CA/Unknown/Drake-Pl-91351/home/170436514,CRMLS,BB20017577,N,Y,34.456035,-118.4435482
MLS Listing,,Townhouse,16301 Sierra Hwy,Canyon Country,CA,91351,735000,2,2.0,CAN1 - Canyon Country 1,5291,470821,1930,189,139,,Active,,,http://www.redfin.com/CA/Canyon-Country/16301-Sierra-Hwy-91351/home/6372034,CRISNet,SR20013977,N,Y,34.4534526,-118.4252723
MLS Listing,,Vacant Land,1 Vac/Ensenada/Vic Spunky Canyon Rd,Green Valley,CA,91350,30000,,,LEL - Lake Elizabeth,,4796,,190,,,Active,,,http://www.redfin.com/CA/Green-Valley/1-Vac-Ensenada-Vic-Spunky-Canyon-Rd-91350/home/144762768,CRISNet,SR20013888,N,Y,34.4338228,-118.5155901
MLS Listing,,Vacant Land,1 Vac/Spunky Canyon Rd/Vic Prima,Green Valley,CA,91350,30000,,,LEL - Lake Elizabeth,,5409,,190,,,Active,,,http://www.redfin.com/CA/Green-Valley/1-Vac-Spunky-Canyon-Rd-Vic-Prima-91350/home/144762733,CRISNet,SR20013896,N,Y,34.4338228,-118.5155901
MLS Listing,,Single Family Residential,24835 Fourl Rd,Newhall,CA,91321,585000,4,2.0,NEW1 - Newhall 1,1500,8923,1966,192,390,,Active,,,http://www.redfin.com/CA/Santa-Clarita/24835-Fourl-Rd-91321/home/5988175,CRMLS,RS20012142,N,Y,34.3678528,-118.555219
MLS Listing,,Single Family Residential,25203 Via Sistine,Valencia,CA,91355,524000,2,2.0,VAL1 - Valencia 1,1225,5075,1968,196,428,,Active,,,http://www.redfin.com/CA/Santa-Clarita/25203-Via-Sistine-91355/home/6053118,CRISNet,SR20008171,N,Y,34.3796172,-118.5517222
MLS Listing,,Vacant Land,1 Esguerra Rd,Saugus,CA,91390,139000,,,BOUQ - Bouquet Canyon,,631542,,202,,,Active,,,http://www.redfin.com/CA/Unknown/1-Esguerra-Rd-91390/home/172342044,CRISNet,SR20004569,N,Y,34.4666023,-118.4656268
MLS Listing,,Vacant Land,0 Vac/Pozo Verde/Ensenada Road D,Green Valley,CA,91350,40000,,,LEL - Lake Elizabeth,,18685,,203,,,Active,,,http://www.redfin.com/CA/Green-Valley/0-Vac-Pozo-Verde-Ensenada-Road-D-91350/home/170226855,CRISNet,SR20004143,N,Y,34.4338228,-118.5155901
MLS Listing,,Vacant Land,15 Vac/Vic Deerglen Ln/1/4 Mi S E,Agua Dulce,CA,91350,549000,,,ADUL - Agua Dulce,,3916915,,207,,,Active,,,http://www.redfin.com/CA/Agua-Dulce/15-S-Vac-Vic-Deerglen-Ln-1-4-Mi-E-91350/home/169753771,CRISNet,SR20001529,N,Y,34.4338228,-118.5155901
MLS Listing,,Townhouse,24602 Avignon Dr,Valencia,CA,91355,820000,2,3.0,NBRG - Valencia Northbridge,2100,134841,1999,208,390,389,Active,,,http://www.redfin.com/CA/Santa-Clarita/24602-Avignon-Dr-91355/home/6075391,CRISNet,SR20000539,N,Y,34.42062,-118.566865
MLS Listing,,Multi-Family (2-4 Unit),24155 Arch St,Newhall,CA,91321,659950,4,2.0,699 - Not Defined,1552,6150,1962,246,425,,Active,,,http://www.redfin.com/CA/Santa-Clarita/24155-Arch-St-91321/home/6007807,CRISNet,SR19270218,N,Y,34.3774511,-118.5240051
MLS Listing,,Vacant Land,,Canyon Country,CA,,350000,,,699 - Not Defined,,80044,,253,,,Active,,,http://www.redfin.com/CA/Canyon-Country/Undisclosed-address-91351/home/144710029,CRISNet,SR19266083,N,Y,34.4235425,-118.4720633
MLS Listing,,Condo/Co-op,26379 Oak Highland Dr Unit A,Newhall,CA,91321,319000,2,2.0,NEW4 - Newhall 4,909,294152,1973,260,351,445,Active,,,http://www.redfin.com/CA/Santa-Clarita/26379-Oak-Highland-Dr-91321/unit-A/home/6079957,CRISNet,SR19259946,N,Y,34.4008474,-118.4782898
MLS Listing,,Mobile/Manufactured Home,18323 Soledad Canyon Rd #26,Canyon Country,CA,91387,149900,3,2.0,CAN1 - Canyon Country 1,960,,2015,263,156,,Active,,,http://www.redfin.com/CA/Santa-Clarita/18323-Soledad-Canyon-Rd-91387/unit-26/home/169753377,CRISNet,SR19261584,N,Y,34.4175278,-118.4531849
MLS Listing,,Mobile/Manufactured Home,26420 Doveweed Way #0,Saugus,CA,91350,164900,4,2.0,BOUQ - Bouquet Canyon,1809,,1996,269,91,,Active,,,http://www.redfin.com/CA/Santa-Clarita/26420-Doveweed-Way-91350/unit-0/home/22131450,CRISNet,SR19256566,N,Y,34.4191393,-118.5107945
MLS Listing,,Mobile/Manufactured Home,26505 Cockleburr Ln #0,Canyon Country,CA,91351,129000,2,2.0,CAN1 - Canyon Country 1,1678,,1977,270,77,,Active,,,http://www.redfin.com/CA/Santa-Clarita/26505-Cockleburr-LN-91351/unit-0/home/165631366,CRISNet,SR19255953,N,Y,34.4235425,-118.4720633
MLS Listing,,Vacant Land,0 Bouquet Canyon Rd,Saugus,CA,,88000,,,BOUQ - Bouquet Canyon,,43435,,286,,,Active,,,http://www.redfin.com/CA/Saugus/26859-Bouquet-Canyon-Rd-91350/home/146123210,CRISNet,SR19242731,N,Y,34.433926,-118.5299266
MLS Listing,,Vacant Land,25000 De Wolfe Rd,Newhall,CA,91321,39999,,,Newhall 1,,10018,,287,,,Active,,,http://www.redfin.com/CA/Santa-Clarita/25000-De-Wolfe-Rd-91321/home/22937614,TheMLS,19-520758,N,Y,34.370037,-118.555559
MLS Listing,,Mobile/Manufactured Home,21445 Brier Way,Saugus,CA,91350,159000,2,2.0,699 - Not Defined,,,1979,308,,,Active,,,http://www.redfin.com/CA/Santa-Clarita/21445-W-Brier-Way-91350/unit-0/home/17928970,CRISNet,SR19225342,N,Y,34.4184307,-118.5126999
MLS Listing,,Single Family Residential,19925 Shadow Island Dr,Canyon Country,CA,91351,195000,3,2.0,CAN1 - Canyon Country 1,1845,3300,1995,311,106,,Active,,,http://www.redfin.com/CA/Santa-Clarita/19925-Shadow-Island-Dr-91351/home/169146963,CRISNet,SR19225019,N,Y,34.4283525,-118.482055
MLS Listing,,Mobile/Manufactured Home,20401 soledad Canyon Rd #347,Canyon Country,CA,91351,76000,2,2.0,CAN1 - Canyon Country 1,,,1968,318,,,Active,,,http://www.redfin.com/CA/Santa-Clarita/20401-Soledad-Canyon-Rd-91351/unit-347/home/40447607,CRISNet,SR19220130,N,Y,34.4224526,-118.4895616
MLS Listing,,Vacant Land,12800 Vac/Sierra Hwy/Vic Steele Ave,Agua Dulce,CA,91350,1100000,,,ADUL - Agua Dulce,,366318,,321,,,Active,,,http://www.redfin.com/CA/Agua-Dulce/12800-Vac-Sierra-Hwy-Vic-Steele-AVE-91350/home/168983735,CRISNet,SR19216441,N,Y,34.4338228,-118.5155901
MLS Listing,,Vacant Land,0 Everett Dr,Newhall,CA,91321,115000,,,NEW1 - Newhall 1,,52439,,322,,,Active,,,http://www.redfin.com/CA/Santa-Clarita/Everett-Dr-91321/home/143322633,CRISNet,SR19216839,N,Y,34.387501,-118.538902
MLS Listing,,Mobile/Manufactured Home,23500 The Old Rd #59,Newhall,CA,91321,75000,2,1.0,NEW1 - Newhall 1,890,,1964,340,84,1200,Active,,,http://www.redfin.com/CA/Newhall/23500-The-Old-Rd-91321/unit-59/home/160370231,CRMLS,DW19200839,N,Y,34.3513344,-118.5392236
MLS Listing,,Vacant Land,24934 Old Wiley Canyon Rd,Newhall,CA,91321,59000,,,699 - Not Defined,,7234,,343,,,Active,,,http://www.redfin.com/CA/Santa-Clarita/24934-Old-Wiley-Canyon-Rd-91321/home/113166018,CRISNet,SR19199200,N,Y,34.3716105,-118.5564961
MLS Listing,,Vacant Land,0 Vac/Calle Maleza/Vic Marquita,Green Valley,CA,91350,45000,,,LEL - Lake Elizabeth,,14243,,393,,,Active,,,http://www.redfin.com/CA/Green-Valley/0-Vac-Calle-Maleza-Vic-Marquita-91350/home/167167553,CRISNet,SR19155206,N,Y,34.4338228,-118.5155901
MLS Listing,,Single Family Residential,24540 Desert Ave,Newhall,CA,91321,1924000,11,5.0,PLAC - Placerita Canyon,8920,124146,1991,400,216,,Active,,,http://www.redfin.com/CA/Newhall/24540-Desert-Ave-91321/home/8132069,CRISNet,SR19146893,N,Y,34.3803058,-118.5117153
MLS Listing,,Single Family Residential,22389 Copper Mountain Ct,Saugus,CA,91350,949000,5,4.5,RVLG - River Village,4446,7450,2015,404,213,135,Active,,,http://www.redfin.com/CA/Santa-Clarita/22389-Copper-Mountain-Ct-91350/home/22471360,i-Tech MLS,319002424,N,Y,34.4204959,-118.5196494
MLS Listing,,Vacant Land,10 AC On 77 St. West and N. of Elizabeth Lake Rd,Leona Valley,CA,91350,50999,,,LEL - Lake Elizabeth,,435047,,406,,,Active,,,http://www.redfin.com/CA/Leona-Valley/10-AC-On-77-St-West-and-N-of-Elizabeth-Lake-RD-91350/home/167106827,CRISNet,SR19143123,N,Y,34.4338228,-118.5155901
MLS Listing,,Vacant Land,28200 Ridge View Dr,Canyon Country,CA,91387,49000,,,CAN2 - Canyon Country 2,,112820,,417,,,Active,,,http://www.redfin.com/CA/Santa-Clarita/28200-Ridge-View-Dr-91387/home/143849109,CRMLS,LG19134130,N,Y,34.42465,-118.439558
MLS Listing,,Vacant Land,De Wolfe Rd,Newhall,CA,91321,22990,,,Newhall,,3886,,466,,,Active,,,http://www.redfin.com/CA/Newhall/De-Wolfe-RD-91321/home/162755998,AVMLS,19004311,N,Y,34.371537,-118.55476
MLS Listing,,Vacant Land,0 De Wolfe Rd,Newhall,CA,91321,22990,,,NEW1 - Newhall 1,,3885,,466,,,Active,,,http://www.redfin.com/CA/Newhall/0-De-Wolfe-RD-91321/home/162755283,CRISNet,SR19075851,N,Y,34.373361,-118.5400404
MLS Listing,,Vacant Land,0 Wildwood,Newhall,CA,,1250000,,,NEW1 - Newhall 1,,2557537,,523,,,Active,,,http://www.redfin.com/CA/Santa-Clarita/Wildwood-Rd-91321/home/160510154,CRISNet,SR19040186,N,Y,34.3659319,-118.5318581
MLS Listing,,Vacant Land,0 Willow Ln/Woolsey Way,Agua Dulce,CA,91350,189000,,,ADUL - Agua Dulce,,252648,,539,,,Active,,,http://www.redfin.com/CA/Agua-Dulce/0-Willow-Ln-Woolsey-Rd-91350/home/160391746,CRISNet,SR19025102,N,Y,34.4338228,-118.5155901
MLS Listing,,Vacant Land,0 Vac/Ensenada Drt /Vic Essencia,Green Valley,CA,91350,7500,,,LEL - Lake Elizabeth,,3872,,566,,,Active,,,http://www.redfin.com/CA/Green-Valley/0-Vac-Ensenada-Drt-Vic-Essencia-91350/home/148692016,CRMLS,BB19006885,N,Y,34.4338228,-118.5155901
MLS Listing,,Vacant Land,0 VAC 2848-030-015,Canyon Country,CA,,449999,,,SAND - Sand Canyon,,232125,,616,,,Active,,,http://www.redfin.com/CA/Santa-Clarita/Unknown-91351/home/148168013,CRISNet,SR18275221,N,Y,34.4235425,-118.4720633
MLS Listing,,Vacant Land,1111 Vac/Avenida Donari/Vic Camino,Agua Dulce,CA,91350,175000,,,ADUL - Agua Dulce,,231166,,692,,,Active,,,http://www.redfin.com/CA/Agua-Dulce/1111-Vac-Avenida-Donari-Vic-Camino-91350/home/55183704,CRISNet,SR18217180,N,Y,34.4338228,-118.5155901
MLS Listing,,Vacant Land,0 Baker Canyon Rd,Canyon Country,CA,91390,850000,,,CAN1 - Canyon Country 1,,1960200,,938,,,Active,,,http://www.redfin.com/CA/Agua-Dulce/Baker-Canyon-Rd-91390/home/147033583,CRISNet,SR18000704,N,Y,34.4550759,-118.4073448
MLS Listing,,Vacant Land,Rainbow Glen Dr,Newhall,CA,91321,70999,,,Newhall,,66385,,1016,,,Active,,,http://www.redfin.com/CA/Santa-Clarita/Rainbow-Glen-Dr-91321/home/145306437,AVMLS,17009904,N,Y,34.40537,-118.484684
MLS Listing,,Vacant Land,De Wolfe Rd,Newhall,CA,91322,59990,,,Newhall,,13068,,1083,,,Active,,,http://www.redfin.com/Unknown/Newhall/De-Wolfe-RD-Unknown/home/143192716,AVMLS,17007610,N,Y,34.371462,-118.554555
MLS Listing,,Vacant Land,0 De Wolf Rd,Newhall,CA,91321,95999,,,Newhall,,11325,,1085,,,Active,,,http://www.redfin.com/CA/Santa-Clarita/De-Wolf-Rd-91321/home/147033562,AVMLS,17007540,N,Y,34.371746,-118.553762
MLS Listing,,Vacant Land,0 De Wolf Rd. Newhall 91321,Valencia,CA,,30999,,,699 - Not Defined,,7272,,1134,,,Active,,,http://www.redfin.com/CA/Santa-Clarita/Unknown-91321/home/147936308,CRISNet,SR17087892,N,Y,34.373361,-118.5400404
MLS Listing,,Vacant Land,114 Vac/Old Stage Rd/Vic Escondido,Agua Dulce,CA,91350,179000,,,ADUL - Agua Dulce,,222005,,1159,,,Active,,,http://www.redfin.com/CA/Agua-Dulce/114-Vac-Old-Stage-Rd-Vic-Escondido-91350/home/145765994,CRISNet,SR17117674,N,Y,34.4338228,-118.5155901
MLS Listing,,Vacant Land,115 Vac/Old Stage Rd/Vic Escondido,Agua Dulce,CA,91350,189000,,,ADUL - Agua Dulce,,214653,,1159,,,Active,,,http://www.redfin.com/CA/Agua-Dulce/115-Vac-Old-Stage-Rd-Vic-Escondido-91350/home/114027001,CRISNet,SR17117660,N,Y,34.4338228,-118.5155901
MLS Listing,,Vacant Land,0 Vac/Vic Tyne Ct/Swallow Cl,Agua Dulce,CA,91350,890000,,,ADUL - Agua Dulce,,2692008,,1162,,,Active,,,http://www.redfin.com/CA/Agua-Dulce/0-Vac-Vic-Tyne-Ct-Swallow-Cl-91350/home/171444952,CRISNet,SR17114571,N,Y,34.4338228,-118.5155901
MLS Listing,,Vacant Land,0 De Wolfe Rd,Newhall,CA,,59990,,,NEW1 - Newhall 1,,13279,,1412,,,Active,,,http://www.redfin.com/Unknown/Santa-Clarita/De-Wolfe-RD-Unknown/home/145306132,CRISNet,SR16703482,N,Y,34.371873,-118.554699
MLS Listing,,Vacant Land,0 Spring St & Chrisco St,Sleepy Valley,CA,91350,13999,,,SLPV - Sleepy Valley,,5041,,1430,,,Active,,,http://www.redfin.com/CA/Sleepy-Valley/0-Spring-St-Chrisco-St-91350/home/124510286,CRISNet,SR16189755,N,Y,34.4338228,-118.5155901
MLS Listing,,Vacant Land,0 Spring St. & Chrisco St,Sleepy Valley,CA,91350,13999,,,SLPV - Sleepy Valley,,4976,,1430,,,Active,,,http://www.redfin.com/CA/Sleepy-Valley/0-Spring-St-Chrisco-ST-91350/home/172255433,CRISNet,SR16189749,N,Y,34.4338228,-118.5155901
MLS Listing,,Vacant Land,0 Spring Street and Chrisco St,Sleepy Valley,CA,91350,13999,,,SLPV - Sleepy Valley,,4973,,1431,,,Active,,,http://www.redfin.com/CA/Agua-Dulce/0-N-Spring-Street-Crisco-St-91350/home/112896014,CRISNet,SR16189531,N,Y,34.4338228,-118.5155901
MLS Listing,,Vacant Land,0 Rainbow Glen & Ave. of the Oaks,Newhall,CA,91321,70999,,,NEW4 - Newhall 4,,66365,,1436,,,Active,,,http://www.redfin.com/CA/Santa-Clarita/Unknown-91321/home/112896012,CRISNet,SR16185417,N,Y,34.4036139,-118.4856241
MLS Listing,,Vacant Land,0 Vac/Vic San Francisquito,Green Valley,CA,91350,19900,,,699 - Not Defined,,41270,,1877,,,Active,,,http://www.redfin.com/CA/Green-Valley/0-Vac-Vic-San-Francisquito-91350/home/113155673,CRISNet,SR15123310,N,Y,34.4338228,-118.5155901
For-Sale-by-Owner Listing,,Mobile/Manufactured Home,16274 Vasquez Canyon Rd Spc 63,Canyon Country,CA,91351,129900,3,2.0,Santa Clarita,1904,8000,1977,112,68,,Active,,,http://www.redfin.com/CA/Canyon-Country/16274-Vasquez-Canyon-Rd-91351/unit-63/home/17493987,Fizber.com,5052919,N,Y,34.4549864,-118.4242015
New Construction Home,,Single Family Residential,19144 Lauren Ln,Santa Clarita,CA,91350,1249995,5,4.5,Mirabelle at Plum Canyon,2766,,2020,98,452,,Active,,,http://www.redfin.com/CA/Santa-Clarita/19144-Lauren-Ln-91350/home/171388207,NewHomeSource.com,1868014,N,Y,34.445658,-118.47112
New Construction Plan,,Single Family Residential,Plan 4,Santa Clarita,CA,91350,616990,3,2.5,Sola,2465,,,,250,,Active,,,http://www.redfin.com/CA/Santa-Clarita/Sola/Plan-4/home/170541523,NewHomeSource.com,Plan-131771007,N,Y,34.442923,-118.465242
New Construction Plan,,Single Family Residential,Camina,Santa Clarita,CA,91350,727995,5,4.0,Victoria at Plum Canyon,2769,,,,263,,Active,,,http://www.redfin.com/CA/Santa-Clarita/Victoria-at-Plum-Canyon/Camina/home/172109243,NewHomeSource.com,Plan-131811952,N,Y,34.4451438,-118.4704459
New Construction Plan,,Single Family Residential,Ladera,Santa Clarita,CA,91350,710495,5,4.0,Victoria at Plum Canyon,2687,,,,264,,Active,,,http://www.redfin.com/CA/Santa-Clarita/Victoria-at-Plum-Canyon/Ladera/home/172109244,NewHomeSource.com,Plan-131811951,N,Y,34.4451438,-118.4704459
New Construction Plan,,Single Family Residential,Adena,Santa Clarita,CA,91350,705495,5,4.0,Victoria at Plum Canyon,2559,,,,276,,Active,,,http://www.redfin.com/CA/Santa-Clarita/Victoria-at-Plum-Canyon/Adena/home/172109246,NewHomeSource.com,Plan-131811950,N,Y,34.4451438,-118.4704459
New Construction Plan,,Single Family Residential,Mellini,Santa Clarita,CA,91350,682495,5,4.0,Sierra at Plum Canyon,2545,,,,268,,Active,,,http://www.redfin.com/CA/Santa-Clarita/Sierra-at-Plum-Canyon/Mellini/home/172109247,NewHomeSource.com,Plan-121811949,N,Y,34.4451438,-118.4704459
New Construction Plan,,Single Family Residential,Terni,Santa Clarita,CA,91350,662495,5,3.0,Sierra at Plum Canyon,2473,,,,268,,Active,,,http://www.redfin.com/CA/Santa-Clarita/Sierra-at-Plum-Canyon/Terni/home/172109248,NewHomeSource.com,Plan-121811948,N,Y,34.4451438,-118.4704459
New Construction Plan,,Single Family Residential,Cabrini,Santa Clarita,CA,91350,644995,4,3.0,Sierra at Plum Canyon,2329,,,,277,,Active,,,http://www.redfin.com/CA/Santa-Clarita/Sierra-at-Plum-Canyon/Cabrini/home/172109249,NewHomeSource.com,Plan-121811947,N,Y,34.4451438,-118.4704459
New Construction Plan,,Single Family Residential,Rimini,Santa Clarita,CA,91350,842995,5,3.5,Mirabelle at Plum Canyon,2993,,,,282,,Active,,,http://www.redfin.com/CA/Santa-Clarita/Mirabelle-at-Plum-Canyon/Rimini/home/113799633,NewHomeSource.com,Plan-121387730,N,Y,34.4451438,-118.4704459
New Construction Plan,,Single Family Residential,Plan 3,Santa Clarita,CA,91350,668990,3,2.5,Luna,2950,,,,227,,Active,,,http://www.redfin.com/CA/Santa-Clarita/Luna/Plan-3/home/171530796,NewHomeSource.com,Plan-121802529,N,Y,34.441649,-118.454357
New Construction Plan,,Single Family Residential,Plan 1,Santa Clarita,CA,91350,671990,4,2.5,Lyra,2861,,,,235,,Active,,,http://www.redfin.com/CA/Santa-Clarita/Lyra/Plan-1/home/147300490,NewHomeSource.com,Plan-121739246,N,Y,34.442923,-118.465242
New Construction Plan,,Single Family Residential,Plan 1,Santa Clarita,CA,91350,620990,3,2.0,Luna,2095,,,,296,,Active,,,http://www.redfin.com/CA/Santa-Clarita/Luna/Plan-1/home/171291935,NewHomeSource.com,Plan-121797485,N,Y,34.441649,-118.454357
New Construction Plan,,Single Family Residential,Plan 2,Santa Clarita,CA,91350,643990,3,2.5,Luna,2612,,,,247,,Active,,,http://www.redfin.com/CA/Santa-Clarita/Luna/Plan-2/home/171530795,NewHomeSource.com,Plan-121797484,N,Y,34.441649,-118.454357
New Construction Plan,,Single Family Residential,Plan 1,Santa Clarita,CA,91350,560990,3,2.5,Sola,1882,,,,298,,Active,,,http://www.redfin.com/CA/Santa-Clarita/Sola/Plan-1/home/147300487,NewHomeSource.com,Plan-121739243,N,Y,34.442923,-118.465242
