7,13,20
26,3,9
16,22,29
5,12,18
25,1,7
14,20,27
3,10,16
23,29,6
12,19,25
2,8,14
21,27,4
10,17,23
30,6,13
19,26,2
9,15,21
28,4,11
17,24,30
7,13,20
26,3,9
16,22,28
5,11,18
24,1,14
27,10,23
29,5,12
18,25,1
8,21,4
17,6,19
2,8,15
28,11,24
30,15,22
