<?xml version="1.0" encoding="UTF-8" standalone="no"?>
<!DOCTYPE svg PUBLIC "-//W3C//DTD SVG 1.1//EN" "http://www.w3.org/Graphics/SVG/1.1/DTD/svg11.dtd">
<svg width="100%" height="100%" viewBox="0 0 23 23" version="1.1" xmlns="http://www.w3.org/2000/svg" xmlns:xlink="http://www.w3.org/1999/xlink" xml:space="preserve" xmlns:serif="http://www.serif.com/" style="fill-rule:evenodd;clip-rule:evenodd;stroke-linecap:round;stroke-linejoin:round;stroke-miterlimit:1.5;">
    <g transform="matrix(1,0,0,1,-0.278208,-0.319396)">
        <g transform="matrix(1,0,0,1,-1.72179,-1.6806)">
            <g transform="matrix(-0.779444,0,0,-0.779444,7.45611,7.45611)">
                <path d="M2,4C2,2.89 2.9,2 4,2L7,2L7,4L4,4L4,7L2,7L2,4" style="fill-rule:nonzero;"/>
            </g>
            <g transform="matrix(0.779444,0,0,0.779444,2.78415,2.79394)">
                <path d="M2,4C2,2.89 2.9,2 4,2L7,2L7,4L4,4L4,7L2,7L2,4M22,4L22,7L20,7L20,4L17,4L17,2L20,2C21.097,2 22,2.903 22,4M20,20L20,17L22,17L22,20C22,21.11 21.1,22 20,22L17,22L17,20L20,20M2,20L2,17L4,17L4,20L7,20L7,22L4,22C2.903,22 2,21.097 2,20M10,2L14,2L14,4L10,4L10,2M10,20L14,20L14,22L10,22L10,20M20,10L22,10L22,14L20,14L20,10M2,10L4,10L4,14L2,14L2,10Z" style="fill-rule:nonzero;"/>
            </g>
        </g>
        <g transform="matrix(1,0,0,1,-0.199642,-0.0817799)">
            <path d="M20.263,17.89L20.263,22.294" style="fill:none;stroke:black;stroke-width:1px;"/>
        </g>
        <g transform="matrix(6.12323e-17,1,-1,6.12323e-17,40.1111,-0.252354)">
            <path d="M20.263,17.89L20.263,22.294" style="fill:none;stroke:black;stroke-width:1px;"/>
        </g>
    </g>
</svg>
