{
        "swagger": "2.0",
        "info": {
                "title": "KYKLOS Auditing System",
                "version": "1.0.0",
                "description": ""
        },
        "host": "localhost:8001",
        "basePath": "/",
        "schemes": [
                "http"
        ],
        "paths": {
                "/client/account": {
                        "post": {
                                "description": "",
                                "parameters": [],
                                "responses": {
                                        "200": {
                                                "description": "Blockchain account has been correctly created",
                                                "examples": {
                                                        "application/json": {
                                                                "status": "OK",
                                                                "address": "0x6deAc8637A7B9c831cAf44c10c1c741b83884B01",
                                                                "privatekey": "0xb71bfe0008ff26e0e3b05dc6720f503f0a963c035f9d86a591d494b019dbf6e7"
                                                        }
                                                }
                                        },
                                        "403": {
                                                "description": "Application error",
                                                "examples": {
                                                        "application/json": {
                                                                "status": "Error",
                                                                "error": "create account error"
                                                        }
                                                }
                                        }
                                }
                        },
                        "get": {
                                "description": "",
                                "parameters": [{
                                        "name": "privatekey",
                                        "in": "query",
                                        "description": "Blockchain private key",
                                        "type": "string"
                                }],
                                "responses": {
                                        "200": {
                                                "description": "Address associated to a specific Blockchain address has been correctly obtained",
                                                "examples": {
                                                        "application/json": {
                                                                "status": "OK",
                                                                "address": "0x6deAc8637A7B9c831cAf44c10c1c741b83884B01"
                                                        }
                                                }
                                        },
                                        "403": {
                                                "description": "Application error",
                                                "examples": {
                                                        "application/json": {
                                                                "status": "Error",
                                                                "error": "get account error"
                                                        }
                                                }
                                        },
                                        "400": {
                                                "description": "Parameter error",
                                                "examples": {
                                                        "application/json": {
                                                                "status": "Error",
                                                                "error": "Private key parameter is not properly defined"
                                                        }
                                                }
                                        }
                                }
                        }
                },
                "/client/subscription": {
                        "post": {
                                "description": "",
                                "parameters": [{
                                        "name": "email",
                                        "in": "query",
                                        "description": "Email to be subscribed",
                                        "type": "string"
                                }],
                                "responses": {
                                        "200": {
                                                "description": "Email has been subscribed",
                                                "examples": {
                                                        "application/json": {
                                                                "status": "OK",
                                                                "email": "cristina.regueiro@tecnalia.com"
                                                        }
                                                }
                                        },
                                        "403": {
                                                "description": "Application error",
                                                "examples": {
                                                        "application/json": {
                                                                "status": "Error",
                                                                "error": "subscribe email"
                                                        }
                                                }
                                        },
                                        "400": {
                                                "description": "Parameter error",
                                                "examples": {
                                                        "application/json": {
                                                                "status": "Error",
                                                                "error": "Email parameter is not properly defined"
                                                        }
                                                }
                                        }
                                }
                        },
                        "get": {
                                "description": "",
                                "parameters": [],
                                "responses": {
                                        "200": {
                                                "description": "Get subscribed emails",
                                                "examples": {
                                                        "application/json": {
                                                                "status": "OK",
                                                                "emails": "cristina.regueiro@tecnalia.com"
                                                        }
                                                }
                                        },
                                        "403": {
                                                "description": "Application error",
                                                "examples": {
                                                        "application/json": {
                                                                "status": "Error",
                                                                "error": "getemails error"
                                                        }
                                                }
                                        }
                                }
                        },
                        "delete": {
                                "description": "",
                                "parameters": [],
                                "responses": {
                                        "200": {
                                                "description": "Email has been unsubscribed",
                                                "examples": {
                                                        "application/json": {
                                                                "status": "OK"
                                                        }
                                                }
                                        },
                                        "403": {
                                                "description": "Application error",
                                                "examples": {
                                                        "application/json": {
                                                                "status": "Error",
                                                                "error": "remove subscribed email error"
                                                        }
                                                }
                                        },
                                        "409": {
                                                "description": "Account error",
                                                "examples": {
                                                        "application/json": {
                                                                "status": "Error",
                                                                "error": "Wallet error"
                                                        }
                                                }
                                        }
                                }
                        }
                },
                "/client/wallet": {
                        "post": {
                                "description": "",
                                "parameters": [{
                                        "name": "privatekey",
                                        "in": "query",
                                        "description": "Blockchain private key",
                                        "type": "string"
                                }],
                                "responses": {
                                        "200": {
                                                "description": "Blockchain account (address)has been correctly saved in the local wallet",
                                                "examples": {
                                                        "application/json": {
                                                                "status": "OK",
                                                                "address": "0x6deAc8637A7B9c831cAf44c10c1c741b83884B01"
                                                        }
                                                }
                                        },
                                        "403": {
                                                "description": "Application error",
                                                "examples": {
                                                        "application/json": {
                                                                "status": "Error",
                                                                "error": "add account to wallet error"
                                                        }
                                                }
                                        },
                                        "400": {
                                                "description": "Parameter error",
                                                "examples": {
                                                        "application/json": {
                                                                "status": "Error",
                                                                "error": "Private key parameter is not properly defined"
                                                        }
                                                }
                                        }
                                }
                        },
                        "get": {
                                "description": "",
                                "parameters": [],
                                "responses": {
                                        "200": {
                                                "description": "Blockchain account (address) has been correctly obtained from the local wallet",
                                                "examples": {
                                                        "application/json": {
                                                                "status": "OK",
                                                                "address": "0x6deAc8637A7B9c831cAf44c10c1c741b83884B01"
                                                        }
                                                }
                                        },
                                        "403": {
                                                "description": "Application error",
                                                "examples": {
                                                        "application/json": {
                                                                "status": "Error",
                                                                "error": "get account from wallet error"
                                                        }
                                                }
                                        }
                                }
                        }
                },
                "/client/registration": {
                        "post": {
                                "description": "",
                                "parameters": [{
                                        "name": "address",
                                        "in": "query",
                                        "description": "Blockchain address",
                                        "type": "string"
                                },
                                {
                                        "name": "email",
                                        "in": "query",
                                        "description": "Registration email",
                                        "type": "string"
                                }],
                                "responses": {
                                        "200": {
                                                "description": "Blockchain account registration has been requested",
                                                "examples": {
                                                        "application/json": {
                                                                "status": "OK",
                                                                "address": "0x6deAc8637A7B9c831cAf44c10c1c741b83884B01"
                                                        }
                                                }
                                        },
                                        "403": {
                                                "description": "Application error",
                                                "examples": {
                                                        "application/json": {
                                                                "status": "Error",
                                                                "error": "component is not registered yet"
                                                        }
                                                }
                                        }
                                }
                        }
                },
                "/client/admin": {
                        "get": {
                                "description": "",
                                "parameters": [{
                                        "name": "address",
                                        "in": "query",
                                        "description": "Blockchain address",
                                        "type": "string"
                                }],
                                "responses": {
                                        "200": {
                                                "description": "Blockchain account has or has not administrator rights",
                                                "examples": {
                                                        "application/json": {
                                                                "status": "OK",
                                                                "isadmin": "true"
                                                        }
                                                }
                                        },
                                        "403": {
                                                "description": "Application error",
                                                "examples": {
                                                        "application/json": {
                                                                "status": "Error",
                                                                "error": "isAdmin error"
                                                        }
                                                }
                                        },
                                        "400": {
                                                "description": "Parameters error",
                                                "examples": {
                                                        "application/json": {
                                                                "status": "Error",
                                                                "error": "Admin Address parameter is not properly defined"
                                                        }
                                                }
                                        },
                                        "409": {
                                                "description": "Account error",
                                                "examples": {
                                                        "application/json": {
                                                                "status": "Error",
                                                                "error": "Wallet error"
                                                        }
                                                }
                                        }
                                }
                        },
                        "post": {
                                "description": "",
                                "parameters": [{
                                        "name": "address",
                                        "in": "query",
                                        "description": "Blockchain address",
                                        "type": "string"
                                }],
                                "responses": {
                                        "200": {
                                                "description": "Blockchain account has been given administrator rights",
                                                "examples": {
                                                        "application/json": {
                                                                "status": "OK",
                                                                "address": "0x6deAc8637A7B9c831cAf44c10c1c741b83884B01"
                                                        }
                                                }
                                        },
                                        "403": {
                                                "description": "Application error",
                                                "examples": {
                                                        "application/json": {
                                                                "status": "Error",
                                                                "error": "addAmin error"
                                                        }
                                                }
                                        },
                                        "400": {
                                                "description": "Parameters error",
                                                "examples": {
                                                        "application/json": {
                                                                "status": "Error",
                                                                "error": "Admin Address parameter is not properly defined"
                                                        }
                                                }
                                        },
                                        "409": {
                                                "description": "Account error",
                                                "examples": {
                                                        "application/json": {
                                                                "status": "Error",
                                                                "error": "Wallet error"
                                                        }
                                                }
                                        }
                                }
                        },
                        "delete": {
                                "description": "",
                                "parameters": [{
                                        "name": "address",
                                        "in": "query",
                                        "description": "Blockchain address",
                                        "type": "string"
                                }],
                                "responses": {
                                        "200": {
                                                "description": "Blockchain account has been removed administrator rights",
                                                "examples": {
                                                        "application/json": {
                                                                "status": "OK",
                                                                "address": "0x6deAc8637A7B9c831cAf44c10c1c741b83884B01"
                                                        }
                                                }
                                        },
                                        "403": {
                                                "description": "Application error",
                                                "examples": {
                                                        "application/json": {
                                                                "status": "Error",
                                                                "error": "removeAdmin error"
                                                        }
                                                }
                                        },
                                        "400": {
                                                "description": "Parameters error",
                                                "examples": {
                                                        "application/json": {
                                                                "status": "Error",
                                                                "error": "Admin Address parameter is not properly defined"
                                                        }
                                                }
                                        },
                                        "409": {
                                                "description": "Account error",
                                                "examples": {
                                                        "application/json": {
                                                                "status": "Error",
                                                                "error": "Wallet error"
                                                        }
                                                }
                                        }
                                }
                        }
                },
                "/client/admins": {
                        "get": {
                                "description": "",
                                "parameters": [],
                                "responses": {
                                        "200": {
                                                "description": "Number of blockchain accounts with administrator rights",
                                                "examples": {
                                                        "application/json": {
                                                                "status": "OK",
                                                                "adminum": "2"
                                                        }
                                                }
                                        },
                                        "403": {
                                                "description": "Application error",
                                                "examples": {
                                                        "application/json": {
                                                                "status": "Error",
                                                                "error": "getadminnum error"
                                                        }
                                                }
                                        },
                                        "409": {
                                                "description": "Account error",
                                                "examples": {
                                                        "application/json": {
                                                                "status": "Error",
                                                                "error": "wallet error"
                                                        }
                                                }
                                        }
                                }
                        }
                },
                "/client/componentsnum": {
                        "get": {
                                "description": "",
                                "parameters": [],
                                "responses": {
                                        "200": {
                                                "description": "Number of registered components",
                                                "examples": {
                                                        "application/json": {
                                                                "status": "OK",
                                                                "componentnum": "2"
                                                        }
                                                }
                                        },
                                        "403": {
                                                "description": "Application error",
                                                "examples": {
                                                        "application/json": {
                                                                "status": "Error",
                                                                "error": "getcomponentnum error"
                                                        }
                                                }
                                        },
                                        "409": {
                                                "description": "Account error",
                                                "examples": {
                                                        "application/json": {
                                                                "status": "Error",
                                                                "error": "wallet error"
                                                        }
                                                }
                                        }
                                }
                        }
                },
                "/client/components": {
                        "get": {
                                "description": "",
                                "parameters": [],
                                "responses": {
                                        "200": {
                                                "description": "Get the registered components id",
                                                "examples": {
                                                        "application/json": {
                                                                "status": "OK",
                                                                "componentid": "0xa452467938a815C131B08c4590d570EfAE7dCD93"
                                                        }
                                                }
                                        },
                                        "403": {
                                                "description": "Application error",
                                                "examples": {
                                                        "application/json": {
                                                                "status": "Error",
                                                                "error": "getcomponents error"
                                                        }
                                                }
                                        },
                                        "409": {
                                                "description": "Account error",
                                                "examples": {
                                                        "application/json": {
                                                                "status": "Error",
                                                                "error": "wallet error"
                                                        }
                                                }
                                        }
                                }
                        }
                },
                "/client/authorizeduser": {
                        "get": {
                                "description": "",
                                "parameters": [],
                                "responses": {
                                        "200": {
                                                "description": "Blockchain account has or has not authorized user rights",
                                                "examples": {
                                                        "application/json": {
                                                                "status": "OK",
                                                                "useraddress": "0xa452467938a815C131B08c4590d570EfAE7dCD93"
                                                        }
                                                }
                                        },
                                        "403": {
                                                "description": "Application error",
                                                "examples": {
                                                        "application/json": {
                                                                "status": "Error",
                                                                "error": "isAuthorizeduser Error"
                                                        }
                                                }
                                        },
                                        "400": {
                                                "description": "Parameters error",
                                                "examples": {
                                                        "application/json": {
                                                                "status": "Error",
                                                                "error": "User Address parameter is not properly defined"
                                                        }
                                                }
                                        },
                                        "409": {
                                                "description": "Account error",
                                                "examples": {
                                                        "application/json": {
                                                                "status": "Error",
                                                                "error": "Wallet error"
                                                        }
                                                }
                                        }
                                }
                        },
                        "post": {
                                "description": "",
                                "parameters": [{
                                        "name": "address",
                                        "in": "query",
                                        "description": "Blockchain address",
                                        "type": "string"
                                }],
                                "responses": {
                                        "200": {
                                                "description": "Blockchain account has been given authorized user rights",
                                                "examples": {
                                                        "application/json": {
                                                                "status": "OK",
                                                                "useraddress": "0xa452467938a815C131B08c4590d570EfAE7dCD93"
                                                        }
                                                }
                                        },
                                        "403": {
                                                "description": "Application error",
                                                "examples": {
                                                        "application/json": {
                                                                "status": "Error",
                                                                "error": "addAuthorizedUser error"
                                                        }
                                                }
                                        },
                                        "400": {
                                                "description": "Parameters error",
                                                "examples": {
                                                        "application/json": {
                                                                "status": "Error",
                                                                "error": "User Address parameter is not properly defined"
                                                        }
                                                }
                                        },
                                        "409": {
                                                "description": "Account error",
                                                "examples": {
                                                        "application/json": {
                                                                "status": "Error",
                                                                "error": "Wallet error"
                                                        }
                                                }
                                        }
                                }
                        },
                        "delete": {
                                "description": "",
                                "parameters": [{
                                        "name": "address",
                                        "in": "query",
                                        "description": "Blockchain address",
                                        "type": "string"
                                }],
                                "responses": {
                                        "200": {
                                                "description": "Blockchain account has been removed authorized user rights",
                                                "examples": {
                                                        "application/json": {
                                                                "status": "OK",
                                                                "useraddress": "0xa452467938a815C131B08c4590d570EfAE7dCD93"
                                                        }
                                                }
                                        },
                                        "403": {
                                                "description": "Application error",
                                                "examples": {
                                                        "application/json": {
                                                                "status": "Error",
                                                                "error": "removeAuthorizedUser error"
                                                        }
                                                }
                                        },
                                        "400": {
                                                "description": "Parameters error",
                                                "examples": {
                                                        "application/json": {
                                                                "status": "Error",
                                                                "error": "User Address parameter is not properly defined"
                                                        }
                                                }
                                        },
                                        "409": {
                                                "description": "Account error",
                                                "examples": {
                                                        "application/json": {
                                                                "status": "Error",
                                                                "error": "Wallet error"
                                                        }
                                                }
                                        }
                                }
                        }
                },
                "/client/authorizedusers": {
                        "get": {
                                "description": "",
                                "parameters": [],
                                "responses": {
                                        "200": {
                                                "description": "Number of blockchain accounts with authorized user rights",
                                                "examples": {
                                                        "application/json": {
                                                                "status": "OK",
                                                                "ownernum": "3"
                                                        }
                                                }
                                        },
                                        "403": {
                                                "description": "Application error",
                                                "examples": {
                                                        "application/json": {
                                                                "status": "Error",
                                                                "error": "getAuthorizedUsersNum error"
                                                        }
                                                }
                                        },
                                        "409": {
                                                "description": "Account error",
                                                "examples": {
                                                        "application/json": {
                                                                "status": "Error",
                                                                "error": "Wallet error"
                                                        }
                                                }
                                        }
                                }
                        }
                },
                "/client/component": {
                        "post": {
                                "description": "",
                                "parameters": [
                                        {
                                                "name": "deployment",
                                                "in": "query",
                                                "description":  "Component associated deployment",
                                                "type": "string"
                                        },
                                        {
                                                "name": "organization",
                                                "in": "query",
                                                "description":  "Component associated organization",
                                                "type": "string"
                                        },
                                        {
                                                "name": "name",
                                                "in": "query",
                                                "description":  "Component associated name",
                                                "type": "string"
                                        },
                                        {
                                                "name": "description",
                                                "in": "query",
                                                "description":  "Component associated description",
                                                "type": "string"
                                        }
                                ],
                                "responses": {
                                        "200": {
                                                "description": "component has been correctly registered",
                                                "examples": {
                                                        "application/json": {
                                                                "status": "OK",
                                                                "componentid": "0xa452467938a815C131B08c4590d570EfAE7dCD93"
                                                        }
                                                }
                                        },
                                        "400": {
                                                "description": "Parameters error",
                                                "examples": {
                                                        "application/json": {
                                                                "status": "Error",
                                                                "error": "registercomponent: Error: Missing parameter"
                                                        }
                                                }
                                        },
                                        "403": {
                                                "description": "Application error",
                                                "examples": {
                                                        "application/json": {
                                                                "status": "Error",
                                                                "error": "register component error"
                                                        }
                                                }
                                        },
                                        "409": {
                                                "description": "Account error",
                                                "examples": {
                                                        "application/json": {
                                                                "status": "Error",
                                                                "error": "Wallet error"
                                                        }
                                                }
                                        }
                                }
                        }
                },
                "/client/component/organization": {
                        "post": {
                                "description": "",
                                "parameters": [{
                                        "name": "organization",
                                        "in": "query",
                                        "description": "Component organization",
                                        "type": "string"
                                }],
                                "responses": {
                                        "200": {
                                                "description": "Organization has been correctly registered ",
                                                "examples": {
                                                        "application/json": {
                                                                "status": "OK",
                                                                "organization": "ORG"
                                                        }
                                                }
                                        },
                                        "403": {
                                                "description": "Application error",
                                                "examples": {
                                                        "application/json": {
                                                                "status": "Error",
                                                                "error": "setorganization error"
                                                        }
                                                }
                                        },
                                        "400": {
                                                "description": "Parameters error",
                                                "examples": {
                                                        "application/json": {
                                                                "status": "Error",
                                                                "error": "organization parameter is not properly defined"
                                                        }
                                                }
                                        },
                                        "409": {
                                                "description": "Account error",
                                                "examples": {
                                                        "application/json": {
                                                                "status": "Error",
                                                                "error": "Wallet error"
                                                        }
                                                }
                                        },
                                        "401": {
                                                "description": "Registration error",
                                                "examples": {
                                                        "application/json": {
                                                                "status": "Error",
                                                                "error": "component is not registered yet"
                                                        }
                                                }
                                        }
                                }
                        },
                        "get": {
                                "description": "",
                                "parameters": [],
                                "responses": {
                                        "200": {
                                                "description": "Information associated to aq component organization",
                                                "examples": {
                                                        "application/json": {
                                                                "status": "OK",
                                                                "organization": "ORG"
                                                        }
                                                }
                                        },
                                        "403": {
                                                "description": "Application error",
                                                "examples": {
                                                        "application/json": {
                                                                "status": "Error",
                                                                "error": "getorganization error"
                                                        }
                                                }
                                        },
                                        "409": {
                                                "description": "Account error",
                                                "examples": {
                                                        "application/json": {
                                                                "status": "Error",
                                                                "error": "Wallet error"
                                                        }
                                                }
                                        },
                                        "401": {
                                                "description": "Registration error",
                                                "examples": {
                                                        "application/json": {
                                                                "status": "Error",
                                                                "error": "component is not registered yet"
                                                        }
                                                }
                                        }
                                }
                        }
                },
                "/client/component/name": {
                        "post": {
                                "description": "",
                                "parameters": [{
                                        "name": "name",
                                        "in": "query",
                                        "description": "Component name",
                                        "type": "string"
                                }],
                                "responses": {
                                        "200": {
                                                "description": "Name has been correctly registered ",
                                                "examples": {
                                                        "application/json": {
                                                                "status": "OK",
                                                                "name": "NAME"
                                                        }
                                                }
                                        },
                                        "403": {
                                                "description": "Application error",
                                                "examples": {
                                                        "application/json": {
                                                                "status": "Error",
                                                                "error": "setname error"
                                                        }
                                                }
                                        },
                                        "400": {
                                                "description": "Parameters error",
                                                "examples": {
                                                        "application/json": {
                                                                "status": "Error",
                                                                "error": "name parameter is not properly defined"
                                                        }
                                                }
                                        },
                                        "409": {
                                                "description": "Account error",
                                                "examples": {
                                                        "application/json": {
                                                                "status": "Error",
                                                                "error": "Wallet error"
                                                        }
                                                }
                                        },
                                        "401": {
                                                "description": "Registration error",
                                                "examples": {
                                                        "application/json": {
                                                                "status": "Error",
                                                                "error": "component is not registered yet"
                                                        }
                                                }
                                        }
                                }
                        },
                        "get": {
                                "description": "",
                                "parameters": [],
                                "responses": {
                                        "200": {
                                                "description": "Information associated to a component name",
                                                "examples": {
                                                        "application/json": {
                                                                "status": "OK",
                                                                "name": "NAME"
                                                        }
                                                }
                                        },
                                        "403": {
                                                "description": "Application error",
                                                "examples": {
                                                        "application/json": {
                                                                "status": "Error",
                                                                "error": "getname error"
                                                        }
                                                }
                                        },
                                        "409": {
                                                "description": "Account error",
                                                "examples": {
                                                        "application/json": {
                                                                "status": "Error",
                                                                "error": "Wallet error"
                                                        }
                                                }
                                        },
                                        "401": {
                                                "description": "Registration error",
                                                "examples": {
                                                        "application/json": {
                                                                "status": "Error",
                                                                "error": "component is not registered yet"
                                                        }
                                                }
                                        }
                                }
                        }
                },
                "/client/component/description": {
                        "post": {
                                "description": "",
                                "parameters": [{
                                        "name": "description",
                                        "in": "query",
                                        "description": "Component description",
                                        "type": "string"
                                }],
                                "responses": {
                                        "200": {
                                                "description": "Description has been correctly registered ",
                                                "examples": {
                                                        "application/json": {
                                                                "status": "OK",
                                                                "description": "DESC"
                                                        }
                                                }
                                        },
                                        "403": {
                                                "description": "Application error",
                                                "examples": {
                                                        "application/json": {
                                                                "status": "Error",
                                                                "error": "setdescription error"
                                                        }
                                                }
                                        },
                                        "400": {
                                                "description": "Parameters error",
                                                "examples": {
                                                        "application/json": {
                                                                "status": "Error",
                                                                "error": "description parameter is not properly defined"
                                                        }
                                                }
                                        },
                                        "409": {
                                                "description": "Account error",
                                                "examples": {
                                                        "application/json": {
                                                                "status": "Error",
                                                                "error": "Wallet error"
                                                        }
                                                }
                                        },
                                        "401": {
                                                "description": "Registration error",
                                                "examples": {
                                                        "application/json": {
                                                                "status": "Error",
                                                                "error": "component is not registered yet"
                                                        }
                                                }
                                        }
                                }
                        },
                        "get": {
                                "description": "",
                                "parameters": [],
                                "responses": {
                                        "200": {
                                                "description": "Information associated to a component description",
                                                "examples": {
                                                        "application/json": {
                                                                "status": "OK",
                                                                "description": "DESC"
                                                        }
                                                }
                                        },
                                        "403": {
                                                "description": "Application error",
                                                "examples": {
                                                        "application/json": {
                                                                "status": "Error",
                                                                "error": "getdescription error"
                                                        }
                                                }
                                        },
                                        "409": {
                                                "description": "Account error",
                                                "examples": {
                                                        "application/json": {
                                                                "status": "Error",
                                                                "error": "Wallet error"
                                                        }
                                                }
                                        },
                                        "401": {
                                                "description": "Registration error",
                                                "examples": {
                                                        "application/json": {
                                                                "status": "Error",
                                                                "error": "component is not registered yet"
                                                        }
                                                }
                                        }
                                }
                        }
                },
                "/client/component/deployment": {
                        "post": {
                                "description": "",
                                "parameters": [{
                                        "name": "deployment",
                                        "in": "query",
                                        "description": "Component deployment",
                                        "type": "string"
                                }],
                                "responses": {
                                        "200": {
                                                "description": "Deployment has been correctly registered ",
                                                "examples": {
                                                        "application/json": {
                                                                "status": "OK",
                                                                "deployment": "DEP"
                                                        }
                                                }
                                        },
                                        "403": {
                                                "description": "Application error",
                                                "examples": {
                                                        "application/json": {
                                                                "status": "Error",
                                                                "error": "setdeployment error"
                                                        }
                                                }
                                        },
                                        "400": {
                                                "description": "Parameters error",
                                                "examples": {
                                                        "application/json": {
                                                                "status": "Error",
                                                                "error": "deployment parameter is not properly defined"
                                                        }
                                                }
                                        },
                                        "409": {
                                                "description": "Account error",
                                                "examples": {
                                                        "application/json": {
                                                                "status": "Error",
                                                                "error": "Wallet error"
                                                        }
                                                }
                                        },
                                        "401": {
                                                "description": "Registration error",
                                                "examples": {
                                                        "application/json": {
                                                                "status": "Error",
                                                                "error": "component is not registered yet"
                                                        }
                                                }
                                        }
                                }
                        },
                        "get": {
                                "description": "",
                                "parameters": [],
                                "responses": {
                                        "200": {
                                                "description": "Information associated to a component deployment",
                                                "examples": {
                                                        "application/json": {
                                                                "status": "OK",
                                                                "deployment": "DEP"
                                                        }
                                                }
                                        },
                                        "403": {
                                                "description": "Application error",
                                                "examples": {
                                                        "application/json": {
                                                                "status": "Error",
                                                                "error": "getDescription error"
                                                        }
                                                }
                                        },
                                        "409": {
                                                "description": "Account error",
                                                "examples": {
                                                        "application/json": {
                                                                "status": "Error",
                                                                "error": "Wallet error"
                                                        }
                                                }
                                        },
                                        "401": {
                                                "description": "Registration error",
                                                "examples": {
                                                        "application/json": {
                                                                "status": "Error",
                                                                "error": "component is not registered yet"
                                                        }
                                                }
                                        }
                                }
                        }
                },

                "/client/component/feature": {
                        "post": {
                                "description": "",
                                "parameters": [{
                                                "name": "name",
                                                "in": "query",
                                                "description": "Feature variable name",
                                                "type": "string"
                                        },
                                        {
                                                "name": "value",
                                                "in": "query",
                                                "description": "Feature variable value",
                                                "type": "string"
                                        }
                                ],
                                "responses": {
                                        "200": {
                                                "description": "Feature has been correctly registered",
                                                "examples": {
                                                        "application/json": {
                                                                "status": "OK",
                                                                "componentFeatureName": "temperature",
                                                                "componentFeatureValue": "30"
                                                        }
                                                }
                                        },
                                        "403": {
                                                "description": "Application error",
                                                "examples": {
                                                        "application/json": {
                                                                "status": "Error",
                                                                "error": "setfeature error"
                                                        }
                                                }
                                        },
                                        "400": {
                                                "description": "Parameters error",
                                                "examples": {
                                                        "application/json": {
                                                                "status": "Error",
                                                                "error": "value parameter is not properly defined"
                                                        }
                                                }
                                        },
                                        "409": {
                                                "description": "Account error",
                                                "examples": {
                                                        "application/json": {
                                                                "status": "Error",
                                                                "error": "Wallet error"
                                                        }
                                                }
                                        },
                                        "401": {
                                                "description": "Registration error",
                                                "examples": {
                                                        "application/json": {
                                                                "status": "Error",
                                                                "error": "component is not registered yet"
                                                        }
                                                }
                                        }
                                }
                        }
                },
                "/client/component/feature/{value}": {
                        "get": {
                                "description": "",
                                "parameters": [{
                                        "name": "value",
                                        "in": "path",
                                        "description": "Feature name",
                                        "required": true,
                                        "type": "string"
                                }],
                                "responses": {
                                        "200": {
                                                "description": "Information associated to an evidence id",
                                                "examples": {
                                                        "application/json": {
                                                                "status": "OK",
                                                                "featureValue": "30"
                                                        }
                                                }
                                        },
                                        "403": {
                                                "description": "Application error",
                                                "examples": {
                                                        "application/json": {
                                                                "status": "Error",
                                                                "error": "getfeature error"
                                                        }
                                                }
                                        },
                                        "400": {
                                                "description": "Parameters error",
                                                "examples": {
                                                        "application/json": {
                                                                "status": "Error",
                                                                "error": "value parameter is not properly defined"
                                                        }
                                                }
                                        },
                                        "409": {
                                                "description": "Account error",
                                                "examples": {
                                                        "application/json": {
                                                                "status": "Error",
                                                                "error": "Wallet error"
                                                        }
                                                }
                                        },
                                        "401": {
                                                "description": "Registration error",
                                                "examples": {
                                                        "application/json": {
                                                                "status": "Error",
                                                                "error": "component is not registered yet"
                                                        }
                                                }
                                        }
                                }
                        }
                },
                "/client/component/features": {
                        "get": {
                                "description": "",
                                "parameters": [],
                                "responses": {
                                        "200": {
                                                "description": "Registered features names",
                                                "examples": {
                                                        "application/json": {
                                                                "status": "OK",
                                                                "features": "temperature, humidity"
                                                        }
                                                }
                                        },
                                        "403": {
                                                "description": "Application error",
                                                "examples": {
                                                        "application/json": {
                                                                "status": "Error",
                                                                "error": "getfeatures error"
                                                        }
                                                }
                                        },
                                        "409": {
                                                "description": "Account error",
                                                "examples": {
                                                        "application/json": {
                                                                "status": "Error",
                                                                "error": "Wallet error"
                                                        }
                                                }
                                        },
                                        "401": {
                                                "description": "Registration error",
                                                "examples": {
                                                        "application/json": {
                                                                "status": "Error",
                                                                "error": "component is not registered yet"
                                                        }
                                                }
                                        }
                                }
                        }
                },
                "/client/component/owner": {
                        "get": {
                                "description": "",
                                "parameters": [],
                                "responses": {
                                        "200": {
                                                "description": "Blockchain address of the component owner (authorized user)",
                                                "examples": {
                                                        "application/json": {
                                                                "status": "OK",
                                                                "owner": "0x6deAc8637A7B9c831cAf44c10c1c741b83884B01"
                                                        }
                                                }
                                        },
                                        "403": {
                                                "description": "Application error",
                                                "examples": {
                                                        "application/json": {
                                                                "status": "Error",
                                                                "error": "getowner error"
                                                        }
                                                }
                                        },
                                        "409": {
                                                "description": "Account error",
                                                "examples": {
                                                        "application/json": {
                                                                "status": "Error",
                                                                "error": "Wallet error"
                                                        }
                                                }
                                        },
                                        "401": {
                                                "description": "Registration error",
                                                "examples": {
                                                        "application/json": {
                                                                "status": "Error",
                                                                "error": "component is not registered yet"
                                                        }
                                                }
                                        }
                                }
                        }
                },
                "/client/component/creationtime": {
                        "get": {
                                "description": "",
                                "parameters": [],
                                "responses": {
                                        "200": {
                                                "description": "component Registration time",
                                                "examples": {
                                                        "application/json": {
                                                                "status": "OK",
                                                                "creationtime": "1633587655151352261"
                                                        }
                                                }
                                        },
                                        "403": {
                                                "description": "Application error",
                                                "examples": {
                                                        "application/json": {
                                                                "status": "Error",
                                                                "error": "getcreationtime error"
                                                        }
                                                }
                                        },
                                        "409": {
                                                "description": "Account error",
                                                "examples": {
                                                        "application/json": {
                                                                "status": "Error",
                                                                "error": "Wallet error"
                                                        }
                                                }
                                        },
                                        "401": {
                                                "description": "Registration error",
                                                "examples": {
                                                        "application/json": {
                                                                "status": "Error",
                                                                "error": "component is not registered yet"
                                                        }
                                                }
                                        }
                                }
                        }
                },
                "/client/component/updatedtime": {
                        "get": {
                                "description": "",
                                "parameters": [],
                                "responses": {
                                        "200": {
                                                "description": "component Updated time",
                                                "examples": {
                                                        "application/json": {
                                                                "status": "OK",
                                                                "updatedtime": "1633587655151352261"
                                                        }
                                                }
                                        },
                                        "403": {
                                                "description": "Application error",
                                                "examples": {
                                                        "application/json": {
                                                                "status": "Error",
                                                                "error": "getupdatedtime error"
                                                        }
                                                }
                                        },
                                        "409": {
                                                "description": "Account error",
                                                "examples": {
                                                        "application/json": {
                                                                "status": "Error",
                                                                "error": "Wallet error"
                                                        }
                                                }
                                        },
                                        "401": {
                                                "description": "Registration error",
                                                "examples": {
                                                        "application/json": {
                                                                "status": "Error",
                                                                "error": "component is not registered yet"
                                                        }
                                                }
                                        }
                                }
                        }
                },
                "/client/component/id": {
                        "get": {
                                "description": "",
                                "parameters": [],
                                "responses": {
                                        "200": {
                                                "description": "component id",
                                                "examples": {
                                                        "application/json": {
                                                                "status": "OK",
                                                                "id": "0x0dE4b77C6683Bd29fAa3fa8FCDdCEf1b2F3aef8b"
                                                        }
                                                }
                                        },
                                        "403": {
                                                "description": "Application error",
                                                "examples": {
                                                        "application/json": {
                                                                "status": "Error",
                                                                "error": "getid error"
                                                        }
                                                }
                                        },
                                        "409": {
                                                "description": "Account error",
                                                "examples": {
                                                        "application/json": {
                                                                "status": "Error",
                                                                "error": "Wallet error"
                                                        }
                                                }
                                        },
                                        "401": {
                                                "description": "Registration error",
                                                "examples": {
                                                        "application/json": {
                                                                "status": "Error",
                                                                "error": "component is not registered yet"
                                                        }
                                                }
                                        }
                                }
                        }
                }
        }
}
