%YAML 1.1
%TAG !u! tag:unity3d.com,2011:
--- !u!114 &-3555300453139727710
MonoBehaviour:
  m_ObjectHideFlags: 0
  m_CorrespondingSourceObject: {fileID: 0}
  m_PrefabInstance: {fileID: 0}
  m_PrefabAsset: {fileID: 0}
  m_GameObject: {fileID: 865551027952004961}
  m_Enabled: 1
  m_EditorHideFlags: 0
  m_Script: {fileID: 11500000, guid: 6b2094ac194dc442db7e3dbaa8310b49, type: 3}
  m_Name: 
  m_EditorClassIdentifier: 
--- !u!1001 &9139479332388260387
PrefabInstance:
  m_ObjectHideFlags: 0
  serializedVersion: 2
  m_Modification:
    m_TransformParent: {fileID: 0}
    m_Modifications:
    - target: {fileID: 1131488781830237606, guid: 125273347d0244a6184ec6b004503543,
        type: 3}
      propertyPath: m_OnClick.m_PersistentCalls.m_Calls.Array.size
      value: 1
      objectReference: {fileID: 0}
    - target: {fileID: 1131488781830237606, guid: 125273347d0244a6184ec6b004503543,
        type: 3}
      propertyPath: m_OnClick.m_PersistentCalls.m_Calls.Array.data[0].m_Mode
      value: 1
      objectReference: {fileID: 0}
    - target: {fileID: 1131488781830237606, guid: 125273347d0244a6184ec6b004503543,
        type: 3}
      propertyPath: m_OnClick.m_PersistentCalls.m_Calls.Array.data[0].m_CallState
      value: 2
      objectReference: {fileID: 0}
    - target: {fileID: 1131488781830237606, guid: 125273347d0244a6184ec6b004503543,
        type: 3}
      propertyPath: m_OnClick.m_PersistentCalls.m_Calls.Array.data[0].m_Target
      value: 
      objectReference: {fileID: -3555300453139727710}
    - target: {fileID: 1131488781830237606, guid: 125273347d0244a6184ec6b004503543,
        type: 3}
      propertyPath: m_OnClick.m_PersistentCalls.m_Calls.Array.data[0].m_MethodName
      value: OnSettingsButtonClicked
      objectReference: {fileID: 0}
    - target: {fileID: 1131488781830237606, guid: 125273347d0244a6184ec6b004503543,
        type: 3}
      propertyPath: m_OnClick.m_PersistentCalls.m_Calls.Array.data[0].m_Arguments.m_ObjectArgumentAssemblyTypeName
      value: UnityEngine.Object, UnityEngine
      objectReference: {fileID: 0}
    - target: {fileID: 1310842221306552349, guid: 125273347d0244a6184ec6b004503543,
        type: 3}
      propertyPath: m_LocalPosition.x
      value: 0
      objectReference: {fileID: 0}
    - target: {fileID: 1310842221306552349, guid: 125273347d0244a6184ec6b004503543,
        type: 3}
      propertyPath: m_LocalPosition.y
      value: 0
      objectReference: {fileID: 0}
    - target: {fileID: 1310842221306552349, guid: 125273347d0244a6184ec6b004503543,
        type: 3}
      propertyPath: m_LocalPosition.z
      value: 0
      objectReference: {fileID: 0}
    - target: {fileID: 1310842221306552349, guid: 125273347d0244a6184ec6b004503543,
        type: 3}
      propertyPath: m_LocalRotation.x
      value: -0
      objectReference: {fileID: 0}
    - target: {fileID: 1310842221306552349, guid: 125273347d0244a6184ec6b004503543,
        type: 3}
      propertyPath: m_LocalRotation.y
      value: -0
      objectReference: {fileID: 0}
    - target: {fileID: 1310842221306552349, guid: 125273347d0244a6184ec6b004503543,
        type: 3}
      propertyPath: m_LocalRotation.z
      value: -0
      objectReference: {fileID: 0}
    - target: {fileID: 1310842221306552349, guid: 125273347d0244a6184ec6b004503543,
        type: 3}
      propertyPath: m_LocalRotation.w
      value: 1
      objectReference: {fileID: 0}
    - target: {fileID: 1310842221306552349, guid: 125273347d0244a6184ec6b004503543,
        type: 3}
      propertyPath: m_RootOrder
      value: 0
      objectReference: {fileID: 0}
    - target: {fileID: 1310842221306552349, guid: 125273347d0244a6184ec6b004503543,
        type: 3}
      propertyPath: m_LocalEulerAnglesHint.x
      value: 0
      objectReference: {fileID: 0}
    - target: {fileID: 1310842221306552349, guid: 125273347d0244a6184ec6b004503543,
        type: 3}
      propertyPath: m_LocalEulerAnglesHint.y
      value: 0
      objectReference: {fileID: 0}
    - target: {fileID: 1310842221306552349, guid: 125273347d0244a6184ec6b004503543,
        type: 3}
      propertyPath: m_LocalEulerAnglesHint.z
      value: 0
      objectReference: {fileID: 0}
    - target: {fileID: 1310842221306552349, guid: 125273347d0244a6184ec6b004503543,
        type: 3}
      propertyPath: m_AnchoredPosition.x
      value: 25
      objectReference: {fileID: 0}
    - target: {fileID: 1310842221306552349, guid: 125273347d0244a6184ec6b004503543,
        type: 3}
      propertyPath: m_AnchoredPosition.y
      value: -25
      objectReference: {fileID: 0}
    - target: {fileID: 1310842221306552349, guid: 125273347d0244a6184ec6b004503543,
        type: 3}
      propertyPath: m_SizeDelta.x
      value: 0
      objectReference: {fileID: 0}
    - target: {fileID: 1310842221306552349, guid: 125273347d0244a6184ec6b004503543,
        type: 3}
      propertyPath: m_SizeDelta.y
      value: 0
      objectReference: {fileID: 0}
    - target: {fileID: 1310842221306552349, guid: 125273347d0244a6184ec6b004503543,
        type: 3}
      propertyPath: m_AnchorMin.x
      value: 0
      objectReference: {fileID: 0}
    - target: {fileID: 1310842221306552349, guid: 125273347d0244a6184ec6b004503543,
        type: 3}
      propertyPath: m_AnchorMin.y
      value: 1
      objectReference: {fileID: 0}
    - target: {fileID: 1310842221306552349, guid: 125273347d0244a6184ec6b004503543,
        type: 3}
      propertyPath: m_AnchorMax.x
      value: 0
      objectReference: {fileID: 0}
    - target: {fileID: 1310842221306552349, guid: 125273347d0244a6184ec6b004503543,
        type: 3}
      propertyPath: m_AnchorMax.y
      value: 1
      objectReference: {fileID: 0}
    - target: {fileID: 1310842221306552349, guid: 125273347d0244a6184ec6b004503543,
        type: 3}
      propertyPath: m_Pivot.x
      value: 0
      objectReference: {fileID: 0}
    - target: {fileID: 1310842221306552349, guid: 125273347d0244a6184ec6b004503543,
        type: 3}
      propertyPath: m_Pivot.y
      value: 1
      objectReference: {fileID: 0}
    - target: {fileID: 3614480060640098146, guid: 125273347d0244a6184ec6b004503543,
        type: 3}
      propertyPath: m_AnchorMin.y
      value: 0
      objectReference: {fileID: 0}
    - target: {fileID: 3614480060640098146, guid: 125273347d0244a6184ec6b004503543,
        type: 3}
      propertyPath: m_AnchorMax.y
      value: 0
      objectReference: {fileID: 0}
    - target: {fileID: 3614480060640098146, guid: 125273347d0244a6184ec6b004503543,
        type: 3}
      propertyPath: m_AnchoredPosition.x
      value: 0
      objectReference: {fileID: 0}
    - target: {fileID: 3614480060640098146, guid: 125273347d0244a6184ec6b004503543,
        type: 3}
      propertyPath: m_AnchoredPosition.y
      value: 0
      objectReference: {fileID: 0}
    - target: {fileID: 3614480060640098146, guid: 125273347d0244a6184ec6b004503543,
        type: 3}
      propertyPath: m_SizeDelta.x
      value: 0
      objectReference: {fileID: 0}
    - target: {fileID: 3614480060640098146, guid: 125273347d0244a6184ec6b004503543,
        type: 3}
      propertyPath: m_SizeDelta.y
      value: 0
      objectReference: {fileID: 0}
    - target: {fileID: 8275076335237031234, guid: 125273347d0244a6184ec6b004503543,
        type: 3}
      propertyPath: m_Name
      value: SettingsButton
      objectReference: {fileID: 0}
    m_RemovedComponents: []
  m_SourcePrefab: {fileID: 100100000, guid: 125273347d0244a6184ec6b004503543, type: 3}
--- !u!1 &865551027952004961 stripped
GameObject:
  m_CorrespondingSourceObject: {fileID: 8275076335237031234, guid: 125273347d0244a6184ec6b004503543,
    type: 3}
  m_PrefabInstance: {fileID: 9139479332388260387}
  m_PrefabAsset: {fileID: 0}
