%YAML 1.1
%TAG !u! tag:unity3d.com,2011:
--- !u!1 &1496217208839004
GameObject:
  m_ObjectHideFlags: 0
  m_CorrespondingSourceObject: {fileID: 0}
  m_PrefabInstance: {fileID: 0}
  m_PrefabAsset: {fileID: 0}
  serializedVersion: 6
  m_Component:
  - component: {fileID: 224311703493296600}
  - component: {fileID: 225635037302740292}
  - component: {fileID: 114591655854953058}
  m_Layer: 5
  m_Name: FailView
  m_TagString: Untagged
  m_Icon: {fileID: 0}
  m_NavMeshLayer: 0
  m_StaticEditorFlags: 0
  m_IsActive: 1
--- !u!224 &224311703493296600
RectTransform:
  m_ObjectHideFlags: 0
  m_CorrespondingSourceObject: {fileID: 0}
  m_PrefabInstance: {fileID: 0}
  m_PrefabAsset: {fileID: 0}
  m_GameObject: {fileID: 1496217208839004}
  m_LocalRotation: {x: 0, y: 0, z: 0, w: 1}
  m_LocalPosition: {x: 0, y: 0, z: 0}
  m_LocalScale: {x: 1, y: 1, z: 1}
  m_Children:
  - {fileID: 3964997678416921389}
  m_Father: {fileID: 0}
  m_RootOrder: 0
  m_LocalEulerAnglesHint: {x: 0, y: 0, z: 0}
  m_AnchorMin: {x: 0, y: 0}
  m_AnchorMax: {x: 1, y: 1}
  m_AnchoredPosition: {x: 0, y: 0}
  m_SizeDelta: {x: 0, y: 0}
  m_Pivot: {x: 0.5, y: 0.5}
--- !u!225 &225635037302740292
CanvasGroup:
  m_ObjectHideFlags: 0
  m_CorrespondingSourceObject: {fileID: 0}
  m_PrefabInstance: {fileID: 0}
  m_PrefabAsset: {fileID: 0}
  m_GameObject: {fileID: 1496217208839004}
  m_Enabled: 1
  m_Alpha: 1
  m_Interactable: 1
  m_BlocksRaycasts: 1
  m_IgnoreParentGroups: 0
--- !u!114 &114591655854953058
MonoBehaviour:
  m_ObjectHideFlags: 0
  m_CorrespondingSourceObject: {fileID: 0}
  m_PrefabInstance: {fileID: 0}
  m_PrefabAsset: {fileID: 0}
  m_GameObject: {fileID: 1496217208839004}
  m_Enabled: 1
  m_EditorHideFlags: 0
  m_Script: {fileID: 11500000, guid: f39a1a57090ca431db3c5d795e248d6a, type: 3}
  m_Name: 
  m_EditorClassIdentifier: 
  m_viewId: 3
  m_fadingTime: 0.2
  m_timeBeforeAppearance: 0
  m_timeAfterDisappearance: 0
--- !u!1001 &1114773273
PrefabInstance:
  m_ObjectHideFlags: 0
  serializedVersion: 2
  m_Modification:
    m_TransformParent: {fileID: 224311703493296600}
    m_Modifications:
    - target: {fileID: 160727186737542511, guid: d2c30ad0eb5fc4f228ab403f370b0476,
        type: 3}
      propertyPath: m_AnchorMin.y
      value: 0
      objectReference: {fileID: 0}
    - target: {fileID: 160727186737542511, guid: d2c30ad0eb5fc4f228ab403f370b0476,
        type: 3}
      propertyPath: m_AnchorMax.y
      value: 0
      objectReference: {fileID: 0}
    - target: {fileID: 160727186737542511, guid: d2c30ad0eb5fc4f228ab403f370b0476,
        type: 3}
      propertyPath: m_AnchoredPosition.x
      value: 0
      objectReference: {fileID: 0}
    - target: {fileID: 160727186737542511, guid: d2c30ad0eb5fc4f228ab403f370b0476,
        type: 3}
      propertyPath: m_AnchoredPosition.y
      value: 0
      objectReference: {fileID: 0}
    - target: {fileID: 160727186737542511, guid: d2c30ad0eb5fc4f228ab403f370b0476,
        type: 3}
      propertyPath: m_SizeDelta.x
      value: 0
      objectReference: {fileID: 0}
    - target: {fileID: 160727186737542511, guid: d2c30ad0eb5fc4f228ab403f370b0476,
        type: 3}
      propertyPath: m_SizeDelta.y
      value: 0
      objectReference: {fileID: 0}
    - target: {fileID: 558403524771750663, guid: d2c30ad0eb5fc4f228ab403f370b0476,
        type: 3}
      propertyPath: m_Padding.m_Left
      value: 100
      objectReference: {fileID: 0}
    - target: {fileID: 558403524771750663, guid: d2c30ad0eb5fc4f228ab403f370b0476,
        type: 3}
      propertyPath: m_Padding.m_Right
      value: 100
      objectReference: {fileID: 0}
    - target: {fileID: 2625117448929279967, guid: d2c30ad0eb5fc4f228ab403f370b0476,
        type: 3}
      propertyPath: m_textInfo.characterCount
      value: 5
      objectReference: {fileID: 0}
    - target: {fileID: 2625117448929279967, guid: d2c30ad0eb5fc4f228ab403f370b0476,
        type: 3}
      propertyPath: m_textInfo.spaceCount
      value: 0
      objectReference: {fileID: 0}
    - target: {fileID: 2625117448929279967, guid: d2c30ad0eb5fc4f228ab403f370b0476,
        type: 3}
      propertyPath: m_textInfo.wordCount
      value: 1
      objectReference: {fileID: 0}
    - target: {fileID: 2625117448929279967, guid: d2c30ad0eb5fc4f228ab403f370b0476,
        type: 3}
      propertyPath: m_textInfo.lineCount
      value: 1
      objectReference: {fileID: 0}
    - target: {fileID: 2625117448929279967, guid: d2c30ad0eb5fc4f228ab403f370b0476,
        type: 3}
      propertyPath: m_textInfo.pageCount
      value: 1
      objectReference: {fileID: 0}
    - target: {fileID: 2625117448929279967, guid: d2c30ad0eb5fc4f228ab403f370b0476,
        type: 3}
      propertyPath: m_text
      value: RETRY
      objectReference: {fileID: 0}
    - target: {fileID: 2625117448929279967, guid: d2c30ad0eb5fc4f228ab403f370b0476,
        type: 3}
      propertyPath: m_firstOverflowCharacterIndex
      value: -1
      objectReference: {fileID: 0}
    - target: {fileID: 2625117448929279967, guid: d2c30ad0eb5fc4f228ab403f370b0476,
        type: 3}
      propertyPath: m_fontSize
      value: 50
      objectReference: {fileID: 0}
    - target: {fileID: 2625117448929279967, guid: d2c30ad0eb5fc4f228ab403f370b0476,
        type: 3}
      propertyPath: m_fontSizeBase
      value: 50
      objectReference: {fileID: 0}
    - target: {fileID: 3063669727334439311, guid: d2c30ad0eb5fc4f228ab403f370b0476,
        type: 3}
      propertyPath: m_OnClick.m_PersistentCalls.m_Calls.Array.size
      value: 1
      objectReference: {fileID: 0}
    - target: {fileID: 3063669727334439311, guid: d2c30ad0eb5fc4f228ab403f370b0476,
        type: 3}
      propertyPath: m_OnClick.m_PersistentCalls.m_Calls.Array.data[0].m_Mode
      value: 1
      objectReference: {fileID: 0}
    - target: {fileID: 3063669727334439311, guid: d2c30ad0eb5fc4f228ab403f370b0476,
        type: 3}
      propertyPath: m_OnClick.m_PersistentCalls.m_Calls.Array.data[0].m_CallState
      value: 2
      objectReference: {fileID: 0}
    - target: {fileID: 3063669727334439311, guid: d2c30ad0eb5fc4f228ab403f370b0476,
        type: 3}
      propertyPath: m_OnClick.m_PersistentCalls.m_Calls.Array.data[0].m_Target
      value: 
      objectReference: {fileID: 114591655854953058}
    - target: {fileID: 3063669727334439311, guid: d2c30ad0eb5fc4f228ab403f370b0476,
        type: 3}
      propertyPath: m_OnClick.m_PersistentCalls.m_Calls.Array.data[0].m_MethodName
      value: OnRetryGameButtonClicked
      objectReference: {fileID: 0}
    - target: {fileID: 3063669727334439311, guid: d2c30ad0eb5fc4f228ab403f370b0476,
        type: 3}
      propertyPath: m_OnClick.m_PersistentCalls.m_Calls.Array.data[0].m_Arguments.m_ObjectArgumentAssemblyTypeName
      value: UnityEngine.Object, UnityEngine
      objectReference: {fileID: 0}
    - target: {fileID: 3964997679523042356, guid: d2c30ad0eb5fc4f228ab403f370b0476,
        type: 3}
      propertyPath: m_LocalPosition.x
      value: 0
      objectReference: {fileID: 0}
    - target: {fileID: 3964997679523042356, guid: d2c30ad0eb5fc4f228ab403f370b0476,
        type: 3}
      propertyPath: m_LocalPosition.y
      value: 0
      objectReference: {fileID: 0}
    - target: {fileID: 3964997679523042356, guid: d2c30ad0eb5fc4f228ab403f370b0476,
        type: 3}
      propertyPath: m_LocalPosition.z
      value: 0
      objectReference: {fileID: 0}
    - target: {fileID: 3964997679523042356, guid: d2c30ad0eb5fc4f228ab403f370b0476,
        type: 3}
      propertyPath: m_LocalRotation.x
      value: -0
      objectReference: {fileID: 0}
    - target: {fileID: 3964997679523042356, guid: d2c30ad0eb5fc4f228ab403f370b0476,
        type: 3}
      propertyPath: m_LocalRotation.y
      value: -0
      objectReference: {fileID: 0}
    - target: {fileID: 3964997679523042356, guid: d2c30ad0eb5fc4f228ab403f370b0476,
        type: 3}
      propertyPath: m_LocalRotation.z
      value: -0
      objectReference: {fileID: 0}
    - target: {fileID: 3964997679523042356, guid: d2c30ad0eb5fc4f228ab403f370b0476,
        type: 3}
      propertyPath: m_LocalRotation.w
      value: 1
      objectReference: {fileID: 0}
    - target: {fileID: 3964997679523042356, guid: d2c30ad0eb5fc4f228ab403f370b0476,
        type: 3}
      propertyPath: m_RootOrder
      value: 0
      objectReference: {fileID: 0}
    - target: {fileID: 3964997679523042356, guid: d2c30ad0eb5fc4f228ab403f370b0476,
        type: 3}
      propertyPath: m_LocalEulerAnglesHint.x
      value: 0
      objectReference: {fileID: 0}
    - target: {fileID: 3964997679523042356, guid: d2c30ad0eb5fc4f228ab403f370b0476,
        type: 3}
      propertyPath: m_LocalEulerAnglesHint.y
      value: 0
      objectReference: {fileID: 0}
    - target: {fileID: 3964997679523042356, guid: d2c30ad0eb5fc4f228ab403f370b0476,
        type: 3}
      propertyPath: m_LocalEulerAnglesHint.z
      value: 0
      objectReference: {fileID: 0}
    - target: {fileID: 3964997679523042356, guid: d2c30ad0eb5fc4f228ab403f370b0476,
        type: 3}
      propertyPath: m_AnchoredPosition.x
      value: 0
      objectReference: {fileID: 0}
    - target: {fileID: 3964997679523042356, guid: d2c30ad0eb5fc4f228ab403f370b0476,
        type: 3}
      propertyPath: m_AnchoredPosition.y
      value: 0
      objectReference: {fileID: 0}
    - target: {fileID: 3964997679523042356, guid: d2c30ad0eb5fc4f228ab403f370b0476,
        type: 3}
      propertyPath: m_SizeDelta.x
      value: 0
      objectReference: {fileID: 0}
    - target: {fileID: 3964997679523042356, guid: d2c30ad0eb5fc4f228ab403f370b0476,
        type: 3}
      propertyPath: m_SizeDelta.y
      value: 0
      objectReference: {fileID: 0}
    - target: {fileID: 3964997679523042356, guid: d2c30ad0eb5fc4f228ab403f370b0476,
        type: 3}
      propertyPath: m_AnchorMin.x
      value: 0.5
      objectReference: {fileID: 0}
    - target: {fileID: 3964997679523042356, guid: d2c30ad0eb5fc4f228ab403f370b0476,
        type: 3}
      propertyPath: m_AnchorMin.y
      value: 0.5
      objectReference: {fileID: 0}
    - target: {fileID: 3964997679523042356, guid: d2c30ad0eb5fc4f228ab403f370b0476,
        type: 3}
      propertyPath: m_AnchorMax.x
      value: 0.5
      objectReference: {fileID: 0}
    - target: {fileID: 3964997679523042356, guid: d2c30ad0eb5fc4f228ab403f370b0476,
        type: 3}
      propertyPath: m_AnchorMax.y
      value: 0.5
      objectReference: {fileID: 0}
    - target: {fileID: 3964997679523042356, guid: d2c30ad0eb5fc4f228ab403f370b0476,
        type: 3}
      propertyPath: m_Pivot.x
      value: 0.5
      objectReference: {fileID: 0}
    - target: {fileID: 3964997679523042356, guid: d2c30ad0eb5fc4f228ab403f370b0476,
        type: 3}
      propertyPath: m_Pivot.y
      value: 0.5
      objectReference: {fileID: 0}
    - target: {fileID: 6332472820533875051, guid: d2c30ad0eb5fc4f228ab403f370b0476,
        type: 3}
      propertyPath: m_Name
      value: RetryButton
      objectReference: {fileID: 0}
    m_RemovedComponents: []
  m_SourcePrefab: {fileID: 100100000, guid: d2c30ad0eb5fc4f228ab403f370b0476, type: 3}
--- !u!224 &3964997678416921389 stripped
RectTransform:
  m_CorrespondingSourceObject: {fileID: 3964997679523042356, guid: d2c30ad0eb5fc4f228ab403f370b0476,
    type: 3}
  m_PrefabInstance: {fileID: 1114773273}
  m_PrefabAsset: {fileID: 0}
