{
    "version": "0.1.0",
    "project": {
        "type": "rest",
        "tech": "typescript",
        "name": "RESTServerProjectTemplate",
        "root": ".",
        "author": {
            "fullName": "App Developer",
            "first": "App",
            "last": "Developer",
            "email": "support@example.com"
        },
        "copyright": "App Developer",
        "copyrightEmail": "developer@gmail.com",
        "license": {
            "identifier": "Apache-2.0 WITH LLVM-exception OR MIT",
            "name": "(Apache-2.0 WITH LLVM-exception OR MIT) Dual License"
        },
        "repository": "https://gitlab.com/kwaeri/node-kit-templates/projects/api/typescript"
    }
}
