{
    "version": "0.1.0",
    "mail":   {
        "fromaddress": "noreply@example.com",
        "transport": "SMTP",
        "service": {
            "provider": "Gmail",
            "authentication": {
                "user": "test@gmail.com",
                "pass": "password"
            }
        }
    },
}

