{
    "version": "0.1.0",
    "project": {
        "type": "api",
        "tech": "javascript",
        "name": "RESTServerProjectJavascriptTemplate",
        "root": ".",
        "repository": "https://gitlab.com/kwaeri/node-kit-templates/projects/api/javascript",
        "author": {
            "fullName": "App Developer",
            "first": "App",
            "last": "Developer",
            "email": "support@example.com"
        },
        "copyright": "App Developer"
    }
}

